^C:\USERS\VITOR\DESKTOP\UTFPR\IC\CUDARAYTRACING\PROJETO\FUNCOES.CPP
/c /I"C:\PROGRAM FILES\NVIDIA GPU COMPUTING TOOLKIT\CUDA\V8.0\INCLUDE" /Zi /nologo /W3 /WX- /O2 /Oi /Oy- /GL /D WIN32 /D NDEBUG /D _CONSOLE /D _MBCS /Gm- /EHsc /MD /GS /Gy /fp:precise /Zc:wchar_t /Zc:forScope /Zc:inline /Fo"RELEASE\\" /Fd"RELEASE\VC140.PDB" /Gd /TP /analyze- C:\USERS\VITOR\DESKTOP\UTFPR\IC\CUDARAYTRACING\PROJETO\FUNCOES.CPP
^C:\USERS\VITOR\DOCUMENTS\GIT\CUDARAYTRACING\PROJETO\FUNCOES.CPP
/c /I"C:\PROGRAM FILES\NVIDIA GPU COMPUTING TOOLKIT\CUDA\V8.0\INCLUDE" /Zi /nologo /W3 /WX- /O2 /Oi /Oy- /GL /D WIN32 /D NDEBUG /D _CONSOLE /D _MBCS /Gm- /EHsc /MD /GS /Gy /fp:precise /Zc:wchar_t /Zc:forScope /Zc:inline /Fo"RELEASE\\" /Fd"RELEASE\VC140.PDB" /Gd /TP /analyze- C:\USERS\VITOR\DOCUMENTS\GIT\CUDARAYTRACING\PROJETO\FUNCOES.CPP
^C:\USERS\VITOR\DOCUMENTS\GIT\CUDARAYTRACING\PROJETO\TESTERAYTRACING\SRC\CUDA\FUNCOES.CPP
/c /I"C:\PROGRAM FILES\NVIDIA GPU COMPUTING TOOLKIT\CUDA\V8.0\INCLUDE" /Zi /nologo /W3 /WX- /O2 /Oi /Oy- /GL /D WIN32 /D NDEBUG /D _CONSOLE /D _MBCS /Gm- /EHsc /MD /GS /Gy /fp:precise /Zc:wchar_t /Zc:forScope /Zc:inline /Fo"RELEASE\\" /Fd"RELEASE\VC140.PDB" /Gd /TP /analyze- C:\USERS\VITOR\DOCUMENTS\GIT\CUDARAYTRACING\PROJETO\TESTERAYTRACING\SRC\CUDA\FUNCOES.CPP
^C:\USERS\VITOR\DOCUMENTS\GIT\CUDARAYTRACING\PROJETO\TESTERAYTRACING\SRC\VISUALIZACAO\VISUALIZACAO.CPP
/c /I"C:\PROGRAM FILES\NVIDIA GPU COMPUTING TOOLKIT\CUDA\V8.0\INCLUDE" /Zi /nologo /W3 /WX- /O2 /Oi /Oy- /GL /D WIN32 /D NDEBUG /D _CONSOLE /D _MBCS /Gm- /EHsc /MD /GS /Gy /fp:precise /Zc:wchar_t /Zc:forScope /Zc:inline /Fo"RELEASE\\" /Fd"RELEASE\VC140.PDB" /Gd /TP /analyze- C:\USERS\VITOR\DOCUMENTS\GIT\CUDARAYTRACING\PROJETO\TESTERAYTRACING\SRC\VISUALIZACAO\VISUALIZACAO.CPP
