﻿  testeOpenGL.cpp
testeOpenGL.cpp(60): warning C4305: 'argument': truncation from 'double' to 'GLfloat'
testeOpenGL.cpp(74): warning C4305: 'argument': truncation from 'double' to 'GLfloat'
testeOpenGL.cpp(45): warning C4477: 'printf' : format string '%.3f' requires an argument of type 'double', but variadic argument 1 has type 'float *'
testeOpenGL.cpp(45): warning C4477: 'printf' : format string '%.3f' requires an argument of type 'double', but variadic argument 2 has type 'float *'
testeOpenGL.cpp(45): warning C4477: 'printf' : format string '%.3f' requires an argument of type 'double', but variadic argument 3 has type 'float *'
testeOpenGL.cpp(45): warning C4477: 'printf' : format string '%.3f' requires an argument of type 'double', but variadic argument 4 has type 'float *'
testeOpenGL.cpp(45): warning C4477: 'printf' : format string '%.3f' requires an argument of type 'double', but variadic argument 5 has type 'float *'
testeOpenGL.cpp(45): warning C4477: 'printf' : format string '%.3f' requires an argument of type 'double', but variadic argument 6 has type 'float *'
testeOpenGL.cpp(49): warning C4477: 'printf' : format string '%.3f' requires an argument of type 'double', but variadic argument 1 has type 'float *'
testeOpenGL.cpp(49): warning C4477: 'printf' : format string '%.3f' requires an argument of type 'double', but variadic argument 2 has type 'float *'
testeOpenGL.cpp(49): warning C4477: 'printf' : format string '%.3f' requires an argument of type 'double', but variadic argument 3 has type 'float *'
testeOpenGL.cpp(49): warning C4477: 'printf' : format string '%.3f' requires an argument of type 'double', but variadic argument 4 has type 'float *'
testeOpenGL.cpp(49): warning C4477: 'printf' : format string '%.3f' requires an argument of type 'double', but variadic argument 5 has type 'float *'
testeOpenGL.cpp(49): warning C4477: 'printf' : format string '%.3f' requires an argument of type 'double', but variadic argument 6 has type 'float *'
testeOpenGL.cpp(91): warning C4244: 'initializing': conversion from 'double' to 'float', possible loss of data
testeOpenGL.cpp(158): warning C4244: '=': conversion from 'double' to 'float', possible loss of data
testeOpenGL.cpp(159): warning C4244: '=': conversion from 'double' to 'float', possible loss of data
testeOpenGL.cpp(168): warning C4244: '=': conversion from 'double' to 'float', possible loss of data
testeOpenGL.cpp(169): warning C4244: '=': conversion from 'double' to 'float', possible loss of data
testeOpenGL.cpp(174): warning C4244: '+=': conversion from 'float' to 'int', possible loss of data
testeOpenGL.cpp(175): warning C4244: '+=': conversion from 'float' to 'int', possible loss of data
  Generating code
  14 of 14 functions (100.0%) were compiled, the rest were copied from previous compilation.
    9 functions were new in current compilation
    0 functions had inline decision re-evaluated but remain unchanged
  Finished generating code
  testeOpenGL.vcxproj -> C:\Users\Vitor\Documents\Git\CudaRayTracing\projeto\Release\testeOpenGL.exe
  testeOpenGL.vcxproj -> C:\Users\Vitor\Documents\Git\CudaRayTracing\projeto\Release\testeOpenGL.pdb (Full PDB)
