^C:\USERS\VITOR\DOCUMENTS\VISUAL STUDIO 2015\PROJECTS\TESTEOPENGL\TESTEOPENGL.CPP
/c /ZI /nologo /W3 /WX- /sdl /Od /D _MBCS /Gm /EHsc /RTC1 /MDd /GS /fp:precise /Zc:wchar_t /Zc:forScope /Zc:inline /Fo"X64\DEBUG\\" /Fd"X64\DEBUG\VC140.PDB" /Gd /TP C:\USERS\VITOR\DOCUMENTS\VISUAL STUDIO 2015\PROJECTS\TESTEOPENGL\TESTEOPENGL.CPP
^C:\USERS\VITOR\DOCUMENTS\GIT\CUDARAYTRACING\OUTROS\TESTEOPENGL\TESTEOPENGL.CPP
/c /ZI /nologo /W3 /WX- /sdl /Od /D _MBCS /Gm /EHsc /RTC1 /MDd /GS /fp:precise /Zc:wchar_t /Zc:forScope /Zc:inline /Fo"X64\DEBUG\\" /Fd"X64\DEBUG\VC140.PDB" /Gd /TP C:\USERS\VITOR\DOCUMENTS\GIT\CUDARAYTRACING\OUTROS\TESTEOPENGL\TESTEOPENGL.CPP
