Library\Bee\artifacts\mvdfrm\UnityEditor.UI.ref.dll_4A1431B674D5E419.mvfrm
Library\Bee\artifacts\mvdfrm\UnityEngine.UI.ref.dll_067A08117AF80C84.mvfrm
Library\Bee\artifacts\mvdfrm\Unity.Burst.Cecil.dll_5ED9F177C9C4F51E.mvfrm
Library\Bee\artifacts\mvdfrm\Unity.Burst.Cecil.Mdb.dll_9D90F14A066D8FDB.mvfrm
Library\Bee\artifacts\mvdfrm\Unity.Burst.Cecil.Pdb.dll_B4E369B98522915E.mvfrm
Library\Bee\artifacts\mvdfrm\Unity.Burst.Cecil.Rocks.dll_E1823E6FD310093E.mvfrm
Library\Bee\artifacts\mvdfrm\Unity.Burst.Unsafe.dll_AB0496AD4F8B8215.mvfrm
Library\Bee\artifacts\mvdfrm\Unity.Plastic.Antlr3.Runtime.dll_AF4BE0F30BC879CB.mvfrm
Library\Bee\artifacts\mvdfrm\Unity.Plastic.Newtonsoft.Json.dll_69921377A546253A.mvfrm
Library\Bee\artifacts\mvdfrm\Unity.VisualScripting.IonicZip.dll_95AB8C2179EBAA37.mvfrm
Library\Bee\artifacts\mvdfrm\Unity.VisualScripting.YamlDotNet.dll_901F668410F94075.mvfrm
Library\Bee\artifacts\mvdfrm\Unity.VisualScripting.TextureAssets.dll_273D8FD7D1C69E6D.mvfrm
Library\Bee\artifacts\mvdfrm\Unity.VisualScripting.Antlr3.Runtime.dll_418C8D6541C25094.mvfrm
Library\Bee\artifacts\mvdfrm\UnityEditor.Graphs.dll_53B010C464A2EB45.mvfrm
Library\Bee\artifacts\mvdfrm\UnityEditor.CoreModule.dll_8ADA4FD61F583413.mvfrm
Library\Bee\artifacts\mvdfrm\UnityEditor.DeviceSimulatorModule.dll_DECEC6C42535BB1E.mvfrm
Library\Bee\artifacts\mvdfrm\UnityEditor.DiagnosticsModule.dll_3A47628C548CF5EC.mvfrm
Library\Bee\artifacts\mvdfrm\UnityEditor.dll_AB19CB15A99C1912.mvfrm
Library\Bee\artifacts\mvdfrm\UnityEditor.GraphViewModule.dll_5EF6A68C6F929443.mvfrm
Library\Bee\artifacts\mvdfrm\UnityEditor.PackageManagerUIModule.dll_3B122938A357B7AF.mvfrm
Library\Bee\artifacts\mvdfrm\UnityEditor.QuickSearchModule.dll_C556E399AD63F245.mvfrm
Library\Bee\artifacts\mvdfrm\UnityEditor.SceneTemplateModule.dll_5705C800F0255B66.mvfrm
Library\Bee\artifacts\mvdfrm\UnityEditor.TextCoreFontEngineModule.dll_48326E35997CB431.mvfrm
Library\Bee\artifacts\mvdfrm\UnityEditor.TextCoreTextEngineModule.dll_901AA4A729006D4F.mvfrm
Library\Bee\artifacts\mvdfrm\UnityEditor.UIBuilderModule.dll_B37F53A8E24B0D77.mvfrm
Library\Bee\artifacts\mvdfrm\UnityEditor.UIElementsModule.dll_0940A446F585186F.mvfrm
Library\Bee\artifacts\mvdfrm\UnityEditor.UIElementsSamplesModule.dll_CE689C16A4F384EE.mvfrm
Library\Bee\artifacts\mvdfrm\UnityEditor.UIServiceModule.dll_EC71650BCB825D91.mvfrm
Library\Bee\artifacts\mvdfrm\UnityEditor.UnityConnectModule.dll_EF96A37A2DDBEC49.mvfrm
Library\Bee\artifacts\mvdfrm\UnityEngine.AccessibilityModule.dll_89AB3397F09B8303.mvfrm
Library\Bee\artifacts\mvdfrm\UnityEngine.AIModule.dll_431C82AF4A95BE07.mvfrm
Library\Bee\artifacts\mvdfrm\UnityEngine.AndroidJNIModule.dll_87898D1A3EA48745.mvfrm
Library\Bee\artifacts\mvdfrm\UnityEngine.AnimationModule.dll_2D7C22B549EF68E9.mvfrm
Library\Bee\artifacts\mvdfrm\UnityEngine.ARModule.dll_FC8F47B2A7B31CD0.mvfrm
Library\Bee\artifacts\mvdfrm\UnityEngine.AssetBundleModule.dll_0940168B0FCAA737.mvfrm
Library\Bee\artifacts\mvdfrm\UnityEngine.AudioModule.dll_0E7D6B7AF32AE79B.mvfrm
Library\Bee\artifacts\mvdfrm\UnityEngine.ClothModule.dll_7565C875CD47C67F.mvfrm
Library\Bee\artifacts\mvdfrm\UnityEngine.ClusterInputModule.dll_6F33188FDF63BF0F.mvfrm
Library\Bee\artifacts\mvdfrm\UnityEngine.ClusterRendererModule.dll_E47B893594F0C8A2.mvfrm
Library\Bee\artifacts\mvdfrm\UnityEngine.CoreModule.dll_ADFB2328C75D9F3E.mvfrm
Library\Bee\artifacts\mvdfrm\UnityEngine.CrashReportingModule.dll_F36D4650E4792596.mvfrm
Library\Bee\artifacts\mvdfrm\UnityEngine.DirectorModule.dll_26E0C207A932CCDB.mvfrm
Library\Bee\artifacts\mvdfrm\UnityEngine.dll_DDBE11EE080FA5F7.mvfrm
Library\Bee\artifacts\mvdfrm\UnityEngine.DSPGraphModule.dll_2C3223711B939DFC.mvfrm
Library\Bee\artifacts\mvdfrm\UnityEngine.GameCenterModule.dll_B1D6D73504E57836.mvfrm
Library\Bee\artifacts\mvdfrm\UnityEngine.GIModule.dll_DB58CBBCE644A621.mvfrm
Library\Bee\artifacts\mvdfrm\UnityEngine.GridModule.dll_8B6C3F16DFB23535.mvfrm
Library\Bee\artifacts\mvdfrm\UnityEngine.HotReloadModule.dll_AEC4E0BB2522846B.mvfrm
Library\Bee\artifacts\mvdfrm\UnityEngine.ImageConversionModule.dll_506D86E617158096.mvfrm
Library\Bee\artifacts\mvdfrm\UnityEngine.IMGUIModule.dll_46DD0AE1B95C7B7C.mvfrm
Library\Bee\artifacts\mvdfrm\UnityEngine.InputLegacyModule.dll_9A8531A9A7BC5D28.mvfrm
Library\Bee\artifacts\mvdfrm\UnityEngine.InputModule.dll_74F3332B69630C3F.mvfrm
Library\Bee\artifacts\mvdfrm\UnityEngine.JSONSerializeModule.dll_E9C2BCD3EFD6E38D.mvfrm
Library\Bee\artifacts\mvdfrm\UnityEngine.LocalizationModule.dll_AD7FE2E276DFB208.mvfrm
Library\Bee\artifacts\mvdfrm\UnityEngine.ParticleSystemModule.dll_467F8F9D528AB124.mvfrm
Library\Bee\artifacts\mvdfrm\UnityEngine.PerformanceReportingModule.dll_9E2F63811A87F1FD.mvfrm
Library\Bee\artifacts\mvdfrm\UnityEngine.Physics2DModule.dll_7A2212A5EAEC607E.mvfrm
Library\Bee\artifacts\mvdfrm\UnityEngine.PhysicsModule.dll_9E7B08C821F263CC.mvfrm
Library\Bee\artifacts\mvdfrm\UnityEngine.ProfilerModule.dll_5926FB3E428C53E8.mvfrm
Library\Bee\artifacts\mvdfrm\UnityEngine.RuntimeInitializeOnLoadManagerInitializerModule.dll_F7A81F259D87CD47.mvfrm
Library\Bee\artifacts\mvdfrm\UnityEngine.ScreenCaptureModule.dll_03AA6A5904430FEF.mvfrm
Library\Bee\artifacts\mvdfrm\UnityEngine.SharedInternalsModule.dll_D47EC5BB8E437BE6.mvfrm
Library\Bee\artifacts\mvdfrm\UnityEngine.SpriteMaskModule.dll_9B0349C526550DB0.mvfrm
Library\Bee\artifacts\mvdfrm\UnityEngine.SpriteShapeModule.dll_22A143E5C56CDF41.mvfrm
Library\Bee\artifacts\mvdfrm\UnityEngine.StreamingModule.dll_E211100599772027.mvfrm
Library\Bee\artifacts\mvdfrm\UnityEngine.SubstanceModule.dll_BEBC244EE4CA1E35.mvfrm
Library\Bee\artifacts\mvdfrm\UnityEngine.SubsystemsModule.dll_05B0B026F49CF5C3.mvfrm
Library\Bee\artifacts\mvdfrm\UnityEngine.TerrainModule.dll_B8C18436F7B0ACBA.mvfrm
Library\Bee\artifacts\mvdfrm\UnityEngine.TerrainPhysicsModule.dll_46FA38706BCDABB1.mvfrm
Library\Bee\artifacts\mvdfrm\UnityEngine.TextCoreFontEngineModule.dll_C691E988AC7A72FC.mvfrm
Library\Bee\artifacts\mvdfrm\UnityEngine.TextCoreTextEngineModule.dll_0E7A1FFA3BFE2C1A.mvfrm
Library\Bee\artifacts\mvdfrm\UnityEngine.TextRenderingModule.dll_2CE9DC63BB7A8FE4.mvfrm
Library\Bee\artifacts\mvdfrm\UnityEngine.TilemapModule.dll_57BDEBB80F6D8DC3.mvfrm
Library\Bee\artifacts\mvdfrm\UnityEngine.TLSModule.dll_0493426DFB2CE1A0.mvfrm
Library\Bee\artifacts\mvdfrm\UnityEngine.UIElementsModule.dll_09EF118EF7C931BA.mvfrm
Library\Bee\artifacts\mvdfrm\UnityEngine.UIElementsNativeModule.dll_858BDDCE14D027D1.mvfrm
Library\Bee\artifacts\mvdfrm\UnityEngine.UIModule.dll_3E9020DCA6DCC3B3.mvfrm
Library\Bee\artifacts\mvdfrm\UnityEngine.UmbraModule.dll_895217938051930E.mvfrm
Library\Bee\artifacts\mvdfrm\UnityEngine.UNETModule.dll_40A16B12146C94B7.mvfrm
Library\Bee\artifacts\mvdfrm\UnityEngine.UnityAnalyticsCommonModule.dll_396E20C53470905B.mvfrm
Library\Bee\artifacts\mvdfrm\UnityEngine.UnityAnalyticsModule.dll_661F0066FEB20320.mvfrm
Library\Bee\artifacts\mvdfrm\UnityEngine.UnityConnectModule.dll_DCF627892863ECF4.mvfrm
Library\Bee\artifacts\mvdfrm\UnityEngine.UnityCurlModule.dll_6098C3E6BA035AD6.mvfrm
Library\Bee\artifacts\mvdfrm\UnityEngine.UnityTestProtocolModule.dll_8A2B5208FEEEDA44.mvfrm
Library\Bee\artifacts\mvdfrm\UnityEngine.UnityWebRequestAssetBundleModule.dll_596633C413797DF1.mvfrm
Library\Bee\artifacts\mvdfrm\UnityEngine.UnityWebRequestAudioModule.dll_162BB75FA0F2BC95.mvfrm
Library\Bee\artifacts\mvdfrm\UnityEngine.UnityWebRequestModule.dll_620C8E90220A1B15.mvfrm
Library\Bee\artifacts\mvdfrm\UnityEngine.UnityWebRequestTextureModule.dll_A0D4E27369F8E70A.mvfrm
Library\Bee\artifacts\mvdfrm\UnityEngine.UnityWebRequestWWWModule.dll_D93C65562BBDE886.mvfrm
Library\Bee\artifacts\mvdfrm\UnityEngine.VehiclesModule.dll_9EA3BB87235C9C76.mvfrm
Library\Bee\artifacts\mvdfrm\UnityEngine.VFXModule.dll_8571DADCD19A4B0D.mvfrm
Library\Bee\artifacts\mvdfrm\UnityEngine.VideoModule.dll_3386EFE5B5BD0340.mvfrm
Library\Bee\artifacts\mvdfrm\UnityEngine.VirtualTexturingModule.dll_AA18923CED7EA85C.mvfrm
Library\Bee\artifacts\mvdfrm\UnityEngine.VRModule.dll_916247624897492B.mvfrm
Library\Bee\artifacts\mvdfrm\UnityEngine.WindModule.dll_2449FE5158941DA7.mvfrm
Library\Bee\artifacts\mvdfrm\UnityEngine.XRModule.dll_C4210A66D1D19689.mvfrm
Library\Bee\artifacts\mvdfrm\UnityEditor.WebGL.Extensions.dll_9604F4CB3C5D9B4D.mvfrm
Library\Bee\artifacts\mvdfrm\UnityEditor.WindowsStandalone.Extensions.dll_1B944CEA512979BD.mvfrm