Library\Bee\artifacts\mvdfrm\UnityEngine.UI.ref.dll_FAE6DBEA21006BE5.mvfrm
Library\Bee\artifacts\mvdfrm\Unity.Burst.Cecil.dll_5ED9F177C9C4F51E.mvfrm
Library\Bee\artifacts\mvdfrm\Unity.Burst.Cecil.Mdb.dll_9D90F14A066D8FDB.mvfrm
Library\Bee\artifacts\mvdfrm\Unity.Burst.Cecil.Pdb.dll_B4E369B98522915E.mvfrm
Library\Bee\artifacts\mvdfrm\Unity.Burst.Cecil.Rocks.dll_E1823E6FD310093E.mvfrm
Library\Bee\artifacts\mvdfrm\Unity.Burst.Unsafe.dll_AB0496AD4F8B8215.mvfrm
Library\Bee\artifacts\mvdfrm\Unity.VisualScripting.Antlr3.Runtime.dll_418C8D6541C25094.mvfrm
Library\Bee\artifacts\mvdfrm\UnityEngine.AccessibilityModule.dll_D9D2EDF8006D5F8B.mvfrm
Library\Bee\artifacts\mvdfrm\UnityEngine.AIModule.dll_1C0B30852E623AFF.mvfrm
Library\Bee\artifacts\mvdfrm\UnityEngine.AndroidJNIModule.dll_E1D1876C2C77803D.mvfrm
Library\Bee\artifacts\mvdfrm\UnityEngine.AnimationModule.dll_986E28C39D4AE371.mvfrm
Library\Bee\artifacts\mvdfrm\UnityEngine.ARModule.dll_D57DF5888B7F99C8.mvfrm
Library\Bee\artifacts\mvdfrm\UnityEngine.AssetBundleModule.dll_F11E660B1F4242BF.mvfrm
Library\Bee\artifacts\mvdfrm\UnityEngine.AudioModule.dll_1D6ECDBA99788023.mvfrm
Library\Bee\artifacts\mvdfrm\UnityEngine.ClothModule.dll_84572AB573955F07.mvfrm
Library\Bee\artifacts\mvdfrm\UnityEngine.ClusterInputModule.dll_9807667111740707.mvfrm
Library\Bee\artifacts\mvdfrm\UnityEngine.ClusterRendererModule.dll_CB5A91C72C5F062A.mvfrm
Library\Bee\artifacts\mvdfrm\UnityEngine.CoreModule.dll_AFCBB00BFB7FEB36.mvfrm
Library\Bee\artifacts\mvdfrm\UnityEngine.CrashReportingModule.dll_6C8FE0A7B1169C8E.mvfrm
Library\Bee\artifacts\mvdfrm\UnityEngine.DirectorModule.dll_82B22E48EDDC56D3.mvfrm
Library\Bee\artifacts\mvdfrm\UnityEngine.dll_C3E25DC49E66987F.mvfrm
Library\Bee\artifacts\mvdfrm\UnityEngine.DSPGraphModule.dll_88038FB2603D27F4.mvfrm
Library\Bee\artifacts\mvdfrm\UnityEngine.GameCenterModule.dll_0C1ED186F2B8712E.mvfrm
Library\Bee\artifacts\mvdfrm\UnityEngine.GIModule.dll_B4477992CA112319.mvfrm
Library\Bee\artifacts\mvdfrm\UnityEngine.GridModule.dll_8D3CCBFA13D4812D.mvfrm
Library\Bee\artifacts\mvdfrm\UnityEngine.HotReloadModule.dll_19B6E6C9787DFEF3.mvfrm
Library\Bee\artifacts\mvdfrm\UnityEngine.ImageConversionModule.dll_374C8F77AE83BE1E.mvfrm
Library\Bee\artifacts\mvdfrm\UnityEngine.IMGUIModule.dll_55CE6D215FAA1404.mvfrm
Library\Bee\artifacts\mvdfrm\UnityEngine.InputLegacyModule.dll_82638129B733F8B0.mvfrm
Library\Bee\artifacts\mvdfrm\UnityEngine.InputModule.dll_83E4956B0FB0A4C7.mvfrm
Library\Bee\artifacts\mvdfrm\UnityEngine.JSONSerializeModule.dll_39EA7733FFA8C015.mvfrm
Library\Bee\artifacts\mvdfrm\UnityEngine.LocalizationModule.dll_D65430C3A8EFFA00.mvfrm
Library\Bee\artifacts\mvdfrm\UnityEngine.ParticleSystemModule.dll_BFA229F41F28281C.mvfrm
Library\Bee\artifacts\mvdfrm\UnityEngine.PerformanceReportingModule.dll_B787EBCDA58435F5.mvfrm
Library\Bee\artifacts\mvdfrm\UnityEngine.Physics2DModule.dll_E51418B43E47DB06.mvfrm
Library\Bee\artifacts\mvdfrm\UnityEngine.PhysicsModule.dll_66721AB7F2EBDD54.mvfrm
Library\Bee\artifacts\mvdfrm\UnityEngine.ProfilerModule.dll_B4F8677F8735DDE0.mvfrm
Library\Bee\artifacts\mvdfrm\UnityEngine.RuntimeInitializeOnLoadManagerInitializerModule.dll_0CAAA3B6B68457CF.mvfrm
Library\Bee\artifacts\mvdfrm\UnityEngine.ScreenCaptureModule.dll_53D224B91414EC77.mvfrm
Library\Bee\artifacts\mvdfrm\UnityEngine.SharedInternalsModule.dll_BB5DCE4D25B1B96E.mvfrm
Library\Bee\artifacts\mvdfrm\UnityEngine.SpriteMaskModule.dll_F54B4417142806A8.mvfrm
Library\Bee\artifacts\mvdfrm\UnityEngine.SpriteShapeModule.dll_0A7F9365D4E47AC9.mvfrm
Library\Bee\artifacts\mvdfrm\UnityEngine.StreamingModule.dll_4D031613ECD29AAF.mvfrm
Library\Bee\artifacts\mvdfrm\UnityEngine.SubstanceModule.dll_29AE2A5D382598BD.mvfrm
Library\Bee\artifacts\mvdfrm\UnityEngine.SubsystemsModule.dll_5FF8AA78E26FEEBB.mvfrm
Library\Bee\artifacts\mvdfrm\UnityEngine.TerrainModule.dll_80B89626C8AA2642.mvfrm
Library\Bee\artifacts\mvdfrm\UnityEngine.TerrainPhysicsModule.dll_C01CD2C7386B22A9.mvfrm
Library\Bee\artifacts\mvdfrm\UnityEngine.TextCoreFontEngineModule.dll_B80A1CE58B91E7F4.mvfrm
Library\Bee\artifacts\mvdfrm\UnityEngine.TextCoreTextEngineModule.dll_FFF253571B15A112.mvfrm
Library\Bee\artifacts\mvdfrm\UnityEngine.TextRenderingModule.dll_7D1196C3CB4C6C6C.mvfrm
Library\Bee\artifacts\mvdfrm\UnityEngine.TilemapModule.dll_1FB4FDA7E067074B.mvfrm
Library\Bee\artifacts\mvdfrm\UnityEngine.TLSModule.dll_B8F53ECD0500B928.mvfrm
Library\Bee\artifacts\mvdfrm\UnityEngine.UIElementsModule.dll_64370BE0E59C2AB2.mvfrm
Library\Bee\artifacts\mvdfrm\UnityEngine.UIElementsNativeModule.dll_EA98C5768D06ADC9.mvfrm
Library\Bee\artifacts\mvdfrm\UnityEngine.UIModule.dll_177ECEB28AA940AB.mvfrm
Library\Bee\artifacts\mvdfrm\UnityEngine.UmbraModule.dll_984379D3269F2B96.mvfrm
Library\Bee\artifacts\mvdfrm\UnityEngine.UNETModule.dll_4271F7F5488EE0AF.mvfrm
Library\Bee\artifacts\mvdfrm\UnityEngine.UnityAnalyticsCommonModule.dll_52C6A911BF6CD453.mvfrm
Library\Bee\artifacts\mvdfrm\UnityEngine.UnityAnalyticsModule.dll_DF419ABDCB4F7A18.mvfrm
Library\Bee\artifacts\mvdfrm\UnityEngine.UnityConnectModule.dll_05CA756A5A7434EC.mvfrm
Library\Bee\artifacts\mvdfrm\UnityEngine.UnityCurlModule.dll_CB8AC9F50D5ED55E.mvfrm
Library\Bee\artifacts\mvdfrm\UnityEngine.UnityTestProtocolModule.dll_5F10FC3D30BF98CC.mvfrm
Library\Bee\artifacts\mvdfrm\UnityEngine.UnityWebRequestAssetBundleModule.dll_86EFD5206A136EE9.mvfrm
Library\Bee\artifacts\mvdfrm\UnityEngine.UnityWebRequestAudioModule.dll_2F843FAC2BEF008D.mvfrm
Library\Bee\artifacts\mvdfrm\UnityEngine.UnityWebRequestModule.dll_48EB9721B978589D.mvfrm
Library\Bee\artifacts\mvdfrm\UnityEngine.UnityWebRequestTextureModule.dll_EC7453543F19DA02.mvfrm
Library\Bee\artifacts\mvdfrm\UnityEngine.UnityWebRequestWWWModule.dll_CAB498B30AD55D7E.mvfrm
Library\Bee\artifacts\mvdfrm\UnityEngine.VehiclesModule.dll_FA7527C86806266E.mvfrm
Library\Bee\artifacts\mvdfrm\UnityEngine.VFXModule.dll_39D3D73BDB6E2295.mvfrm
Library\Bee\artifacts\mvdfrm\UnityEngine.VideoModule.dll_427852255C0A9BC8.mvfrm
Library\Bee\artifacts\mvdfrm\UnityEngine.VirtualTexturingModule.dll_0F2579E565B52E54.mvfrm
Library\Bee\artifacts\mvdfrm\UnityEngine.VRModule.dll_6A50F5382C63C623.mvfrm
Library\Bee\artifacts\mvdfrm\UnityEngine.WindModule.dll_261A8B348CB6699F.mvfrm
Library\Bee\artifacts\mvdfrm\UnityEngine.XRModule.dll_9D0FB83CB59E1381.mvfrm