{
  "configurations": [
    {
      "controller": "A",
      "devices": [
        {
          "type": "MideaWiredController",
          "name": "MHA-V12W/D2RN8 heatpump",
          "address": 16
        },
        {
          "type": "BAC_1000ALN",
          "name": "nappali",
          "address": 2
        },
        {
          "type": "BAC_1000ALN",
          "name": "halo",
          "address": 3
        },
        {
          "type": "BAC_1000ALN",
          "name": "szifi",
          "address": 4
        },
        {
          "type": "BAC_1000ALN",
          "name": "nirr",
          "address": 5
        },
        {
          "type": "BAC_1000ALN",
          "name": "melos",
          "address": 6
        },
        {
          "type": "CWT_MB308K",
          "name": "modbus IO expander",
          "address": 1,
          "mapping": {
            "input": [
              {
                "port": 1,
                "type": "LimitSwitch",
                "role": "DisinfectionBypassValveFeedback",
                "displayName": "Disinfection bypass valve",
                "behavior" : "trueOnEndpoint"
              },
              {
                "port": 2,
                "type": "LimitSwitch",
                "role": "LivingRoomCoolingCircleFeedback",
                "displayName": "Nappali hutokor",
                "behavior" : "trueOnEndpoint"
              },
              {
                "port": 3,
                "type": "LimitSwitch",
                "role": "KitchenCoolingCircleFeedback",
                "displayName": "Kuhnye hutokor",
                "behavior" : "trueOnEndpoint"
              },
              {
                "port": 4,
                "type": "LimitSwitch",
                "role": "OfficeCoolingCircleFeedback",
                "displayName": "Dolgozo hutokor",
                "behavior" : "trueOnEndpoint"
              },
              {
                "port": 5,
                "type": "LimitSwitch",
                "role": "BedRoomCoolingCircleFeedback",
                "displayName": "Halo hutokor",
                "behavior" : "trueOnEndpoint"
              },
              {
                "port": 6,
                "type": "LimitSwitch",
                "role": "NRoomCoolingCircleFeedback",
                "displayName": "Nirr hutokor",
                "behavior" : "trueOnEndpoint"
              },
              {
                "port": 7,
                "type": "LimitSwitch",
                "role": "SRoomCoolingCircleFeedback",
                "displayName": "Sziff hutokor",
                "behavior" : "trueOnEndpoint"
              }
            ],
            "output": [
              {
                "port": 1,
                "type": "MonostabilValve",
                "role": "DisinfectionBypassValveControl",
                "defaultState": "closed",
                "displayName": "Disinfection bypass valve"
              },
              {
                "port": 2,
                "type": "MonostabilValve",
                "displayName": "Nappali/Kuhnye hutokor",
                "role": "LivingRoomAndKitchenCoolingCircleControl",
                "defaultState": "closed",
                "comment": "szelepek az oszto-gyujton. vezerles egy kimeneten"
              },
              {
                "port": 3,
                "type": "MonostabilValve",
                "displayName": "Dolgozo hutokor",
                "role": "OfficeCoolingCircleControl",
                "defaultState": "closed"
              },
              {
                "port": 4,
                "type": "MonostabilValve",
                "displayName": "Halo hutokor",
                "role": "BedRoomCoolingCircleControl",
                "defaultState": "closed"
              },
              {
                "port": 5,
                "type": "MonostabilValve",
                "displayName": "Nirr hutokor",
                "role": "NRoomCoolingCircleControl",
                "defaultState": "closed"
              },
              {
                "port": 6,
                "type": "MonostabilValve",
                "displayName": "Sziff hutokor",
                "role": "SRoomCoolingCircleControl",
                "defaultState": "closed"
              },
              {
                "port": 7,
                "type": "Pump",
                "displayName": "Melegviz tartaly szivattyu",
                "role": "WarmWaterCirculation"
              },
              {
                "port": 8,
                "type": "SimpleOutput",
                "displayName": "Termosztat kimenet",
                "role": "SimulatedThermostatOutput"
              }
            ]
          }
        }
      ]
    }
  ],
  "controllers": [
    {
      "A": {
        "type": "ModbusController",
        "port": "/dev/ttyUSB0",
        "baudrate": 9600,
        "parity": "N",
        "databit": 8,
        "stopbit": 1
      }
    }
  ],
  "deviceAbstraction":[
    {
      "type": "Watts_22CX230NC4",
      "role": "DisinfectionBypassValve",
      "inputRole": "DisinfectionBypassValveFeedback",
      "outputRole": "DisinfectionBypassValveControl",
      "timeLimitInMs": 300000
    },
    {
      "type": "Watts_22CX230NC4",
      "role": "LivingRoomCoolingCircle",
      "inputRole": "LivingRoomCoolingCircleFeedback",
      "outputRole": "LivingRoomAndKitchenCoolingCircleControl",
      "timeLimitInMs": 300000
    },
    {
      "type": "Watts_22CX230NC4",
      "role": "KitchenCoolingCircle",
      "inputRole": "KitchenCoolingCircleFeedback",
      "outputRole": "LivingRoomAndKitchenCoolingCircleControl",
      "timeLimitInMs": 300000
    },
    {
      "type": "Watts_22CX230NC4",
      "role": "OfficeCoolingCircle",
      "inputRole": "OfficeCoolingCircleFeedback",
      "outputRole": "OfficeCoolingCircleControl",
      "timeLimitInMs": 300000
    },
    {
      "type": "Watts_22CX230NC4",
      "role": "BedRoomCoolingCircle",
      "inputRole": "BedRoomCoolingCircleFeedback",
      "outputRole": "BedRoomCoolingCircleControl",
      "timeLimitInMs": 300000
    },
    {
      "type": "Watts_22CX230NC4",
      "role": "NRoomCoolingCircle",
      "inputRole": "NRoomCoolingCircleFeedback",
      "outputRole": "NRoomCoolingCircleControl",
      "timeLimitInMs": 300000
    },
    {
      "type": "Watts_22CX230NC4",
      "role": "SRoomCoolingCircle",
      "inputRole": "SRoomCoolingCircleFeedback",
      "outputRole": "SRoomCoolingCircleControl",
      "timeLimitInMs": 300000
    }
  ],
  "settings": {
    "mainLoopPeriodInMs": 5000
  }
}
