<svg width="40" height="40" viewBox="0 0 40 40" fill="none" xmlns="http://www.w3.org/2000/svg">
<rect width="40" height="40" rx="8" fill="#202020"/>
<path d="M31.9975 17.8433C31.9983 19.551 31.554 21.2295 30.7085 22.7133C30.5854 22.9296 30.3815 23.0881 30.1415 23.154C29.9016 23.2199 29.6453 23.1878 29.429 23.0648C29.2127 22.9417 29.0542 22.7378 28.9882 22.4978C28.9223 22.2579 28.9544 22.0016 29.0775 21.7853C30.028 20.1108 30.3396 18.1487 29.9548 16.2621C29.57 14.3756 28.5147 12.6923 26.9844 11.5239C25.454 10.3555 23.5522 9.78103 21.6309 9.90689C19.7096 10.0328 17.8989 10.8504 16.5341 12.2085C15.1692 13.5666 14.3426 15.3731 14.2072 17.2938C14.0718 19.2144 14.6368 21.1191 15.7976 22.6553C16.9584 24.1914 18.6364 25.255 20.5211 25.6492C22.4057 26.0434 24.3693 25.7414 26.0485 24.7993C26.2648 24.6774 26.5206 24.6465 26.7597 24.7132C26.9988 24.78 27.2016 24.939 27.3235 25.1553C27.4453 25.3716 27.4763 25.6274 27.4095 25.8665C27.3428 26.1056 27.1838 26.3084 26.9675 26.4303C25.2415 27.4008 23.2626 27.8271 21.2901 27.6531C19.3177 27.4791 17.4439 26.713 15.9145 25.4553L9.59748 31.7273C9.51048 31.8143 9.40707 31.8831 9.29326 31.9298C9.17945 31.9765 9.05749 32.0001 8.93448 31.9993C8.74941 31.9986 8.56869 31.9432 8.41505 31.84C8.26141 31.7368 8.14173 31.5905 8.07107 31.4194C8.0004 31.2484 7.98192 31.0603 8.01794 30.8787C8.05395 30.6972 8.14286 30.5304 8.27348 30.3993L14.5835 24.1293C13.5741 22.9136 12.8722 21.4728 12.5372 19.9286C12.2022 18.3844 12.2439 16.7822 12.6589 15.2576C13.0738 13.7329 13.8497 12.3306 14.921 11.1691C15.9924 10.0076 17.3276 9.12116 18.8138 8.58466C20.3001 8.04817 21.8936 7.87741 23.4598 8.08681C25.026 8.29622 26.5187 8.87964 27.8118 9.78775C29.1049 10.6959 30.1603 11.902 30.8889 13.3041C31.6174 14.7062 31.9977 16.2632 31.9975 17.8433V17.8433Z" fill="#808080"/>
</svg>
