<svg width="31" height="31" viewBox="0 0 31 31" fill="none" xmlns="http://www.w3.org/2000/svg">
<path d="M29.9412 12.4166C30.0085 10.4693 29.5826 8.53668 28.7032 6.79804C28.1066 6.08464 27.2785 5.6032 26.3633 5.43762C22.578 5.09415 18.777 4.95337 14.9766 5.01589C11.1901 4.95054 7.40275 5.08677 3.63071 5.42402C2.88495 5.55968 2.19481 5.90947 1.6445 6.43073C0.420119 7.55988 0.284077 9.49167 0.148035 11.1242C-0.0493451 14.0594 -0.0493451 17.0045 0.148035 19.9397C0.187392 20.8585 0.324201 21.7706 0.556161 22.6605C0.720193 23.3476 1.05206 23.9833 1.52206 24.5107C2.07611 25.0596 2.78233 25.4293 3.54908 25.5718C6.48203 25.9339 9.43727 26.0839 12.3918 26.0208C17.1533 26.0888 21.3298 26.0208 26.2681 25.6398C27.0537 25.506 27.7798 25.1359 28.3495 24.5787C28.7304 24.1977 29.0149 23.7313 29.1794 23.2183C29.6659 21.7254 29.9049 20.1629 29.8868 18.5929C29.9412 17.831 29.9412 13.2328 29.9412 12.4166ZM11.9021 19.4091V10.9881L19.9557 15.219C17.6974 16.4706 14.7181 17.8855 11.9021 19.4091Z" fill="#808080"/>
</svg>
