<svg width="24" height="24" viewBox="0 0 24 24" fill="none" xmlns="http://www.w3.org/2000/svg">
<path d="M23.019 18.1519H16.326L19.059 9.42893L20.92 15.3919C20.994 15.6289 21.1591 15.8268 21.379 15.942C21.5989 16.0573 21.8555 16.0804 22.0925 16.0064C22.3295 15.9324 22.5273 15.7673 22.6426 15.5474C22.7578 15.3276 22.781 15.0709 22.707 14.8339L19.947 5.99093C19.8985 5.83567 19.8104 5.69572 19.6913 5.5849C19.5722 5.47407 19.4263 5.39619 19.268 5.35893L14.77 4.29993C14.6685 3.83103 14.449 3.39581 14.1323 3.03549C13.8155 2.67517 13.412 2.40168 12.96 2.24093V0.935928C12.9521 0.693111 12.85 0.462896 12.6754 0.293937C12.5009 0.124979 12.2674 0.0305176 12.0245 0.0305176C11.7816 0.0305176 11.5481 0.124979 11.3736 0.293937C11.199 0.462896 11.0969 0.693111 11.089 0.935928V2.24393C10.5936 2.4206 10.1575 2.73235 9.83 3.14393L5.115 2.03693C4.88464 1.983 4.64241 2.01831 4.43703 2.13575C4.23165 2.25319 4.07836 2.44405 4.008 2.66993L0.0860021 15.2809C0.0290669 15.4041 -0.000283459 15.5382 2.06335e-06 15.6739V15.6739C2.06335e-06 15.6929 2.06335e-06 15.7109 2.06335e-06 15.7289C0.0245503 17.0207 0.55698 18.2509 1.48198 19.1529C2.40699 20.055 3.65011 20.5564 4.94212 20.5485C6.23413 20.5406 7.47103 20.0241 8.38495 19.1108C9.29887 18.1975 9.81623 16.9609 9.825 15.6689C9.82502 15.542 9.79916 15.4165 9.749 15.2999L6.281 4.23293L9.217 4.92193C9.22288 5.55036 9.43948 6.15864 9.83211 6.64935C10.2247 7.14006 10.7707 7.48482 11.3825 7.62842C11.9943 7.77201 12.6367 7.70614 13.2066 7.44133C13.7766 7.17653 14.2412 6.72813 14.526 6.16793L17.875 6.95393L14.195 18.6999C14.1613 18.8283 14.1395 18.9595 14.13 19.0919C14.1484 20.3827 14.6741 21.6143 15.5934 22.5205C16.5126 23.4268 17.7516 23.9348 19.0425 23.9348C20.3334 23.9348 21.5724 23.4268 22.4916 22.5205C23.4109 21.6143 23.9366 20.3827 23.955 19.0919C23.9555 18.9687 23.9317 18.8465 23.8849 18.7325C23.8381 18.6185 23.7692 18.5148 23.6823 18.4275C23.5953 18.3401 23.4919 18.2708 23.3781 18.2236C23.2643 18.1763 23.1423 18.1519 23.019 18.1519V18.1519ZM4.912 18.7149C4.26942 18.7139 3.64361 18.5098 3.12402 18.1317C2.60443 17.7537 2.21766 17.221 2.019 16.6099H7.807C7.60843 17.2213 7.22154 17.7541 6.70172 18.1322C6.1819 18.5103 5.55579 18.7143 4.913 18.7149H4.912ZM7.612 14.7379H2.212L4.903 6.09393L7.612 14.7379ZM12.026 5.82693C11.8409 5.82693 11.6599 5.77203 11.506 5.66918C11.3521 5.56633 11.2321 5.42015 11.1613 5.24912C11.0904 5.07809 11.0719 4.88989 11.108 4.70832C11.1441 4.52676 11.2332 4.35998 11.3642 4.22908C11.4951 4.09817 11.6618 4.00903 11.8434 3.97291C12.025 3.9368 12.2132 3.95533 12.3842 4.02618C12.5552 4.09702 12.7014 4.21699 12.8043 4.37091C12.9071 4.52484 12.962 4.7058 12.962 4.89093C12.9617 5.13909 12.863 5.37701 12.6876 5.55249C12.5121 5.72796 12.2742 5.82666 12.026 5.82693ZM19.044 22.1269C18.4013 22.1261 17.7752 21.9221 17.2554 21.544C16.7356 21.166 16.3487 20.6332 16.15 20.0219H21.936C21.7378 20.6336 21.351 21.1669 20.8312 21.5454C20.3113 21.9239 19.685 22.1282 19.042 22.1289L19.044 22.1269Z" fill="#808080"/>
</svg>
