<svg width="21" height="21" viewBox="0 0 21 21" fill="none" xmlns="http://www.w3.org/2000/svg">
<path d="M10.0362 15.2385C9.10447 15.2385 8.19374 14.9622 7.41907 14.4446C6.64439 13.927 6.04057 13.1912 5.68403 12.3305C5.32748 11.4697 5.23419 10.5225 5.41596 9.60872C5.59772 8.69493 6.04637 7.85556 6.70518 7.19676C7.36399 6.53795 8.2034 6.0893 9.11719 5.90753C10.031 5.72577 10.9782 5.81906 11.8389 6.17561C12.6997 6.53215 13.4354 7.13592 13.953 7.9106C14.4706 8.68527 14.7469 9.59605 14.7469 10.5277C14.7486 11.1409 14.6291 11.7483 14.3951 12.315C14.3632 12.4054 14.3132 12.4882 14.2482 12.5587C14.1833 12.6292 14.1047 12.6857 14.0172 12.7249C13.9298 12.7641 13.8352 12.785 13.7394 12.7866C13.6436 12.7881 13.5485 12.7702 13.4598 12.7339C13.3711 12.6976 13.2907 12.6436 13.2235 12.5753C13.1563 12.507 13.1037 12.4257 13.0688 12.3364C13.034 12.2472 13.0176 12.1518 13.0207 12.056C13.0239 11.9602 13.0464 11.866 13.087 11.7792C13.3812 11.0617 13.4128 10.2634 13.1761 9.52495C12.9395 8.78647 12.4499 8.15517 11.7935 7.74223C11.1371 7.3293 10.3561 7.16121 9.58793 7.26759C8.8198 7.37396 8.11385 7.74797 7.59439 8.32374C7.07494 8.89951 6.77531 9.64011 6.74827 10.4151C6.72124 11.1901 6.96854 11.9498 7.44661 12.5603C7.92469 13.1709 8.60286 13.5932 9.36172 13.7529C10.1206 13.9125 10.9114 13.7992 11.595 13.4331C11.6771 13.3841 11.7682 13.3522 11.863 13.3395C11.9577 13.3267 12.0541 13.3333 12.1462 13.3588C12.2383 13.3843 12.3243 13.4281 12.399 13.4878C12.4737 13.5474 12.5356 13.6216 12.5808 13.7058C12.6261 13.79 12.6538 13.8825 12.6623 13.9777C12.6708 14.073 12.66 14.1689 12.6304 14.2598C12.6008 14.3507 12.5531 14.4347 12.4901 14.5066C12.4272 14.5786 12.3503 14.637 12.2642 14.6784C11.5791 15.046 10.8137 15.2384 10.0362 15.2385Z" fill="#808080"/>
<path d="M10.0357 4.5433C9.84807 4.5433 9.66809 4.46874 9.53539 4.33604C9.40268 4.20333 9.32812 4.02335 9.32812 3.83568V1.20738C9.32812 1.0197 9.40268 0.839672 9.53539 0.706968C9.66809 0.574263 9.84807 0.499756 10.0357 0.499756C10.2234 0.499756 10.4034 0.574263 10.5362 0.706968C10.6689 0.839672 10.7434 1.0197 10.7434 1.20738V3.83568C10.7436 3.92868 10.7255 4.02079 10.6901 4.10676C10.6546 4.19273 10.6025 4.27087 10.5367 4.33663C10.471 4.40239 10.3929 4.45447 10.3069 4.48994C10.2209 4.52541 10.1287 4.54357 10.0357 4.5433Z" fill="#808080"/>
<path d="M6.69208 5.44095C6.56898 5.43966 6.44831 5.40634 6.34197 5.34431C6.23563 5.28228 6.14727 5.19366 6.08555 5.08714L4.77342 2.81467C4.72696 2.73409 4.69681 2.64515 4.68472 2.55292C4.67263 2.46069 4.67881 2.36698 4.70294 2.27715C4.72706 2.18732 4.76863 2.10313 4.8253 2.02936C4.88197 1.9556 4.95262 1.89369 5.0332 1.84723C5.11378 1.80076 5.20273 1.77067 5.29496 1.75858C5.38718 1.74649 5.4809 1.75266 5.57073 1.77679C5.66056 1.80091 5.74475 1.84249 5.81851 1.89915C5.89228 1.95582 5.95414 2.02647 6.0006 2.10705L7.31273 4.37952C7.35908 4.4601 7.3891 4.549 7.40108 4.64118C7.41306 4.73336 7.40679 4.82701 7.38257 4.91675C7.35835 5.0065 7.31669 5.09061 7.25996 5.16424C7.20323 5.23788 7.13251 5.29962 7.05191 5.34594C6.94278 5.40962 6.81843 5.44246 6.69208 5.44095Z" fill="#808080"/>
<path d="M4.23974 7.88939C4.11642 7.88921 3.99525 7.85718 3.88795 7.79639L1.61548 6.48426C1.45275 6.39043 1.33394 6.23582 1.28522 6.05439C1.2365 5.87296 1.26187 5.6796 1.3557 5.51686C1.44954 5.35413 1.60415 5.23532 1.78558 5.1866C1.967 5.13788 2.16037 5.1632 2.3231 5.25704L4.59557 6.56916C4.73052 6.64718 4.83593 6.7676 4.89543 6.91167C4.95493 7.05574 4.96517 7.21542 4.9246 7.36593C4.88404 7.51643 4.79494 7.64932 4.67109 7.74397C4.54725 7.83863 4.39561 7.88975 4.23974 7.88939Z" fill="#808080"/>
<path d="M3.33592 11.2353H0.70762C0.519947 11.2353 0.339966 11.1608 0.207261 11.028C0.0745567 10.8953 0 10.7154 0 10.5277C0 10.34 0.0745567 10.16 0.207261 10.0273C0.339966 9.89463 0.519947 9.82007 0.70762 9.82007H3.33592C3.5236 9.82007 3.70358 9.89463 3.83628 10.0273C3.96899 10.16 4.04354 10.34 4.04354 10.5277C4.04354 10.7154 3.96899 10.8953 3.83628 11.028C3.70358 11.1608 3.5236 11.2353 3.33592 11.2353Z" fill="#808080"/>
<path d="M1.96995 15.8936C1.81425 15.8935 1.66294 15.842 1.53943 15.7472C1.41593 15.6524 1.32712 15.5195 1.28681 15.3691C1.24651 15.2187 1.25694 15.0592 1.31648 14.9153C1.37601 14.7715 1.48135 14.6513 1.61614 14.5733L3.88861 13.2612C3.96919 13.2147 4.05814 13.1846 4.15036 13.1725C4.24259 13.1604 4.3363 13.1666 4.42613 13.1908C4.51597 13.2149 4.60016 13.2565 4.67392 13.3131C4.74768 13.3698 4.80955 13.4404 4.85601 13.521C4.90247 13.6016 4.93262 13.6905 4.94471 13.7827C4.9568 13.875 4.95062 13.9687 4.92649 14.0585C4.90237 14.1483 4.8608 14.2325 4.80413 14.3063C4.74747 14.3801 4.67681 14.442 4.59623 14.4884L2.32376 15.7985C2.21636 15.8611 2.09423 15.8939 1.96995 15.8936Z" fill="#808080"/>
<path d="M5.37787 19.3043C5.25419 19.3032 5.13293 19.2696 5.02623 19.2071C4.91953 19.1445 4.83107 19.0551 4.76971 18.9477C4.70834 18.8403 4.67624 18.7187 4.67652 18.5951C4.67679 18.4714 4.70949 18.3499 4.77134 18.2428L6.08346 15.9703C6.1773 15.8076 6.33191 15.6888 6.51334 15.6401C6.69476 15.5914 6.88812 15.6167 7.05086 15.7105C7.2136 15.8044 7.33241 15.959 7.38113 16.1404C7.42985 16.3219 7.40448 16.5152 7.31064 16.6779L5.99852 18.9504C5.93559 19.059 5.84501 19.149 5.73597 19.2111C5.62693 19.2733 5.50337 19.3054 5.37787 19.3043Z" fill="#808080"/>
<path d="M10.0357 20.5517C9.84807 20.5517 9.66809 20.4772 9.53539 20.3445C9.40268 20.2118 9.32812 20.0318 9.32812 19.8441V17.2158C9.32812 17.0281 9.40268 16.8481 9.53539 16.7154C9.66809 16.5827 9.84807 16.5082 10.0357 16.5082C10.2234 16.5082 10.4034 16.5827 10.5362 16.7154C10.6689 16.8481 10.7434 17.0281 10.7434 17.2158V19.8441C10.7436 19.9371 10.7255 20.0292 10.6901 20.1152C10.6546 20.2012 10.6025 20.2793 10.5367 20.3451C10.471 20.4108 10.3929 20.4629 10.3069 20.4984C10.2209 20.5339 10.1287 20.552 10.0357 20.5517Z" fill="#808080"/>
<path d="M14.697 19.3043C14.5738 19.303 14.4532 19.2697 14.3469 19.2076C14.2406 19.1456 14.1521 19.057 14.0904 18.9505L12.7783 16.6779C12.7318 16.5974 12.7017 16.5085 12.6896 16.4162C12.6775 16.324 12.6837 16.2303 12.7079 16.1405C12.732 16.0506 12.7736 15.9664 12.8302 15.8926C12.8869 15.8189 12.9575 15.757 13.0381 15.7105C13.1187 15.6641 13.2076 15.6339 13.2998 15.6218C13.3921 15.6098 13.4858 15.616 13.5756 15.6401C13.6654 15.6642 13.7497 15.7058 13.8234 15.7625C13.8972 15.8191 13.9591 15.8897 14.0055 15.9703L15.3176 18.2428C15.364 18.3234 15.394 18.4123 15.406 18.5045C15.418 18.5967 15.4117 18.6903 15.3874 18.7801C15.3632 18.8698 15.3216 18.9539 15.2648 19.0275C15.2081 19.1012 15.1374 19.1629 15.0568 19.2092C14.9477 19.2729 14.8233 19.3058 14.697 19.3043Z" fill="#808080"/>
<path d="M18.1048 15.8936C17.9805 15.8939 17.8584 15.8611 17.751 15.7985L15.4785 14.4884C15.3979 14.442 15.3273 14.3801 15.2706 14.3063C15.2139 14.2325 15.1724 14.1483 15.1482 14.0585C15.1241 13.9687 15.1179 13.875 15.13 13.7827C15.1421 13.6905 15.1722 13.6016 15.2187 13.521C15.2651 13.4404 15.3271 13.3698 15.4008 13.3131C15.4746 13.2565 15.5588 13.2149 15.6486 13.1908C15.7384 13.1666 15.8322 13.1604 15.9244 13.1725C16.0166 13.1846 16.1056 13.2147 16.1861 13.2612L18.4586 14.5733C18.5934 14.6513 18.6987 14.7715 18.7583 14.9153C18.8178 15.0592 18.8282 15.2187 18.7879 15.3691C18.7476 15.5195 18.6588 15.6524 18.5353 15.7472C18.4118 15.842 18.2605 15.8935 18.1048 15.8936Z" fill="#808080"/>
<path d="M19.3525 11.2353H16.7242C16.5365 11.2353 16.3566 11.1608 16.2239 11.028C16.0912 10.8953 16.0166 10.7154 16.0166 10.5277C16.0166 10.34 16.0912 10.16 16.2239 10.0273C16.3566 9.89463 16.5365 9.82007 16.7242 9.82007H19.3525C19.5402 9.82007 19.7202 9.89463 19.8529 10.0273C19.9856 10.16 20.0601 10.34 20.0601 10.5277C20.0601 10.7154 19.9856 10.8953 19.8529 11.028C19.7202 11.1608 19.5402 11.2353 19.3525 11.2353Z" fill="#808080"/>
<path d="M15.8323 7.88939C15.6766 7.8893 15.5252 7.8379 15.4017 7.74308C15.2782 7.64827 15.1894 7.51533 15.1491 7.36494C15.1088 7.21454 15.1192 7.05509 15.1788 6.91122C15.2383 6.76736 15.3437 6.6471 15.4784 6.56916L17.7509 5.25704C17.9137 5.1632 18.107 5.13788 18.2884 5.1866C18.4699 5.23532 18.6245 5.35413 18.7183 5.51686C18.8121 5.6796 18.8375 5.87296 18.7888 6.05439C18.7401 6.23582 18.6213 6.39043 18.4585 6.48426L16.1861 7.79639C16.0781 7.85743 15.9562 7.88947 15.8323 7.88939Z" fill="#808080"/>
<path d="M13.3823 5.44095C13.2586 5.43986 13.1374 5.40637 13.0307 5.34381C12.924 5.28126 12.8355 5.19182 12.7742 5.08443C12.7128 4.97704 12.6806 4.85544 12.6809 4.73175C12.6812 4.60807 12.7139 4.48663 12.7757 4.37952L14.0879 2.10705C14.1343 2.02647 14.1962 1.95582 14.27 1.89915C14.3438 1.84249 14.4279 1.80091 14.5178 1.77679C14.6076 1.75266 14.7013 1.74649 14.7936 1.75858C14.8858 1.77067 14.9747 1.80076 15.0553 1.84723C15.1359 1.89369 15.2065 1.9556 15.2632 2.02936C15.3198 2.10313 15.3614 2.18732 15.3855 2.27715C15.4096 2.36698 15.4159 2.46069 15.4038 2.55292C15.3917 2.64515 15.3615 2.73409 15.3151 2.81467L14.003 5.08714C13.94 5.19574 13.8494 5.28571 13.7404 5.34786C13.6313 5.41002 13.5078 5.44214 13.3823 5.44095Z" fill="#808080"/>
</svg>
