{
  "files": {
    "main.css": "/static/css/main.824bc67d.chunk.css",
    "main.js": "/static/js/main.1f27b7e5.chunk.js",
    "main.js.map": "/static/js/main.1f27b7e5.chunk.js.map",
    "runtime-main.js": "/static/js/runtime-main.2bf811c1.js",
    "runtime-main.js.map": "/static/js/runtime-main.2bf811c1.js.map",
    "static/css/2.658248ec.chunk.css": "/static/css/2.658248ec.chunk.css",
    "static/js/2.fd355c75.chunk.js": "/static/js/2.fd355c75.chunk.js",
    "static/js/2.fd355c75.chunk.js.map": "/static/js/2.fd355c75.chunk.js.map",
    "index.html": "/index.html",
    "static/css/2.658248ec.chunk.css.map": "/static/css/2.658248ec.chunk.css.map",
    "static/css/main.824bc67d.chunk.css.map": "/static/css/main.824bc67d.chunk.css.map",
    "static/js/2.fd355c75.chunk.js.LICENSE.txt": "/static/js/2.fd355c75.chunk.js.LICENSE.txt",
    "static/js/main.1f27b7e5.chunk.js.LICENSE.txt": "/static/js/main.1f27b7e5.chunk.js.LICENSE.txt"
  },
  "entrypoints": [
    "static/js/runtime-main.2bf811c1.js",
    "static/css/2.658248ec.chunk.css",
    "static/js/2.fd355c75.chunk.js",
    "static/css/main.824bc67d.chunk.css",
    "static/js/main.1f27b7e5.chunk.js"
  ]
}