 [
    { "id": 1, "category": "Суші", "available": true, "title": "Макі-рол з лососем", "value": "155г", "img": "https://content.silpo.ua/sku/ecommerce/88/480x480wwm/888385_480x480wwm_315b3288-edd2-b0c2-5952-a2bc91858795.png", "price": { "common": "76.00", "sale": "" }, "rating": { "rate": "4.8", "votes": "11" }},
    { "id": 2, "category": "Суші", "available": true, "title": "Спайсі рол з креветками", "value": "160г", "img": "https://content.silpo.ua/sku/ecommerce/74/480x480wwm/747287_480x480wwm_9e3d880c-3a9a-ca53-1e6d-3db03b162f24.png", "price": { "common": "64.00", "sale": "59.00" }, "rating": { "rate": "4.8", "votes": "5" }},
    { "id": 3, "category": "Суші", "available": true, "title": "Рол «Філадельфія»", "value": "175г", "img": "https://content.silpo.ua/sku/ecommerce/74/480x480wwm/747287_480x480wwm_9e3d880c-3a9a-ca53-1e6d-3db03b162f24.png", "price": { "common": "229.00", "sale": "" }, "rating": { "rate": "5", "votes": "3" }},
    { "id": 4, "category": "Суші",  "available": true, "title": "Сет «Дракон»", "value": "450г", "img": "https://content.silpo.ua/sku/ecommerce/74/480x480wwm/747287_480x480wwm_9e3d880c-3a9a-ca53-1e6d-3db03b162f24.png", "price": { "common": "439.99", "sale": "299.99" }, "rating": { "rate": "2.5", "votes": "3" }},
    { "id": 5, "category": "Суші", "available": false, "title": "Рол з вугрем", "value": "180г", "img": "https://content.silpo.ua/sku/ecommerce/74/480x480wwm/747287_480x480wwm_9e3d880c-3a9a-ca53-1e6d-3db03b162f24.png", "price": { "common": "93.00", "sale": "" }, "rating": { "rate": "4.1", "votes": "9" }},
    { "id": 6, "category": "Салати",  "available": true, "title": "Салат з креветками", "value": "245г", "img": "https://content.silpo.ua/sku/ecommerce/74/480x480wwm/747287_480x480wwm_9e3d880c-3a9a-ca53-1e6d-3db03b162f24.png", "price": { "common": "149.99", "sale": "" }, "rating": { "rate": "4.3", "votes": "12" }},
    { "id": 7, "category": "Салати",  "available": true, "title": "Салат «Ламінарія»", "value": "200г", "img": "https://content.silpo.ua/sku/ecommerce/74/480x480wwm/747287_480x480wwm_9e3d880c-3a9a-ca53-1e6d-3db03b162f24.png", "price": { "common": "77.00", "sale": "69.99" }, "rating": { "rate": "3.9", "votes": "7" }},
    { "id": 8, "category": "Піца",  "available": true, "title": "Піца «Маргарита»", "value": "450г", "img": "https://content.silpo.ua/sku/ecommerce/74/480x480wwm/747287_480x480wwm_9e3d880c-3a9a-ca53-1e6d-3db03b162f24.png", "price": { "common": "99.99", "sale": "" }, "rating": { "rate": "4.9", "votes": "2" }},
    { "id": 9, "category": "Піца",  "available": true, "title": "Піца «Гостра»", "value": "450г", "img": "https://content.silpo.ua/sku/ecommerce/74/480x480wwm/747287_480x480wwm_9e3d880c-3a9a-ca53-1e6d-3db03b162f24.png", "price": { "common": "99.00", "sale": "" }, "rating": { "rate": "5", "votes": "1" }},
    { "id": 10, "category": "Піца",  "available": true, "title": "Піца «Гавайська»", "value": "450г", "img": "https://content.silpo.ua/sku/ecommerce/74/480x480wwm/747287_480x480wwm_9e3d880c-3a9a-ca53-1e6d-3db03b162f24.png", "price": { "common": "199.00", "sale": "109.00" }, "rating": { "rate": "", "votes": "" }},
    { "id": 11, "category": "Піца",  "available": true, "title": "Піца «Барбекю»", "value": "450г", "img": "https://content.silpo.ua/sku/ecommerce/74/480x480wwm/747287_480x480wwm_9e3d880c-3a9a-ca53-1e6d-3db03b162f24.png", "price": { "common": "199.00", "sale": "109.00" }, "rating": { "rate": "4.5", "votes": "4" }},
    { "id": 12, "category": "Піца",  "available": true, "title": "Піца «Королівська»", "value": "950г", "img": "https://content.silpo.ua/sku/ecommerce/74/480x480wwm/747287_480x480wwm_9e3d880c-3a9a-ca53-1e6d-3db03b162f24.png", "price": { "common": "399.50", "sale": "299.50" }, "rating": { "rate": "4.7", "votes": "8" }},
    { "id": 13, "category": "Піца",  "available": true, "title": "Піца 1", "value": "450г", "img": "https://content.silpo.ua/sku/ecommerce/74/480x480wwm/747287_480x480wwm_9e3d880c-3a9a-ca53-1e6d-3db03b162f24.png", "price": { "common": "199.00", "sale": "" }, "rating": { "rate": "4.2", "votes": "5" }},
    { "id": 14, "category": "Піца",  "available": true, "title": "Піца 2", "value": "450г", "price": { "common": "199.00", "sale": "" }, "rating": { "rate": "", "votes": "" }},
    { "id": 15, "category": "Піца",  "available": false, "title": "Піца 3", "value": "450г", "price": { "common": "199.00", "sale": "" }, "rating": { "rate": "", "votes": "" }},
    { "id": 16, "category": "Піца",  "available": true, "title": "Піца 4", "value": "450г", "price": { "common": "199.00", "sale": "" }, "rating": { "rate": "", "votes": "" }},
    { "id": 17, "category": "Піца",  "available": true, "title": "Піца 5", "value": "450г", "price": { "common": "199.00", "sale": "99.00" }, "rating": { "rate": "", "votes": "" }},
    { "id": 18, "category": "Піца",  "available": true, "title": "Піца 6", "value": "450г", "price": { "common": "199.00", "sale": "" }, "rating": { "rate": "", "votes": "" }},
    { "id": 19, "category": "Піца",  "available": false, "title": "Піца 7", "value": "450г", "price": { "common": "199.00", "sale": "" }, "rating": { "rate": "", "votes": "" }},
    { "id": 20, "category": "Суші", "available": true, "title": "Макі-рол з ковбасою", "value": "155г", "img": "https://content.silpo.ua/sku/ecommerce/74/480x480wwm/747287_480x480wwm_9e3d880c-3a9a-ca53-1e6d-3db03b162f24.png", "price": { "common": "79.30", "sale": "" }, "rating": { "rate": "4.8", "votes": "111" }},
    { "id": 21, "category": "Суші", "available": true, "title": "Спайсі рол з анчоусами", "value": "160г", "img": "https://content.silpo.ua/sku/ecommerce/74/480x480wwm/747287_480x480wwm_9e3d880c-3a9a-ca53-1e6d-3db03b162f24.png", "price": { "common": "67.50", "sale": "59.99" }, "rating": { "rate": "4.8", "votes": "15" }},
    { "id": 22, "category": "Суші", "available": false, "title": "Рол з оселедцем", "value": "175г", "img": "https://content.silpo.ua/sku/ecommerce/74/480x480wwm/747287_480x480wwm_9e3d880c-3a9a-ca53-1e6d-3db03b162f24.png", "price": { "common": "53.00", "sale": "" }, "rating": { "rate": "5", "votes": "3" }},
    { "id": 23, "category": "Суші",  "available": true, "title": "Сет «Філадельфія»", "value": "550г", "img": "https://content.silpo.ua/sku/ecommerce/74/480x480wwm/747287_480x480wwm_9e3d880c-3a9a-ca53-1e6d-3db03b162f24.png", "price": { "common": "399.99", "sale": "279.00" }, "rating": { "rate": "4.6", "votes": "32" }},
    { "id": 24, "category": "Салати",  "available": true, "title": "Салат із зелених водоростей", "value": "180г", "img": "https://content.silpo.ua/sku/ecommerce/74/480x480wwm/747287_480x480wwm_9e3d880c-3a9a-ca53-1e6d-3db03b162f24.png", "price": { "common": "93.00", "sale": "" }, "rating": { "rate": "4.1", "votes": "9" }},
    { "id": 25, "category": "Салати",  "available": false, "title": "Салат з креветками", "value": "245г", "img": "https://content.silpo.ua/sku/ecommerce/74/480x480wwm/747287_480x480wwm_9e3d880c-3a9a-ca53-1e6d-3db03b162f24.png", "price": { "common": "149.99", "sale": "" }, "rating": { "rate": "4.3", "votes": "12" }},
    { "id": 26, "category": "Салати",  "available": true, "title": "Салат з морських водоростей", "value": "200г", "img": "https://content.silpo.ua/sku/ecommerce/74/480x480wwm/747287_480x480wwm_9e3d880c-3a9a-ca53-1e6d-3db03b162f24.png", "price": { "common": "77.00", "sale": "69.99" }, "rating": { "rate": "3.9", "votes": "7" }},
    { "id": 27, "category": "Салати",  "available": true, "title": "Салат «Цезар»", "value": "200г", "price": { "common": "99.99", "sale": "" }, "rating": { "rate": "4.9", "votes": "2" }},
    { "id": 28, "category": "Піца",  "available": true, "title": "Піца «Гостра»", "value": "450г", "img": "https://content.silpo.ua/sku/ecommerce/74/480x480wwm/747287_480x480wwm_9e3d880c-3a9a-ca53-1e6d-3db03b162f24.png", "price": { "common": "99.00", "sale": "" }, "rating": { "rate": "5", "votes": "1" }},
    { "id": 29, "category": "Піца",  "available": true, "title": "Піца «Гавайська»", "value": "450г", "img": "https://content.silpo.ua/sku/ecommerce/74/480x480wwm/747287_480x480wwm_9e3d880c-3a9a-ca53-1e6d-3db03b162f24.png", "price": { "common": "199.00", "sale": "109.00" }, "rating": { "rate": "", "votes": "" }},
    { "id": 30, "category": "Піца",  "available": true, "title": "Піца «Барбекю»", "value": "450г", "img": "https://content.silpo.ua/sku/ecommerce/74/480x480wwm/747287_480x480wwm_9e3d880c-3a9a-ca53-1e6d-3db03b162f24.png", "price": { "common": "199.00", "sale": "109.00" }, "rating": { "rate": "4.5", "votes": "4" }},
    { "id": 31, "category": "Піца",  "available": true, "title": "Піца «Королівська»", "value": "950г", "img": "https://content.silpo.ua/sku/ecommerce/74/480x480wwm/747287_480x480wwm_9e3d880c-3a9a-ca53-1e6d-3db03b162f24.png", "price": { "common": "399.50", "sale": "299.50" }, "rating": { "rate": "4.7", "votes": "8" }},
    { "id": 32, "category": "Піца",  "available": false, "title": "Піца 8", "value": "450г", "img": "https://content.silpo.ua/sku/ecommerce/74/480x480wwm/747287_480x480wwm_9e3d880c-3a9a-ca53-1e6d-3db03b162f24.png", "price": { "common": "199.00", "sale": "" }, "rating": { "rate": "4.2", "votes": "5" }}
  ]


