{
	"name": "VA3 Outlier Prediction Module",
	"vnfPackagePath": "__Link__",
	"accessLevel": "PUBLIC",
	"version": "1.0",
	"type": "SERVICE",
	"specLevel": "VERTICAL_SPECIFIC",
	"configurableParameters": {},
	"testbed": "GALATI",
	"useCase": "UC3",
	"description": "NetApp with data ingestion, fusion and post-processing functionality from distributed data sources. Performs outlier prediction on engine and environmental data.",
	"endPoints": [
		{
			"endPointId": "trainAutoML",
			"type": "EXTERNAL",
			"management": false,
			"mobileConnection": false
		},
		{
			"endPointId": "predictAutoML",
			"type": "EXTERNAL",
			"management": false,
			"mobileConnection": false
		},
		{
			"endPointId": "formOptions",
			"type": "INTERNAL",
			"management": false,
			"mobileConnection": false
		},
		{
			"endPointId": "deleteExperiment",
			"type": "INTERNAL",
			"management": false,
			"mobileConnection": false
		},
		{
			"endPointId": "experimentResults",
			"type": "EXTERNAL",
			"management": false,
			"mobileConnection": false
		}
	],
	"atomicComponents": [
		{
			"componentId": "HadoopWarehouse",
			"placement": "CORE"
		},
		{
			"componentId": "DataCollection",
			"placement": "CORE"
		},
		{
			"componentId": "OutlierModelTrainer",
			"endPointsIds": [
				"trainAutoML"
			],
			"placement": "CORE"
		},
		{
			"componentId": "OutlierModelPredictor",
			"endPointsIds": [
				"predictAutoML"
			],
			"placement": "CORE"
		},
		{
			"componentId": "FrontendPlatform",
			"endPointsIds": [
				"formOptions"
			],
			"placement": "CORE"
		},
		{
			"componentId": "MLFlowExperimentTracker",
			"endPointsIds": [
				"deleteExperiment",
				"experimentResults"
			],
			"placement": "CORE"
		}
	],
	"providedInterfaceSpec": [
		{
			"interfaceServiceSpecId": "OutlierTrainAPI",
			"name": "Interface for training an outlier prediction model",
			"version": "1.0",
			"endpointIds": [
				"trainAutoML"
			],
			"commType": "REQUEST_RESPONSE",
			"dataFormat": "JSON",
			"protocol": "HTTP"
		},
		{
			"interfaceServiceSpecId": "OutlierPredictAPI",
			"name": "Interface for predicting outliers on provided data",
			"version": "1.0",
			"endpointIds": [
				"predictAutoML"
			],
			"commType": "REQUEST_RESPONSE",
			"dataFormat": "JSON",
			"protocol": "HTTP"
		},
		{
			"interfaceServiceSpecId": "TrainingOptionsAPI",
			"name": "Interface for fetching form options for training purposes",
			"version": "1.0",
			"endpointIds": [
				"formOptions"
			],
			"commType": "REQUEST_RESPONSE",
			"dataFormat": "JSON",
			"protocol": "HTTP"
		},
		{
			"interfaceServiceSpecId": "DeleteExperimentAPI",
			"name": "Interface for deleting an experiment",
			"version": "1.0",
			"endpointIds": [
				"deleteExperiment"
			],
			"commType": "REQUEST_RESPONSE",
			"dataFormat": "JSON",
			"protocol": "HTTP"
		},
		{
			"interfaceServiceSpecId": "ExperimentResultsAPI",
			"name": "Interface for retrieving results of train experiments",
			"version": "1.0",
			"endpointIds": [
				"experimentResults"
			],
			"commType": "REQUEST_RESPONSE",
			"dataFormat": "JSON",
			"protocol": "HTTP"
		}
	],
	"applicationMetrics": [],
	"infrastructureMetrics": [
		{
			"metricId": "cpu_usage",
			"metricCollectionType": "GAUGE",
			"type": "CPU_USAGE",
			"interval": "10",
			"unit": "seconds",
			"name": "cpu_usage",
			"metricGraphType": "LINE",
			"componentIds": [
				"OutlierModelTrainer",
				"OutlierModelPredictor"
			]
		},
		{
			"id": "memory_usage",
			"type": "MEMORY_USAGE",
			"interval": "10",
			"unit": "seconds",
			"name": "memory_usage",
			"metricGraphType": "LINE",
			"componentIds": [
				"OutlierModelTrainer",
				"OutlierModelPredictor",
				"HadoopWarehouse"
			]
		},
		{
			"id": "disk_usage",
			"type": "DISK_USAGE",
			"interval": "10",
			"unit": "seconds",
			"name": "memory_usage",
			"metricGraphType": "LINE",
			"componentIds": [
				"HadoopWarehouse",
				"MLFlowExperimentTracker"
			]
		}
	],
	"required5GCoreServices": [],
	"softwareLicenses": [
		{
			"softwareLicenseId": "incelligentLicense",
			"openLicense": true,
			"type": "INSTANCE_BASED",
			"licenseFile": "licenses/incelligentLicense.txt"
		}
	]
}