[
    {
        "id": "af07e2b8ecfdb6a1",
        "type": "tab",
        "label": "VITAL5G data generator",
        "disabled": false,
        "info": ""
    },
    {
        "id": "4165c289c741848b",
        "type": "mqtt in",
        "z": "af07e2b8ecfdb6a1",
        "name": "Mqtt Libelium Water",
        "topic": "meshlium3d4c/ponton_water/#",
        "qos": "2",
        "datatype": "json",
        "broker": "7cd82d51283d79bc",
        "nl": false,
        "rap": false,
        "inputs": 0,
        "x": 190,
        "y": 100,
        "wires": [
            [
                "1d664722f8f5156b"
            ]
        ]
    },
    {
        "id": "b87be8ccb9c4a67c",
        "type": "mqtt in",
        "z": "af07e2b8ecfdb6a1",
        "name": "Libelium Air",
        "topic": "meshlium3d4c/ship_air/#",
        "qos": "2",
        "datatype": "auto-detect",
        "broker": "7cd82d51283d79bc",
        "nl": false,
        "rap": false,
        "inputs": 0,
        "x": 170,
        "y": 500,
        "wires": [
            [
                "a07820c7c002753d"
            ]
        ]
    },
    {
        "id": "858e686f55f9c141",
        "type": "mqtt in",
        "z": "af07e2b8ecfdb6a1",
        "name": "Depth Ship",
        "topic": "training/vital5g/vs9/mercur/#",
        "qos": "2",
        "datatype": "auto-detect",
        "broker": "547cf574.6d3b7c",
        "nl": false,
        "rap": true,
        "rh": 0,
        "inputs": 0,
        "x": 160,
        "y": 620,
        "wires": [
            [
                "d15064e0fa843753"
            ]
        ]
    },
    {
        "id": "a07820c7c002753d",
        "type": "function",
        "z": "af07e2b8ecfdb6a1",
        "name": "repackage   ",
        "func": "var mqttTopic = 'uc2/real/va6/mercur';\n\nvar sensor = msg.payload.sensor\nvar value = msg.payload.value\nvar new_payload = {}\n\nif (sensor === 'LUX') {\n    new_payload.LUX = value;\n    var newMsg = { topic: mqttTopic, payload: new_payload };\n    return newMsg;\n} \n\nif (sensor === 'CO') {\n    new_payload.CO = value;\n    var newMsg = { topic: mqttTopic, payload: new_payload };\n    return newMsg;\n} \n\nif (sensor === 'O2') {\n    new_payload.O2 = value;\n    var newMsg = { topic: mqttTopic, payload: new_payload };\n    return newMsg;\n} \n\nif (sensor === 'HUM') {\n    new_payload.HUM = value;\n    var newMsg = { topic: mqttTopic, payload: new_payload };\n    return newMsg;\n} \n\nif (sensor === 'PRES') {\n    new_payload.PRES = value;\n    var newMsg = { topic: mqttTopic, payload: new_payload };\n    return newMsg;\n} \n\nif (sensor === 'TC') {\n    new_payload.TC = value;\n    var newMsg = { topic: mqttTopic, payload: new_payload };\n    return newMsg;\n} \n\n",
        "outputs": 1,
        "noerr": 0,
        "initialize": "",
        "finalize": "",
        "libs": [],
        "x": 450,
        "y": 500,
        "wires": [
            [
                "a3dfa8a9412f3ec1",
                "bcefcc07999bd3b9"
            ]
        ]
    },
    {
        "id": "1d664722f8f5156b",
        "type": "function",
        "z": "af07e2b8ecfdb6a1",
        "name": "repackage   water",
        "func": "var mqttTopic = 'uc2/real/va6/ponton';\n\nvar sensor = msg.payload.sensor\nvar value = msg.payload.value\nvar new_payload = {}\n\nif (sensor === 'PM1') {\n    new_payload.SWIPH = value;\n    var newMsg = { topic: mqttTopic, payload: new_payload };\n    return newMsg;\n} else \nif (sensor === 'TC'){\n    new_payload.WT = value;\n    var newMsg = { topic: mqttTopic, payload: new_payload };\n    return newMsg;\n} \n\n",
        "outputs": 1,
        "noerr": 0,
        "initialize": "",
        "finalize": "",
        "libs": [],
        "x": 460,
        "y": 100,
        "wires": [
            [
                "982595aacbcb9586",
                "8c1ef3ea29853f9e"
            ]
        ]
    },
    {
        "id": "65cd97bc69b8a5da",
        "type": "mqtt out",
        "z": "af07e2b8ecfdb6a1",
        "name": "Mqtt Vital",
        "topic": "",
        "qos": "2",
        "retain": "false",
        "respTopic": "",
        "contentType": "",
        "userProps": "",
        "correl": "",
        "expiry": "",
        "broker": "c0337c4.8a46f8",
        "x": 820,
        "y": 100,
        "wires": []
    },
    {
        "id": "982595aacbcb9586",
        "type": "delay",
        "z": "af07e2b8ecfdb6a1",
        "name": "1ms",
        "pauseType": "delay",
        "timeout": "1",
        "timeoutUnits": "milliseconds",
        "rate": "1",
        "nbRateUnits": "1",
        "rateUnits": "second",
        "randomFirst": "1",
        "randomLast": "5",
        "randomUnits": "seconds",
        "drop": false,
        "outputs": 1,
        "x": 670,
        "y": 100,
        "wires": [
            [
                "65cd97bc69b8a5da"
            ]
        ]
    },
    {
        "id": "d15064e0fa843753",
        "type": "function",
        "z": "af07e2b8ecfdb6a1",
        "name": "repackage   ",
        "func": "// parsare JSON\nvar p = msg.payload;\nvar mqttTopic = 'uc2/real/va6/mercur';\n\nif (p.depth) {\n\n    var newMsg = { topic: mqttTopic, payload: msg.payload };\n    return newMsg;\n\n}",
        "outputs": 1,
        "noerr": 0,
        "initialize": "",
        "finalize": "",
        "libs": [],
        "x": 450,
        "y": 620,
        "wires": [
            [
                "1b6df0847593187d",
                "7f06f347d9e45dd6"
            ]
        ]
    },
    {
        "id": "e3a0e4fe8ff58bbd",
        "type": "mqtt in",
        "z": "af07e2b8ecfdb6a1",
        "name": "AIS Ship",
        "topic": "training/vital5g/vs9/mercur/ais",
        "qos": "2",
        "datatype": "auto-detect",
        "broker": "547cf574.6d3b7c",
        "nl": false,
        "rap": true,
        "rh": 0,
        "inputs": 0,
        "x": 160,
        "y": 740,
        "wires": [
            [
                "4a8e9322bd107020"
            ]
        ]
    },
    {
        "id": "4a8e9322bd107020",
        "type": "function",
        "z": "af07e2b8ecfdb6a1",
        "name": "repackage   ",
        "func": "// parsare JSON\nvar p = msg.payload;\nvar mqttTopic = 'uc2/real/va6/mercur/ais/' + p.ship;\nvar new_payload = {}\n\nnew_payload.latitude = p.latitude\nnew_payload.longitude = p.longitude\nnew_payload.speed = p.speed\n\nvar newMsg = { topic: mqttTopic, payload: new_payload };\nreturn newMsg;\n",
        "outputs": 1,
        "noerr": 0,
        "initialize": "",
        "finalize": "",
        "libs": [],
        "x": 450,
        "y": 740,
        "wires": [
            [
                "99eb665dac1762a9",
                "81cfd71eb63f9663"
            ]
        ]
    },
    {
        "id": "c1921d08b5d50d11",
        "type": "mqtt in",
        "z": "af07e2b8ecfdb6a1",
        "name": "Depth Ponton",
        "topic": "training/vital5g/vs9/ponton/#",
        "qos": "2",
        "datatype": "auto-detect",
        "broker": "7cd82d51283d79bc",
        "nl": false,
        "rap": true,
        "rh": 0,
        "inputs": 0,
        "x": 170,
        "y": 220,
        "wires": [
            [
                "1d39b9d945eca795"
            ]
        ]
    },
    {
        "id": "1d39b9d945eca795",
        "type": "function",
        "z": "af07e2b8ecfdb6a1",
        "name": "repackage  water ",
        "func": "// parsare JSON\nvar p = msg.payload;\nvar mqttTopic = 'uc2/real/va6/ponton';\n\nif (p.depth) {\n\n    var newMsg = { topic: mqttTopic, payload: msg.payload };\n    return newMsg;\n\n}\n",
        "outputs": 1,
        "noerr": 0,
        "initialize": "",
        "finalize": "",
        "libs": [],
        "x": 470,
        "y": 220,
        "wires": [
            [
                "fd0ccfeec07e0b89",
                "a7a6bacb1396baf9"
            ]
        ]
    },
    {
        "id": "0bf70e246f49db54",
        "type": "mqtt in",
        "z": "af07e2b8ecfdb6a1",
        "name": "AIS Ponton",
        "topic": "training/uc2/real/va6/ponton/ais/#",
        "qos": "2",
        "datatype": "auto-detect",
        "broker": "547cf574.6d3b7c",
        "nl": false,
        "rap": true,
        "rh": 0,
        "inputs": 0,
        "x": 170,
        "y": 340,
        "wires": [
            [
                "dee97768c64e079d"
            ]
        ]
    },
    {
        "id": "dee97768c64e079d",
        "type": "function",
        "z": "af07e2b8ecfdb6a1",
        "name": "repackage   AIS",
        "func": "// parsare JSON\nvar p = msg.payload;\nvar mqttTopic = 'uc2/real/va6/ponton/ais/' + p.ship;\nvar new_payload = {}\n\nnew_payload.latitude = p.latitude\nnew_payload.longitude = p.longitude\nnew_payload.speed = p.speed\n\nvar newMsg = {topic: mqttTopic, payload: new_payload};\nreturn newMsg;\n\n",
        "outputs": 1,
        "noerr": 0,
        "initialize": "",
        "finalize": "",
        "libs": [],
        "x": 460,
        "y": 340,
        "wires": [
            [
                "cca4691b7d38cfc0",
                "0dfa8c0c3fd901d4"
            ]
        ]
    },
    {
        "id": "d46e408374eb8b75",
        "type": "mqtt in",
        "z": "af07e2b8ecfdb6a1",
        "name": "GPS",
        "topic": "training/vital5g/vs9/mercur/gps",
        "qos": "2",
        "datatype": "auto-detect",
        "broker": "547cf574.6d3b7c",
        "nl": false,
        "rap": true,
        "rh": 0,
        "inputs": 0,
        "x": 150,
        "y": 860,
        "wires": [
            [
                "90d3af9ce230a493"
            ]
        ]
    },
    {
        "id": "90d3af9ce230a493",
        "type": "function",
        "z": "af07e2b8ecfdb6a1",
        "name": "repackage   ",
        "func": "// parsare JSON\nvar p = msg.payload;\nvar mqttTopic = 'uc2/real/va6/mercur'\nvar newMsg = {topic: mqttTopic, payload: msg.payload};\nreturn newMsg;",
        "outputs": 1,
        "noerr": 0,
        "initialize": "",
        "finalize": "",
        "libs": [],
        "x": 450,
        "y": 860,
        "wires": [
            [
                "ecf86e2371c91889",
                "a99b3804e19ab9d8"
            ]
        ]
    },
    {
        "id": "8c1ef3ea29853f9e",
        "type": "debug",
        "z": "af07e2b8ecfdb6a1",
        "name": "Ponton Water",
        "active": true,
        "tosidebar": true,
        "console": false,
        "tostatus": false,
        "complete": "payload",
        "targetType": "msg",
        "statusVal": "",
        "statusType": "auto",
        "x": 680,
        "y": 40,
        "wires": []
    },
    {
        "id": "8cd555d8ed04743c",
        "type": "mqtt out",
        "z": "af07e2b8ecfdb6a1",
        "name": "Mqtt Vital",
        "topic": "",
        "qos": "2",
        "retain": "false",
        "respTopic": "",
        "contentType": "",
        "userProps": "",
        "correl": "",
        "expiry": "",
        "broker": "c0337c4.8a46f8",
        "x": 820,
        "y": 220,
        "wires": []
    },
    {
        "id": "fd0ccfeec07e0b89",
        "type": "delay",
        "z": "af07e2b8ecfdb6a1",
        "name": "1ms",
        "pauseType": "delay",
        "timeout": "1",
        "timeoutUnits": "milliseconds",
        "rate": "1",
        "nbRateUnits": "1",
        "rateUnits": "second",
        "randomFirst": "1",
        "randomLast": "5",
        "randomUnits": "seconds",
        "drop": false,
        "outputs": 1,
        "x": 670,
        "y": 220,
        "wires": [
            [
                "8cd555d8ed04743c"
            ]
        ]
    },
    {
        "id": "94d9a4e4a3788b23",
        "type": "mqtt out",
        "z": "af07e2b8ecfdb6a1",
        "name": "Mqtt Vital",
        "topic": "",
        "qos": "2",
        "retain": "false",
        "respTopic": "",
        "contentType": "",
        "userProps": "",
        "correl": "",
        "expiry": "",
        "broker": "c0337c4.8a46f8",
        "x": 820,
        "y": 340,
        "wires": []
    },
    {
        "id": "cca4691b7d38cfc0",
        "type": "delay",
        "z": "af07e2b8ecfdb6a1",
        "name": "1ms",
        "pauseType": "delay",
        "timeout": "1",
        "timeoutUnits": "milliseconds",
        "rate": "1",
        "nbRateUnits": "1",
        "rateUnits": "second",
        "randomFirst": "1",
        "randomLast": "5",
        "randomUnits": "seconds",
        "drop": false,
        "outputs": 1,
        "x": 670,
        "y": 340,
        "wires": [
            [
                "94d9a4e4a3788b23"
            ]
        ]
    },
    {
        "id": "69616d2cda3d462d",
        "type": "mqtt out",
        "z": "af07e2b8ecfdb6a1",
        "name": "Mqtt Vital",
        "topic": "",
        "qos": "2",
        "retain": "false",
        "respTopic": "",
        "contentType": "",
        "userProps": "",
        "correl": "",
        "expiry": "",
        "broker": "c0337c4.8a46f8",
        "x": 820,
        "y": 500,
        "wires": []
    },
    {
        "id": "a3dfa8a9412f3ec1",
        "type": "delay",
        "z": "af07e2b8ecfdb6a1",
        "name": "1ms",
        "pauseType": "delay",
        "timeout": "1",
        "timeoutUnits": "milliseconds",
        "rate": "1",
        "nbRateUnits": "1",
        "rateUnits": "second",
        "randomFirst": "1",
        "randomLast": "5",
        "randomUnits": "seconds",
        "drop": false,
        "outputs": 1,
        "x": 670,
        "y": 500,
        "wires": [
            [
                "69616d2cda3d462d"
            ]
        ]
    },
    {
        "id": "3fb23cce086c38c5",
        "type": "mqtt out",
        "z": "af07e2b8ecfdb6a1",
        "name": "Mqtt Vital",
        "topic": "",
        "qos": "2",
        "retain": "false",
        "respTopic": "",
        "contentType": "",
        "userProps": "",
        "correl": "",
        "expiry": "",
        "broker": "c0337c4.8a46f8",
        "x": 820,
        "y": 620,
        "wires": []
    },
    {
        "id": "1b6df0847593187d",
        "type": "delay",
        "z": "af07e2b8ecfdb6a1",
        "name": "1ms",
        "pauseType": "delay",
        "timeout": "1",
        "timeoutUnits": "milliseconds",
        "rate": "1",
        "nbRateUnits": "1",
        "rateUnits": "second",
        "randomFirst": "1",
        "randomLast": "5",
        "randomUnits": "seconds",
        "drop": false,
        "outputs": 1,
        "x": 670,
        "y": 620,
        "wires": [
            [
                "3fb23cce086c38c5"
            ]
        ]
    },
    {
        "id": "a52d1b3fc5bdeacd",
        "type": "mqtt out",
        "z": "af07e2b8ecfdb6a1",
        "name": "Mqtt Vital",
        "topic": "",
        "qos": "2",
        "retain": "false",
        "respTopic": "",
        "contentType": "",
        "userProps": "",
        "correl": "",
        "expiry": "",
        "broker": "c0337c4.8a46f8",
        "x": 820,
        "y": 860,
        "wires": []
    },
    {
        "id": "ecf86e2371c91889",
        "type": "delay",
        "z": "af07e2b8ecfdb6a1",
        "name": "1ms",
        "pauseType": "delay",
        "timeout": "1",
        "timeoutUnits": "milliseconds",
        "rate": "1",
        "nbRateUnits": "1",
        "rateUnits": "second",
        "randomFirst": "1",
        "randomLast": "5",
        "randomUnits": "seconds",
        "drop": false,
        "outputs": 1,
        "x": 670,
        "y": 860,
        "wires": [
            [
                "a52d1b3fc5bdeacd"
            ]
        ]
    },
    {
        "id": "a7a6bacb1396baf9",
        "type": "debug",
        "z": "af07e2b8ecfdb6a1",
        "name": "Ponton Depth",
        "active": true,
        "tosidebar": true,
        "console": false,
        "tostatus": false,
        "complete": "payload",
        "targetType": "msg",
        "statusVal": "",
        "statusType": "auto",
        "x": 680,
        "y": 160,
        "wires": []
    },
    {
        "id": "0dfa8c0c3fd901d4",
        "type": "debug",
        "z": "af07e2b8ecfdb6a1",
        "name": "Ponton AIS",
        "active": true,
        "tosidebar": true,
        "console": false,
        "tostatus": false,
        "complete": "payload",
        "targetType": "msg",
        "statusVal": "",
        "statusType": "auto",
        "x": 670,
        "y": 280,
        "wires": []
    },
    {
        "id": "bcefcc07999bd3b9",
        "type": "debug",
        "z": "af07e2b8ecfdb6a1",
        "name": "Ship Air",
        "active": true,
        "tosidebar": true,
        "console": false,
        "tostatus": false,
        "complete": "payload",
        "targetType": "msg",
        "statusVal": "",
        "statusType": "auto",
        "x": 660,
        "y": 440,
        "wires": []
    },
    {
        "id": "7f06f347d9e45dd6",
        "type": "debug",
        "z": "af07e2b8ecfdb6a1",
        "name": "Ship Depth",
        "active": true,
        "tosidebar": true,
        "console": false,
        "tostatus": false,
        "complete": "payload",
        "targetType": "msg",
        "statusVal": "",
        "statusType": "auto",
        "x": 670,
        "y": 560,
        "wires": []
    },
    {
        "id": "81cfd71eb63f9663",
        "type": "debug",
        "z": "af07e2b8ecfdb6a1",
        "name": "Ship AIS",
        "active": true,
        "tosidebar": true,
        "console": false,
        "tostatus": false,
        "complete": "payload",
        "targetType": "msg",
        "statusVal": "",
        "statusType": "auto",
        "x": 660,
        "y": 680,
        "wires": []
    },
    {
        "id": "25ed84b957f2096b",
        "type": "mqtt out",
        "z": "af07e2b8ecfdb6a1",
        "name": "Mqtt Vital",
        "topic": "",
        "qos": "2",
        "retain": "false",
        "respTopic": "",
        "contentType": "",
        "userProps": "",
        "correl": "",
        "expiry": "",
        "broker": "c0337c4.8a46f8",
        "x": 820,
        "y": 740,
        "wires": []
    },
    {
        "id": "99eb665dac1762a9",
        "type": "delay",
        "z": "af07e2b8ecfdb6a1",
        "name": "1ms",
        "pauseType": "delay",
        "timeout": "1",
        "timeoutUnits": "milliseconds",
        "rate": "1",
        "nbRateUnits": "1",
        "rateUnits": "second",
        "randomFirst": "1",
        "randomLast": "5",
        "randomUnits": "seconds",
        "drop": false,
        "outputs": 1,
        "x": 670,
        "y": 740,
        "wires": [
            [
                "25ed84b957f2096b"
            ]
        ]
    },
    {
        "id": "a99b3804e19ab9d8",
        "type": "debug",
        "z": "af07e2b8ecfdb6a1",
        "name": "Ship GPS",
        "active": true,
        "tosidebar": true,
        "console": false,
        "tostatus": false,
        "complete": "payload",
        "targetType": "msg",
        "statusVal": "",
        "statusType": "auto",
        "x": 660,
        "y": 800,
        "wires": []
    },
    {
        "id": "cfcf529b9646a21f",
        "type": "mqtt in",
        "z": "af07e2b8ecfdb6a1",
        "name": "Backup Mqtt Libelium Water",
        "topic": "training/uc2/backup/va6/water",
        "qos": "2",
        "datatype": "json",
        "broker": "7cd82d51283d79bc",
        "nl": false,
        "rap": false,
        "inputs": 0,
        "x": 200,
        "y": 1060,
        "wires": [
            [
                "a6798b3ad94f6b2d",
                "621acd57284e0061"
            ]
        ]
    },
    {
        "id": "7569b7df6ab7379c",
        "type": "mqtt in",
        "z": "af07e2b8ecfdb6a1",
        "name": "Backup Libelium Air",
        "topic": "training/uc2/backup/va6/air",
        "qos": "2",
        "datatype": "auto-detect",
        "broker": "7cd82d51283d79bc",
        "nl": false,
        "rap": false,
        "inputs": 0,
        "x": 190,
        "y": 1320,
        "wires": [
            [
                "9f806dcd0d563647",
                "621acd57284e0061"
            ]
        ]
    },
    {
        "id": "07143956a9b09718",
        "type": "mqtt in",
        "z": "af07e2b8ecfdb6a1",
        "name": "Backup Depth Ship",
        "topic": "training/uc2/backup/va6/dep_ship",
        "qos": "2",
        "datatype": "auto-detect",
        "broker": "547cf574.6d3b7c",
        "nl": false,
        "rap": true,
        "rh": 0,
        "inputs": 0,
        "x": 190,
        "y": 1420,
        "wires": [
            [
                "dcdfe127064b694b",
                "621acd57284e0061"
            ]
        ]
    },
    {
        "id": "5839935cdbe1dcf8",
        "type": "mqtt in",
        "z": "af07e2b8ecfdb6a1",
        "name": "Backup Depth Ponton",
        "topic": "training/uc2/backup/va6/dep_ponton",
        "qos": "2",
        "datatype": "auto-detect",
        "broker": "7cd82d51283d79bc",
        "nl": false,
        "rap": true,
        "rh": 0,
        "inputs": 0,
        "x": 200,
        "y": 1180,
        "wires": [
            [
                "1581cc55b1e0579b",
                "621acd57284e0061"
            ]
        ]
    },
    {
        "id": "926827830aeddc78",
        "type": "mqtt in",
        "z": "af07e2b8ecfdb6a1",
        "name": "Backup GPS",
        "topic": "training/uc2/backup/va6/gps",
        "qos": "2",
        "datatype": "auto-detect",
        "broker": "547cf574.6d3b7c",
        "nl": false,
        "rap": true,
        "rh": 0,
        "inputs": 0,
        "x": 170,
        "y": 1520,
        "wires": [
            [
                "eb26e5b5ac2bc4a8",
                "621acd57284e0061"
            ]
        ]
    },
    {
        "id": "a6798b3ad94f6b2d",
        "type": "function",
        "z": "af07e2b8ecfdb6a1",
        "name": "redirect",
        "func": "var mqttTopic = 'uc2/backup/va6/ponton';\nvar newMsg = { topic: mqttTopic, payload: msg.payload };\nreturn newMsg;\n\n\n",
        "outputs": 1,
        "noerr": 0,
        "initialize": "",
        "finalize": "",
        "libs": [],
        "x": 460,
        "y": 1060,
        "wires": [
            [
                "5da5fe7daf72e8ac",
                "621acd57284e0061"
            ]
        ]
    },
    {
        "id": "5da5fe7daf72e8ac",
        "type": "mqtt out",
        "z": "af07e2b8ecfdb6a1",
        "name": "Mqtt Vital",
        "topic": "",
        "qos": "2",
        "retain": "false",
        "respTopic": "",
        "contentType": "",
        "userProps": "",
        "correl": "",
        "expiry": "",
        "broker": "c0337c4.8a46f8",
        "x": 660,
        "y": 1060,
        "wires": []
    },
    {
        "id": "1581cc55b1e0579b",
        "type": "function",
        "z": "af07e2b8ecfdb6a1",
        "name": "redirect",
        "func": "var mqttTopic = 'uc2/backup/va6/ponton';\nvar newMsg = { topic: mqttTopic, payload: msg.payload };\nreturn newMsg;\n\n\n",
        "outputs": 1,
        "noerr": 0,
        "initialize": "",
        "finalize": "",
        "libs": [],
        "x": 460,
        "y": 1180,
        "wires": [
            [
                "bdad14df3edfccde",
                "621acd57284e0061"
            ]
        ]
    },
    {
        "id": "bdad14df3edfccde",
        "type": "mqtt out",
        "z": "af07e2b8ecfdb6a1",
        "name": "Mqtt Vital",
        "topic": "",
        "qos": "2",
        "retain": "false",
        "respTopic": "",
        "contentType": "",
        "userProps": "",
        "correl": "",
        "expiry": "",
        "broker": "c0337c4.8a46f8",
        "x": 660,
        "y": 1180,
        "wires": []
    },
    {
        "id": "9f806dcd0d563647",
        "type": "function",
        "z": "af07e2b8ecfdb6a1",
        "name": "redirect",
        "func": "var mqttTopic = 'uc2/backup/va6/mercur';\nvar newMsg = { topic: mqttTopic, payload: msg.payload };\nreturn newMsg;\n\n\n",
        "outputs": 1,
        "noerr": 0,
        "initialize": "",
        "finalize": "",
        "libs": [],
        "x": 460,
        "y": 1320,
        "wires": [
            [
                "96972a810807534a",
                "621acd57284e0061"
            ]
        ]
    },
    {
        "id": "96972a810807534a",
        "type": "mqtt out",
        "z": "af07e2b8ecfdb6a1",
        "name": "Mqtt Vital",
        "topic": "",
        "qos": "2",
        "retain": "false",
        "respTopic": "",
        "contentType": "",
        "userProps": "",
        "correl": "",
        "expiry": "",
        "broker": "c0337c4.8a46f8",
        "x": 660,
        "y": 1320,
        "wires": []
    },
    {
        "id": "dcdfe127064b694b",
        "type": "function",
        "z": "af07e2b8ecfdb6a1",
        "name": "redirect",
        "func": "var mqttTopic = 'uc2/backup/va6/mercur';\nvar newMsg = { topic: mqttTopic, payload: msg.payload };\nreturn newMsg;\n\n\n",
        "outputs": 1,
        "noerr": 0,
        "initialize": "",
        "finalize": "",
        "libs": [],
        "x": 460,
        "y": 1420,
        "wires": [
            [
                "abb21078ef0c9605",
                "621acd57284e0061"
            ]
        ]
    },
    {
        "id": "abb21078ef0c9605",
        "type": "mqtt out",
        "z": "af07e2b8ecfdb6a1",
        "name": "Mqtt Vital",
        "topic": "",
        "qos": "2",
        "retain": "false",
        "respTopic": "",
        "contentType": "",
        "userProps": "",
        "correl": "",
        "expiry": "",
        "broker": "c0337c4.8a46f8",
        "x": 660,
        "y": 1420,
        "wires": []
    },
    {
        "id": "eb26e5b5ac2bc4a8",
        "type": "function",
        "z": "af07e2b8ecfdb6a1",
        "name": "redirect",
        "func": "var mqttTopic = 'uc2/backup/va6/mercur';\nvar newMsg = { topic: mqttTopic, payload: msg.payload };\nreturn newMsg;\n\n\n",
        "outputs": 1,
        "noerr": 0,
        "initialize": "",
        "finalize": "",
        "libs": [],
        "x": 460,
        "y": 1520,
        "wires": [
            [
                "e3102c1bc8c565be",
                "621acd57284e0061"
            ]
        ]
    },
    {
        "id": "e3102c1bc8c565be",
        "type": "mqtt out",
        "z": "af07e2b8ecfdb6a1",
        "name": "Mqtt Vital",
        "topic": "",
        "qos": "2",
        "retain": "false",
        "respTopic": "",
        "contentType": "",
        "userProps": "",
        "correl": "",
        "expiry": "",
        "broker": "c0337c4.8a46f8",
        "x": 660,
        "y": 1520,
        "wires": []
    },
    {
        "id": "621acd57284e0061",
        "type": "debug",
        "z": "af07e2b8ecfdb6a1",
        "name": "Backup",
        "active": true,
        "tosidebar": true,
        "console": false,
        "tostatus": false,
        "complete": "payload",
        "targetType": "msg",
        "statusVal": "",
        "statusType": "auto",
        "x": 420,
        "y": 1640,
        "wires": []
    },
    {
        "id": "7cd82d51283d79bc",
        "type": "mqtt-broker",
        "name": "",
        "broker": "mqtt.beia-telemetrie.ro",
        "port": "1883",
        "clientid": "",
        "autoConnect": true,
        "usetls": false,
        "protocolVersion": "4",
        "keepalive": "60",
        "cleansession": true,
        "birthTopic": "",
        "birthQos": "0",
        "birthPayload": "",
        "birthMsg": {},
        "closeTopic": "",
        "closeQos": "0",
        "closePayload": "",
        "closeMsg": {},
        "willTopic": "",
        "willQos": "0",
        "willPayload": "",
        "willMsg": {},
        "userProps": "",
        "sessionExpiry": ""
    },
    {
        "id": "547cf574.6d3b7c",
        "type": "mqtt-broker",
        "name": "beia-vanilla",
        "broker": "mqtt.beia-telemetrie.ro",
        "port": "1883",
        "clientid": "",
        "autoConnect": true,
        "usetls": false,
        "protocolVersion": 4,
        "keepalive": "60",
        "cleansession": true,
        "birthTopic": "",
        "birthQos": "0",
        "birthPayload": "",
        "closeTopic": "",
        "closeQos": "0",
        "closePayload": "",
        "willTopic": "",
        "willQos": "0",
        "willPayload": ""
    },
    {
        "id": "c0337c4.8a46f8",
        "type": "mqtt-broker",
        "name": "vital-5g",
        "broker": "172.28.22.165",
        "port": "1883",
        "clientid": "",
        "autoConnect": true,
        "usetls": false,
        "compatmode": false,
        "protocolVersion": "4",
        "keepalive": "60",
        "cleansession": true,
        "birthTopic": "",
        "birthQos": "0",
        "birthRetain": "false",
        "birthPayload": "",
        "birthMsg": {},
        "closeTopic": "",
        "closeQos": "0",
        "closeRetain": "false",
        "closePayload": "",
        "closeMsg": {},
        "willTopic": "",
        "willQos": "0",
        "willRetain": "false",
        "willPayload": "",
        "willMsg": {},
        "userProps": "",
        "sessionExpiry": ""
    }
]