{
    "openapi": "3.0.2",
    "info": {
        "title": "VITAL-5G monitoring platform",
        "version": "1.0.0"
    },
    "servers": [
        {
            "url": "http://172.28.18.102:8080/api/v1/platform",
            "description": "development"
        }
    ],
    "paths": {
        "/infrastructure": {
            "summary": "Path used to manage the list of infrastructuremetrics.",
            "description": "The REST endpoint/path used to list and create zero or more `InfrastructureMetric` entities.  This path contains a `GET` and `POST` operation to perform the list and create tasks, respectively.",
            "post": {
                "requestBody": {
                    "description": "A new `InfrastructureMetric` to be created.",
                    "content": {
                        "application/json": {
                            "schema": {
                                "$ref": "#/components/schemas/InfrastructureMetric"
                            }
                        }
                    },
                    "required": true
                },
                "tags": [
                    "InfrastructureMetrics"
                ],
                "responses": {
                    "201": {
                        "content": {
                            "application/json": {
                                "schema": {
                                    "$ref": "#/components/schemas/responseServiceLCM"
                                }
                            }
                        },
                        "description": "Successful response."
                    }
                },
                "operationId": "createInfrastructureMetric",
                "summary": "Create a InfrastructureMetric",
                "description": "Creates a new instance of a `InfrastructureMetric`."
            }
        },
        "/infrastructure/{topic}": {
            "summary": "Path used to manage a single InfrastructureMetric.",
            "description": "The REST endpoint/path used to get, update, and delete single instances of an `InfrastructureMetric`.  This path contains `GET`, `PUT`, and `DELETE` operations used to perform the get, update, and delete tasks, respectively.",
            "delete": {
                "responses": {
                    "204": {
                        "description": "Successful response."
                    }
                },
                "operationId": "deleteInfrastructureMetric",
                "summary": "Delete a InfrastructureMetric",
                "description": "Deletes an existing `InfrastructureMetric`."
            },
            "parameters": [
                {
                    "name": "topic",
                    "description": "A unique identifier for a `InfrastructureMetric`.",
                    "schema": {
                        "type": "string"
                    },
                    "in": "path",
                    "required": true
                }
            ]
        },
        "/platform": {
            "summary": "Path used to manage the list of platformmetrics.",
            "description": "The REST endpoint/path used to list and create zero or more `PlatformMetric` entities.  This path contains a `GET` and `POST` operation to perform the list and create tasks, respectively.",
            "post": {
                "requestBody": {
                    "description": "A new `PlatformMetric` to be created.",
                    "content": {
                        "application/json": {
                            "schema": {
                                "$ref": "#/components/schemas/PlatformMetric"
                            }
                        }
                    },
                    "required": true
                },
                "responses": {
                    "201": {
                        "content": {
                            "application/json": {
                                "schema": {
                                    "$ref": "#/components/schemas/responseServiceLCM"
                                }
                            }
                        },
                        "description": "Successful response."
                    }
                },
                "operationId": "createPlatformMetric",
                "summary": "Create a PlatformMetric",
                "description": "Creates a new instance of a `PlatformMetric`."
            }
        },
        "/platform/{topic}": {
            "summary": "Path used to manage a single PlatformMetric.",
            "description": "The REST endpoint/path used to get, update, and delete single instances of an `PlatformMetric`.  This path contains `GET`, `PUT`, and `DELETE` operations used to perform the get, update, and delete tasks, respectively.",
            "delete": {
                "responses": {
                    "204": {
                        "description": "Successful response."
                    }
                },
                "operationId": "deletePlatformMetric",
                "summary": "Delete a PlatformMetric",
                "description": "Deletes an existing `PlatformMetric`."
            },
            "parameters": [
                {
                    "name": "topic",
                    "description": "A unique identifier for a `PlatformMetric`.",
                    "schema": {
                        "type": "string"
                    },
                    "in": "path",
                    "required": true
                }
            ]
        },
        "/service": {
            "summary": "Path used to manage the list of applicationmetrics.",
            "description": "The REST endpoint/path used to list and create zero or more `ApplicationMetric` entities.  This path contains a `GET` and `POST` operation to perform the list and create tasks, respectively.",
            "post": {
                "requestBody": {
                    "description": "A new `ApplicationMetric` to be created.",
                    "content": {
                        "application/json": {
                            "schema": {
                                "$ref": "#/components/schemas/ServiceMetric"
                            }
                        }
                    },
                    "required": true
                },
                "responses": {
                    "201": {
                        "content": {
                            "application/json": {
                                "schema": {
                                    "$ref": "#/components/schemas/responseServiceLCM"
                                }
                            }
                        },
                        "description": "Successful response."
                    }
                },
                "operationId": "createApplicationMetric",
                "summary": "Create a ApplicationMetric",
                "description": "Creates a new instance of a `ApplicationMetric`."
            }
        },
        "/service/{topic}": {
            "summary": "Path used to manage a single ApplicationMetric.",
            "description": "The REST endpoint/path used to get, update, and delete single instances of an `ApplicationMetric`.  This path contains `GET`, `PUT`, and `DELETE` operations used to perform the get, update, and delete tasks, respectively.",
            "delete": {
                "parameters": [
                    {
                        "examples": {
                            "Example  topic ": {
                                "value": "VSIDc56f37fa-10a6-4f28-af64-9aeca964dd91-antwerp-infrastructure-disk_usage-878371ce-93a3-471f-8496-b5575fb5d5ce"
                            }
                        },
                        "name": "topic",
                        "description": "A unique identifier for a `ApplicationMetric`.",
                        "schema": {
                            "type": "string"
                        },
                        "in": "path",
                        "required": true
                    }
                ],
                "responses": {
                    "204": {
                        "description": "Successful response."
                    }
                },
                "operationId": "deleteApplicationMetric",
                "summary": "Delete a ApplicationMetric",
                "description": "Deletes an existing `ApplicationMetric`."
            },
            "parameters": [
                {
                    "name": "topic",
                    "description": "A unique identifier for a `ApplicationMetric`.",
                    "schema": {
                        "type": "string"
                    },
                    "in": "path",
                    "required": true
                }
            ]
        },
        "/kpi": {
            "description": "Path used to activate the Monitoring Platform to start collecting KPIs. The Service LCM tells the VITAL-5G Centralised Monitoring Platform to which topic he needs to subscribe to retrieve the KPIs.",
            "post": {
                "requestBody": {
                    "content": {
                        "application/json": {
                            "schema": {
                                "$ref": "#/components/schemas/baseKPI"
                            }
                        }
                    },
                    "required": true
                },
                "summary": "Create a InfrastructureKpi",
                "description": "Creates a new instance of a `infrastructureKpi`."
            }
        },
        "/kpi/{topic}": {
            "delete": {
                "parameters": [
                    {
                        "name": "topic",
                        "schema": {
                            "type": "string"
                        },
                        "in": "path",
                        "required": true
                    }
                ],
                "summary": "Delete a InfrastructureKpi",
                "description": "Deletes an existing `infrastructureKpi` instance."
            }
        }
    },
    "components": {
        "schemas": {
            "BaseMetric": {
                "description": "",
                "required": [
                    "metricId",
                    "verticalServiceInstanceId",
                    "testbed",
                    "unit",
                    "useCase",
                    "metricKPI",
                    "metricCollectionType"
                ],
                "type": "object",
                "properties": {
                    "metricId": {
                        "description": "",
                        "type": "string"
                    },
                    "verticalServiceInstanceId": {
                        "description": "",
                        "type": "string"
                    },
                    "testbed": {
                        "description": "",
                        "enum": [
                            "ATHENS",
                            "ANTWERP",
                            "GALATI"
                        ],
                        "type": "string"
                    },
                    "metricGraphType": {
                        "description": "",
                        "enum": [
                            "LINE",
                            "BAR"
                        ],
                        "type": "string"
                    },
                    "unit": {
                        "description": "",
                        "type": "string"
                    },
                    "useCase": {
                        "description": "",
                        "type": "string"
                    },
                    "metricKPI": {
                        "description": "To specify which metric type you want to measure/get the results from. \nE.g., \n- for the metric \"Platform\" the metricKPI can be: \"onBoardingDelay\"\n- for the metric \"Network\" the metricKPI can be: \"latency\"\n- for the metric \"Service\" the metricKPI can be: \"averageResponseTime\"\n- for the metric \"infrastructure\" the metricKPI can be: \"memoryLoad\"\nSee, https://docs.google.com/spreadsheets/d/1-67YquHjRGxybjtsgCCyaBOMgEa-YiGHIeac-qmuj0o/edit#gid=1716003726 \nfor examples in the topic name < KPI > you see examples. ",
                        "type": "string"
                    },
                    "metricCollectionType": {
                        "description": "",
                        "enum": [
                            "CUMULATIVE",
                            "DELTA",
                            "GAUGE"
                        ],
                        "type": "string"
                    }
                }
            },
            "InfrastructureMetric": {
                "description": "Brief recap the VITAL-5G Centralised monitoring makes a distinction between network metrics and infrastructure metrics. How it does that is as follows if the vmReference is included in the POST request it is seen as an infrastructure metric if the sliceId is provided in the POST request (instead of the vmReference) it is seen as Network metric. Thus, from the moment sliceId is not provided it is seen as a infrastructure metric",
                "required": [
                    "infrastructureMetricType",
                    "metricKPI"
                ],
                "type": "object",
                "allOf": [
                    {
                        "$ref": "#/components/schemas/BaseMetric"
                    }
                ],
                "properties": {
                    "infrastructureMetricType": {
                        "description": "",
                        "enum": [
                            "USER_EXPERIENCED_DOWNLINK_DATA_RATE",
                            "USER_EXPERIENCED_UPLINK_DATA_RATE",
                            "PACKET_DELIVERY_RATIO",
                            "PACKET_LOSS",
                            "E2E_LATENCY",
                            "JITTER",
                            "DROPPED_PACKETS_PER_SECOND",
                            "FORWARDED_PACKETS_PER_SECOND",
                            "DROPPED_BYTES_PER_SECOND",
                            "FORWARDED_BYTES_PER_SECOND",
                            "DISK_USAGE",
                            "CPU_LOAD",
                            "GPU_LOAD",
                            "RAM_USAGE"
                        ],
                        "type": "string"
                    },
                    "sliceId": {
                        "description": "",
                        "type": "string"
                    },
                    "vmReference": {
                        "description": "",
                        "type": "string"
                    },
                    "metricKPI": {
                        "description": "",
                        "enum": [
                            "USER_EXPERIENCED_DOWNLINK_DATA_RATE",
                            "USER_EXPERIENCED_UPLINK_DATA_RATE",
                            "PACKET_DELIVERY_RATIO",
                            "PACKET_LOSS",
                            "E2E_LATENCY",
                            "JITTER",
                            "DROPPED_PACKETS_PER_SECOND",
                            "FORWARDED_PACKETS_PER_SECOND",
                            "DROPPED_BYTES_PER_SECOND",
                            "FORWARDED_BYTES_PER_SECOND",
                            "DISK_USAGE",
                            "CPU_LOAD",
                            "GPU_LOAD",
                            "RAM_USAGE"
                        ],
                        "type": "string"
                    }
                },
                "example": {
                    "verticalServiceInstanceId": "7825aa14-a1bd-4fcb-b38e-9adc418c12c0",
                    "metricId": "iotEventAlertManagerCpuLoad",
                    "useCase": "useCase10",
                    "infrastructureMetricType": "CPU_LOAD",
                    "metricGraphType": "LINE",
                    "unit": "%",
                    "testbed": "ANTWERP",
                    "vmReference": "iotEventAlertManager",
                    "metricKPI": "CPU_LOAD"
                }
            },
            "PlatformMetric": {
                "description": "",
                "required": [
                    "vmReference"
                ],
                "type": "object",
                "allOf": [
                    {
                        "$ref": "#/components/schemas/BaseMetric"
                    }
                ],
                "properties": {
                    "vmReference": {
                        "description": "\"27437253-4815-43d0-9277-66ba8e766c6c\"",
                        "type": "string"
                    }
                }
            },
            "ServiceMetric": {
                "description": "",
                "required": [
                    "vmReference"
                ],
                "type": "object",
                "allOf": [
                    {
                        "$ref": "#/components/schemas/BaseMetric"
                    }
                ],
                "properties": {
                    "vmReference": {
                        "description": "",
                        "type": "string"
                    }
                }
            },
            "baseKPI": {
                "description": "",
                "required": [
                    "kpiCollectionType",
                    "kpiGraphType",
                    "kpiId",
                    "testbed",
                    "unit",
                    "useCase",
                    "verticalServiceInstanceId",
                    "kpi"
                ],
                "type": "object",
                "properties": {
                    "kpiCollectionType": {
                        "description": "The specific metric that needs to be monitored",
                        "enum": [
                            "CUMULATIVE",
                            "DELTA",
                            "GAUGE"
                        ],
                        "type": "string"
                    },
                    "kpiId": {
                        "description": "The specific metric that needs to be monitired it is the same field as the metricId.",
                        "type": "string"
                    },
                    "testbed": {
                        "description": "",
                        "enum": [
                            "ATHENS",
                            "ANTWERP",
                            "GALATI"
                        ],
                        "type": "string"
                    },
                    "unit": {
                        "description": "",
                        "type": "string"
                    },
                    "useCase": {
                        "description": "",
                        "type": "string"
                    },
                    "verticalServiceInstanceId": {
                        "description": "",
                        "type": "string"
                    },
                    "kpi": {
                        "description": "The name of the computed KPI. (like we had for the metrics: `metricKpi`) ",
                        "type": "string"
                    },
                    "kpiGraphType": {
                        "description": "The graph type",
                        "enum": [
                            "LINE",
                            "BAR"
                        ],
                        "type": "string"
                    }
                }
            },
            "responseServiceLCM": {
                "description": "",
                "required": [
                    "topic",
                    "monitoringDashboardUrl"
                ],
                "type": "object",
                "properties": {
                    "topic": {
                        "description": "The topic name generated by the VITAL-5G Centralised Monitoring Platform.",
                        "type": "string",
                        "example": "VSIDc56f37fa-10a6-4f28-af64-9aeca964dd91-antwerp-infrastructure-disk_usage-878371ce-93a3-471f-8496-b5575fb5d5ce"
                    },
                    "monitoringDashboardUrl": {
                        "description": "The url to the dashboard with all the panels for this vertical service instance id.",
                        "type": "string",
                        "example": "http://172.28.18.102:3000/d/7KiCI5NVk/7825aa14-a1bd-4fcb-b38e-9adc418c12c0_CPU_LOAD"
                    }
                }
            }
        }
    }
}