{
    "data": {
        "sketch": {
            "train": [
                {
                    "img_path": "sketch/aircraft_carrier/sketch_001_000056.jpg",
                    "label": "aircraft_carrier"
                },
                {
                    "img_path": "sketch/aircraft_carrier/sketch_001_000032.jpg",
                    "label": "aircraft_carrier"
                },
                {
                    "img_path": "sketch/aircraft_carrier/sketch_001_000038.jpg",
                    "label": "aircraft_carrier"
                },
                {
                    "img_path": "sketch/aircraft_carrier/sketch_001_000050.jpg",
                    "label": "aircraft_carrier"
                },
                {
                    "img_path": "sketch/aircraft_carrier/sketch_001_000062.jpg",
                    "label": "aircraft_carrier"
                }
            ],
            "test": [
                {
                    "img_path": "sketch/aircraft_carrier/sketch_001_000061.jpg",
                    "label": "aircraft_carrier"
                },
                {
                    "img_path": "sketch/aircraft_carrier/sketch_001_000027.jpg",
                    "label": "aircraft_carrier"
                },
                {
                    "img_path": "sketch/aircraft_carrier/sketch_001_000046.jpg",
                    "label": "aircraft_carrier"
                },
                {
                    "img_path": "sketch/aircraft_carrier/sketch_001_000015.jpg",
                    "label": "aircraft_carrier"
                },
                {
                    "img_path": "sketch/aircraft_carrier/sketch_001_000016.jpg",
                    "label": "aircraft_carrier"
                }
            ]
        },
        "real": {
            "train": [
                {
                    "img_path": "real/aircraft_carrier/real_001_000322.jpg",
                    "label": "aircraft_carrier"
                },
                {
                    "img_path": "real/aircraft_carrier/real_001_000250.jpg",
                    "label": "aircraft_carrier"
                },
                {
                    "img_path": "real/aircraft_carrier/real_001_000227.jpg",
                    "label": "aircraft_carrier"
                },
                {
                    "img_path": "real/aircraft_carrier/real_001_000142.jpg",
                    "label": "aircraft_carrier"
                },
                {
                    "img_path": "real/aircraft_carrier/real_001_000308.jpg",
                    "label": "aircraft_carrier"
                }
            ],
            "test": [
                {
                    "img_path": "real/aircraft_carrier/real_001_000116.jpg",
                    "label": "aircraft_carrier"
                },
                {
                    "img_path": "real/aircraft_carrier/real_001_000220.jpg",
                    "label": "aircraft_carrier"
                },
                {
                    "img_path": "real/aircraft_carrier/real_001_000216.jpg",
                    "label": "aircraft_carrier"
                },
                {
                    "img_path": "real/aircraft_carrier/real_001_000103.jpg",
                    "label": "aircraft_carrier"
                },
                {
                    "img_path": "real/aircraft_carrier/real_001_000378.jpg",
                    "label": "aircraft_carrier"
                }
            ]
        },
        "clipart": {
            "train": [
                {
                    "img_path": "clipart/aircraft_carrier/clipart_001_000008.jpg",
                    "label": "aircraft_carrier"
                },
                {
                    "img_path": "clipart/aircraft_carrier/clipart_001_000027.jpg",
                    "label": "aircraft_carrier"
                },
                {
                    "img_path": "clipart/aircraft_carrier/clipart_001_000009.jpg",
                    "label": "aircraft_carrier"
                },
                {
                    "img_path": "clipart/aircraft_carrier/clipart_001_000006.jpg",
                    "label": "aircraft_carrier"
                },
                {
                    "img_path": "clipart/aircraft_carrier/clipart_001_000005.jpg",
                    "label": "aircraft_carrier"
                }
            ],
            "test": [
                {
                    "img_path": "clipart/aircraft_carrier/clipart_001_000014.jpg",
                    "label": "aircraft_carrier"
                },
                {
                    "img_path": "clipart/aircraft_carrier/clipart_001_000013.jpg",
                    "label": "aircraft_carrier"
                },
                {
                    "img_path": "clipart/aircraft_carrier/clipart_001_000016.jpg",
                    "label": "aircraft_carrier"
                },
                {
                    "img_path": "clipart/aircraft_carrier/clipart_001_000011.jpg",
                    "label": "aircraft_carrier"
                },
                {
                    "img_path": "clipart/aircraft_carrier/clipart_001_000003.jpg",
                    "label": "aircraft_carrier"
                }
            ]
        },
        "painting": {
            "train": [
                {
                    "img_path": "painting/aircraft_carrier/painting_001_000094.jpg",
                    "label": "aircraft_carrier"
                },
                {
                    "img_path": "painting/aircraft_carrier/painting_001_000069.jpg",
                    "label": "aircraft_carrier"
                },
                {
                    "img_path": "painting/aircraft_carrier/painting_001_000034.jpg",
                    "label": "aircraft_carrier"
                },
                {
                    "img_path": "painting/aircraft_carrier/painting_001_000019.jpg",
                    "label": "aircraft_carrier"
                },
                {
                    "img_path": "painting/aircraft_carrier/painting_001_000075.jpg",
                    "label": "aircraft_carrier"
                }
            ],
            "test": [
                {
                    "img_path": "painting/aircraft_carrier/painting_001_000120.jpg",
                    "label": "aircraft_carrier"
                },
                {
                    "img_path": "painting/aircraft_carrier/painting_001_000030.jpg",
                    "label": "aircraft_carrier"
                },
                {
                    "img_path": "painting/aircraft_carrier/painting_001_000099.jpg",
                    "label": "aircraft_carrier"
                },
                {
                    "img_path": "painting/aircraft_carrier/painting_001_000015.jpg",
                    "label": "aircraft_carrier"
                },
                {
                    "img_path": "painting/aircraft_carrier/painting_001_000053.jpg",
                    "label": "aircraft_carrier"
                }
            ]
        }
    },
    "index2label": {
        "0": "The_Eiffel_Tower",
        "1": "The_Great_Wall_of_China",
        "2": "aircraft_carrier",
        "3": "alarm_clock",
        "4": "ant",
        "5": "anvil",
        "6": "asparagus",
        "7": "axe",
        "8": "banana",
        "9": "basket",
        "10": "bathtub",
        "11": "bear",
        "12": "bee",
        "13": "bird",
        "14": "blackberry",
        "15": "blueberry",
        "16": "bottlecap",
        "17": "broccoli",
        "18": "bus",
        "19": "butterfly",
        "20": "cactus",
        "21": "cake",
        "22": "calculator",
        "23": "camel",
        "24": "camera",
        "25": "candle",
        "26": "cannon",
        "27": "canoe",
        "28": "carrot",
        "29": "castle",
        "30": "cat",
        "31": "ceiling_fan",
        "32": "cell_phone",
        "33": "cello",
        "34": "chair",
        "35": "chandelier",
        "36": "coffee_cup",
        "37": "compass",
        "38": "computer",
        "39": "cow",
        "40": "crab",
        "41": "crocodile",
        "42": "cruise_ship",
        "43": "dog",
        "44": "dolphin",
        "45": "dragon",
        "46": "drums",
        "47": "duck",
        "48": "dumbbell",
        "49": "elephant",
        "50": "eyeglasses",
        "51": "feather",
        "52": "fence",
        "53": "fish",
        "54": "flamingo",
        "55": "flower",
        "56": "foot",
        "57": "fork",
        "58": "frog",
        "59": "giraffe",
        "60": "goatee",
        "61": "grapes",
        "62": "guitar",
        "63": "hammer",
        "64": "helicopter",
        "65": "helmet",
        "66": "horse",
        "67": "kangaroo",
        "68": "lantern",
        "69": "laptop",
        "70": "leaf",
        "71": "lion",
        "72": "lipstick",
        "73": "lobster",
        "74": "microphone",
        "75": "monkey",
        "76": "mosquito",
        "77": "mouse",
        "78": "mug",
        "79": "mushroom",
        "80": "onion",
        "81": "panda",
        "82": "peanut",
        "83": "pear",
        "84": "peas",
        "85": "pencil",
        "86": "penguin",
        "87": "pig",
        "88": "pillow",
        "89": "pineapple",
        "90": "potato",
        "91": "power_outlet",
        "92": "purse",
        "93": "rabbit",
        "94": "raccoon",
        "95": "rhinoceros",
        "96": "rifle",
        "97": "saxophone",
        "98": "screwdriver",
        "99": "sea_turtle",
        "100": "see_saw",
        "101": "sheep",
        "102": "shoe",
        "103": "skateboard",
        "104": "snake",
        "105": "speedboat",
        "106": "spider",
        "107": "squirrel",
        "108": "strawberry",
        "109": "streetlight",
        "110": "string_bean",
        "111": "submarine",
        "112": "swan",
        "113": "table",
        "114": "teapot",
        "115": "teddy-bear",
        "116": "television",
        "117": "tiger",
        "118": "toe",
        "119": "train",
        "120": "truck",
        "121": "umbrella",
        "122": "vase",
        "123": "watermelon",
        "124": "whale",
        "125": "zebra"
    },
    "index2domain": {
        "0": "clipart",
        "1": "painting",
        "2": "real",
        "3": "sketch"
    },
    "label2index": {
        "The_Eiffel_Tower": 0,
        "The_Great_Wall_of_China": 1,
        "aircraft_carrier": 2,
        "alarm_clock": 3,
        "ant": 4,
        "anvil": 5,
        "asparagus": 6,
        "axe": 7,
        "banana": 8,
        "basket": 9,
        "bathtub": 10,
        "bear": 11,
        "bee": 12,
        "bird": 13,
        "blackberry": 14,
        "blueberry": 15,
        "bottlecap": 16,
        "broccoli": 17,
        "bus": 18,
        "butterfly": 19,
        "cactus": 20,
        "cake": 21,
        "calculator": 22,
        "camel": 23,
        "camera": 24,
        "candle": 25,
        "cannon": 26,
        "canoe": 27,
        "carrot": 28,
        "castle": 29,
        "cat": 30,
        "ceiling_fan": 31,
        "cell_phone": 32,
        "cello": 33,
        "chair": 34,
        "chandelier": 35,
        "coffee_cup": 36,
        "compass": 37,
        "computer": 38,
        "cow": 39,
        "crab": 40,
        "crocodile": 41,
        "cruise_ship": 42,
        "dog": 43,
        "dolphin": 44,
        "dragon": 45,
        "drums": 46,
        "duck": 47,
        "dumbbell": 48,
        "elephant": 49,
        "eyeglasses": 50,
        "feather": 51,
        "fence": 52,
        "fish": 53,
        "flamingo": 54,
        "flower": 55,
        "foot": 56,
        "fork": 57,
        "frog": 58,
        "giraffe": 59,
        "goatee": 60,
        "grapes": 61,
        "guitar": 62,
        "hammer": 63,
        "helicopter": 64,
        "helmet": 65,
        "horse": 66,
        "kangaroo": 67,
        "lantern": 68,
        "laptop": 69,
        "leaf": 70,
        "lion": 71,
        "lipstick": 72,
        "lobster": 73,
        "microphone": 74,
        "monkey": 75,
        "mosquito": 76,
        "mouse": 77,
        "mug": 78,
        "mushroom": 79,
        "onion": 80,
        "panda": 81,
        "peanut": 82,
        "pear": 83,
        "peas": 84,
        "pencil": 85,
        "penguin": 86,
        "pig": 87,
        "pillow": 88,
        "pineapple": 89,
        "potato": 90,
        "power_outlet": 91,
        "purse": 92,
        "rabbit": 93,
        "raccoon": 94,
        "rhinoceros": 95,
        "rifle": 96,
        "saxophone": 97,
        "screwdriver": 98,
        "sea_turtle": 99,
        "see_saw": 100,
        "sheep": 101,
        "shoe": 102,
        "skateboard": 103,
        "snake": 104,
        "speedboat": 105,
        "spider": 106,
        "squirrel": 107,
        "strawberry": 108,
        "streetlight": 109,
        "string_bean": 110,
        "submarine": 111,
        "swan": 112,
        "table": 113,
        "teapot": 114,
        "teddy-bear": 115,
        "television": 116,
        "tiger": 117,
        "toe": 118,
        "train": 119,
        "truck": 120,
        "umbrella": 121,
        "vase": 122,
        "watermelon": 123,
        "whale": 124,
        "zebra": 125
    },
    "domain2index": {
        "clipart": 0,
        "painting": 1,
        "real": 2,
        "sketch": 3
    }
}