module gitlab.com/visomi.dev/website

go 1.14

require (
	github.com/ajstarks/svgo v0.0.0-20200725142600-7a3c8b57fecb
	github.com/joncalhoun/qson v0.0.0-20200422171543-84433dcd3da0
	github.com/santhosh-tekuri/jsonschema v1.2.4
	go.mongodb.org/mongo-driver v1.4.4
	golang.org/x/net v0.0.0-20200822124328-c89045814202 // indirect
	golang.org/x/sync v0.0.0-20200625203802-6e8e738ad208 // indirect
	golang.org/x/xerrors v0.0.0-20200804184101-5ec99f83aff1 // indirect
)
