{
  "$schema": "http://json-schema.org/draft-07/schema#",
  "title": "Tracks 200 Response",
  "description": "Response with the tracks are in database",
  "type": "object",
  "properties": {
    "success": {
      "type": "boolean",
      "description": "Flag for know if the request finish fine or not"
    },
    "message": {
      "type": "string",
      "description": "Message of the response"
    },
    "data": {
      "type": "object",
      "properties": {
        "total": {
          "description": "The total of the rows in the database for the consult",
          "type": "integer"
        },
        "rows": {
          "description": "The rows of the consult",
          "type": "array",
          "items": { "$ref": "#/definitions/track" }
        }
      },
      "required": [
        "total",
        "rows"
      ]
    }
  },
  "definitions": {
    "track": {
      "type": "object",
      "additionalProperties": false,
      "properties": {
        "id": {
          "description": "ID of the track",
          "type": "number",
          "minimum": 1
        },
        "title": {
          "description": "Title of the track",
          "type": "string",
          "maxLength": 120
        },
        "artist": {
          "description": "Artist of the track",
          "type": "string",
          "maxLength": 120
        },
        "isrc": {
          "description": "International Standard Recording Code of the track",
          "type": "string",
          "pattern": "^[A-Z]{2}[A-Z0-9_]{3}[0-9]{2}[0-9]{5}$",
          "minLength": 12,
          "maxLength": 12
        },
        "genre": {
          "description": "Genre of the track",
          "type": "string"
        },
        "albumId": {
          "description": "Album of the track",
          "type": "number",
          "minimum": 1
        },
        "userId": {
          "description": "User of the track",
          "type": "number",
          "minimum": 1
        },
        "status": {
          "description": "Status of the track",
          "type": "boolean",
          "default": false
        }
      },
      "required": [
        "title",
        "isrc",
        "genre",
        "albumId",
        "userId",
        "status"
      ]
    }
  }
}
