{
  "$schema": "http://json-schema.org/draft-07/schema#",
  "title": "Create album",
  "description": "Request for create album",
  "type": "object",
  "additionalProperties": false,
  "properties": {
    "title": {
      "description": "Title of the album",
      "type": "string",
      "maxLength": 120
    },
    "artist": {
      "description": "Artist of the album",
      "type": "string",
      "maxLength": 120
    },
    "label": {
      "description": "Label of the album",
      "type": "string"
    },
    "upc": {
      "description": "Universal Product Code of the album",
      "type": "number",
      "default": 0,
      "minimum": 0,
      "maximum": 999999999999
    },
    "genre": {
      "description": "Genre of the album",
      "type": "string"
    },
    "userId": {
      "description": "User of the album",
      "type": "number",
      "minimum": 1
    },
    "status": {
      "description": "Status of the album",
      "type": "boolean",
      "default": false
    }
  },
  "required": [
    "title",
    "artist",
    "label",
    "upc",
    "genre",
    "userId",
    "status"
  ]
}
