{
  "$schema": "http://json-schema.org/draft-07/schema#",
  "title": "Update track",
  "description": "Request for update track",
  "type": "object",
  "additionalProperties": false,
  "properties": {
    "title": {
      "description": "Title of the track",
      "type": "string",
      "maxLength": 120
    },
    "artist": {
      "description": "Artist of the track",
      "type": "string",
      "maxLength": 120
    },
    "isrc": {
      "description": "International Standard Recording Code of the track",
      "type": "string",
      "pattern": "^[A-Z]{2}[A-Z0-9_]{3}[0-9]{2}[0-9]{5}$",
      "minLength": 12,
      "maxLength": 12
    },
    "genre": {
      "description": "Genre of the track",
      "type": "string"
    },
    "albumId": {
      "description": "Album of the track",
      "type": "number",
      "minimum": 1
    },
    "userId": {
      "description": "User of the track",
      "type": "number",
      "minimum": 1
    },
    "status": {
      "description": "Status of the track",
      "type": "boolean",
      "default": false
    }
  },
  "minProperties": 1
}
