{
  "$schema": "http://json-schema.org/draft-07/schema#",
  "title": "Update Album 200 Response",
  "description": "Response with the updated album",
  "type": "object",
  "properties": {
    "success": {
      "type": "boolean",
      "description": "Flag for know if the request finish fine or not"
    },
    "message": {
      "type": "string",
      "description": "Message of the response"
    },
    "data": {
      "$ref": "#/definitions/album"
    }
  },
  "definitions": {
    "album": {
      "type": "object",
      "additionalProperties": false,
      "properties": {
        "id": {
          "description": "ID of the album",
          "type": "number",
          "minimum": 1
        },
        "title": {
          "description": "Title of the album",
          "type": "string",
          "maxLength": 120
        },
        "artist": {
          "description": "Artist of the album",
          "type": "string",
          "maxLength": 120
        },
        "label": {
          "description": "Label of the album",
          "type": "string"
        },
        "upc": {
          "description": "Universal Product Code of the album",
          "type": "number",
          "default": 0,
          "minimum": 0,
          "maximum": 999999999999
        },
        "genre": {
          "description": "Genre of the album",
          "type": "string"
        },
        "userId": {
          "description": "User of the album",
          "type": "number",
          "minimum": 1
        },
        "status": {
          "description": "Status of the album",
          "type": "boolean",
          "default": false
        }
      },
      "required": [
        "id",
        "title",
        "artist",
        "label",
        "upc",
        "genre",
        "userId",
        "status"
      ]
    }
  }
}
