{
  "$schema": "http://json-schema.org/draft-07/schema#",
  "title": "Update country",
  "description": "Request for update country",
  "type": "object",
  "additionalProperties": false,
  "properties": {
    "code": {
      "description": "Abbreviation code of the country",
      "type": "string",
      "minLength": 2,
      "maxLength": 2,
      "pattern": "^[A-Z]{2}$"
    },
    "name": {
      "description": "Name of the country",
      "type": "string",
      "minLength": 2,
      "maxLength": 120
    }
  },
  "minProperties": 1
}
