{
  "success": true,
  "message": "Album created",
  "data": {
    "id": 20840,
    "title": "Intensidad",
    "artist": "Desire Mandrile",
    "label": "Independiente",
    "upc": "651973325548",
    "genre": "LATIN",
    "userId": 24,
    "status": 1
  }
}
