{
  "$schema": "http://json-schema.org/draft-07/schema#",
  "title": "Update user not exists",
  "description": "Response when the user not exists in database",
  "type": "object",
  "properties": {
    "success": {
      "type": "boolean",
      "description": "Flag for know if the request finish fine or not"
    },
    "message": {
      "type": "string",
      "description": "Message of the response"
    }
  },
  "required": [
    "success",
    "message"
  ]
}
