{
  "$schema": "http://json-schema.org/draft-07/schema#",
  "title": "Create user",
  "description": "Request for create user",
  "type": "object",
  "additionalProperties": false,
  "properties": {
    "name": {
      "description": "Name of the user",
      "type": "string",
      "minLength": 2,
      "maxLength": 120
    },
    "email": {
      "description": "Email of the user",
      "type": "string",
      "format": "email"
    },
    "countryId": {
      "description": "User ID of the user",
      "type": "number",
      "minimum": 1
    },
    "status": {
      "description": "Status of the user",
      "type": "boolean",
      "default": false
    }
  },
  "required": [
    "name",
    "email",
    "countryId",
    "status"
  ]
}
