{
  "$schema": "http://json-schema.org/draft-07/schema#",
  "title": "Get all tracks",
  "description": "Get the tracks are in database",
  "type": "object",
  "additionalProperties": false,
  "properties": {
    "page": {
      "description": "The page to search",
      "type": "number",
      "minimum": 1
    },
    "size": {
      "description": "The size of the response",
      "type": "number"
    },
    "sortBy": {
      "description": "The fields to sort",
      "type": ["array", "string"]
    },
    "sortByDir": {
      "description": "The sort by direction",
      "type": "string",
      "enum": ["DESC", "ASC"]
    },
    "id": {
      "description": "ID of the track to search",
      "type": "number",
      "minimum": 1
    },
    "title": {
      "description": "Title of the track to search",
      "type": "string",
      "maxLength": 120,
      "minLength": 1
    },
    "artist": {
      "description": "Artist of the track to search",
      "type": "string",
      "maxLength": 120,
      "minLength": 1
    },
    "isrc": {
      "description": "International Standard Recording Code of the track to search",
      "type": "string",
      "pattern": "^[A-Z]{2}[A-Z0-9_]{3}[0-9]{2}[0-9]{5}$",
      "minLength": 12,
      "maxLength": 12
    },
    "genre": {
      "description": "Genre of the track to search",
      "type": "string",
      "minLength": 1
    },
    "albumId": {
      "description": "Album of the track to search",
      "type": "number",
      "minimum": 1
    },
    "userId": {
      "description": "User of the track to search",
      "type": "number",
      "minimum": 1
    },
    "status": {
      "description": "Status of the track to search",
      "type": "boolean",
      "default": false
    }
  },
  "required": [
    "page",
    "size"
  ]
}
