{
  "$schema": "http://json-schema.org/draft-07/schema#",
  "title": "Update Country 200 Response",
  "description": "Response with the updated country",
  "type": "object",
  "properties": {
    "success": {
      "type": "boolean",
      "description": "Flag for know if the request finish fine or not"
    },
    "message": {
      "type": "string",
      "description": "Message of the response"
    },
    "data": {
      "$ref": "#/definitions/country"
    }
  },
  "definitions": {
    "country": {
      "type": "object",
      "additionalProperties": false,
      "properties": {
        "id": {
          "description": "ID of the country",
          "type": "number",
          "minimum": 1
        },
        "code": {
          "description": "Abbreviation code of the country",
          "type": "string",
          "minLength": 2,
          "maxLength": 2,
          "pattern": "^[A-Z]{2}$"
        },
        "name": {
          "description": "Name of the country",
          "type": "string",
          "minLength": 2,
          "maxLength": 120
        }
      },
      "required": [
        "id",
        "code",
        "name"
      ]
    }
  }
}
