{
  "$schema": "http://json-schema.org/draft-07/schema#",
  "title": "Delete album",
  "description": "Delete the album by ID",
  "type": "object",
  "properties": {
    "id": {
      "description": "The ID of the album",
      "type": "number",
      "minimum": 1
    }
  },
  "required": [
    "id"
  ]
}
