<svg width="30" height="29" viewBox="0 0 30 29" fill="none" xmlns="http://www.w3.org/2000/svg">
<path d="M21.2421 2.43439C22.8977 2.43915 24.4841 3.07414 25.6548 4.20067C26.8255 5.3272 27.4854 6.85374 27.4903 8.44688V20.4706C27.4854 22.0637 26.8255 23.5903 25.6548 24.7168C24.4841 25.8433 22.8977 26.4783 21.2421 26.4831H8.74708C7.09148 26.4783 5.50509 25.8433 4.3344 24.7168C3.1637 23.5903 2.50382 22.0637 2.49888 20.4706V8.44688C2.50382 6.85374 3.1637 5.3272 4.3344 4.20067C5.50509 3.07414 7.09148 2.43915 8.74708 2.43439H21.2421ZM21.2421 0.0297852H8.74708C3.93609 0.0297852 0 3.81738 0 8.44688V20.4706C0 25.1001 3.93609 28.8877 8.74708 28.8877H21.2421C26.0531 28.8877 29.9892 25.1001 29.9892 20.4706V8.44688C29.9892 3.81738 26.0531 0.0297852 21.2421 0.0297852Z" fill="#1B2129"/>
<path d="M23.1162 8.44708C22.7455 8.44708 22.3831 8.3413 22.0749 8.14312C21.7667 7.94493 21.5264 7.66324 21.3846 7.33368C21.2427 7.00411 21.2056 6.64146 21.2779 6.29159C21.3502 5.94173 21.5288 5.62035 21.7909 5.36811C22.053 5.11587 22.387 4.94409 22.7506 4.8745C23.1142 4.80491 23.491 4.84063 23.8335 4.97714C24.176 5.11365 24.4687 5.34482 24.6747 5.64143C24.8806 5.93803 24.9906 6.28674 24.9906 6.64346C24.9911 6.88046 24.943 7.11522 24.849 7.33428C24.755 7.55333 24.6169 7.75237 24.4428 7.91995C24.2686 8.08753 24.0618 8.22037 23.8341 8.31083C23.6065 8.40129 23.3625 8.44759 23.1162 8.44708ZM14.9944 9.64906C15.983 9.64906 16.9494 9.93116 17.7714 10.4597C18.5933 10.9882 19.234 11.7394 19.6123 12.6183C19.9906 13.4972 20.0896 14.4643 19.8968 15.3973C19.7039 16.3303 19.2278 17.1873 18.5288 17.86C17.8298 18.5327 16.9391 18.9908 15.9695 19.1764C14.9999 19.362 13.9949 19.2667 13.0816 18.9027C12.1682 18.5386 11.3876 17.9221 10.8383 17.1311C10.2891 16.3402 9.99595 15.4102 9.99595 14.4589C9.99737 13.1837 10.5244 11.9611 11.4615 11.0593C12.3986 10.1576 13.6691 9.65043 14.9944 9.64906ZM14.9944 7.24445C13.5116 7.24445 12.062 7.66757 10.8291 8.46031C9.59617 9.25305 8.63523 10.3798 8.06777 11.6981C7.50032 13.0163 7.35185 14.4669 7.64113 15.8664C7.93042 17.2659 8.64447 18.5514 9.69298 19.5603C10.7415 20.5693 12.0774 21.2564 13.5317 21.5348C14.9861 21.8131 16.4935 21.6703 17.8635 21.1242C19.2334 20.5782 20.4043 19.6535 21.2282 18.4671C22.052 17.2807 22.4917 15.8858 22.4917 14.4589C22.4917 12.5455 21.7018 10.7105 20.2958 9.35752C18.8898 8.00455 16.9828 7.24445 14.9944 7.24445Z" fill="#1B2129"/>
</svg>
