﻿Instances;Label
13;0
25;1
77;2
86;3
116;4
126;5
147;6
158;7
164;8
168;9
192;10
198;11
199;12
236;13
252;14
276;15
283;16
286;17
339;18
391;19
392;20
396;21
398;22
26, 31;23
29, 51;24
72, 144;25
117, 120;26
162, 163;27
202, 267;28
217, 219;29
255, 361;30
260, 371;31
304, 330;32
4, 75, 88;33
80, 160, 167;34
81, 161, 165;35
83, 84, 166;36
195, 225, 318;37
285, 394, 395;38
22, 30, 140, 154;39
50, 114, 155, 170;40
79, 82, 85, 87;41
178, 215, 296, 366;42
207, 262, 323, 329;43
288, 378, 384, 386;44
2, 43, 66, 69, 150;45
8, 14, 59, 64, 102;46
23, 41, 58, 61, 100;47
36, 52, 55, 98, 145;48
78, 90, 91, 97, 130;49
281, 282, 284, 393, 397;50
189, 230, 258, 280, 380, 382;51
1, 33, 37, 46, 112, 128, 173;52
20, 53, 56, 67, 103, 104, 129;53
176, 179, 233, 263, 277, 345, 362;54
185, 264, 271, 275, 295, 312, 374, 377;55
0, 65, 94, 95, 108, 109, 110, 121, 125;56
10, 11, 16, 19, 93, 101, 115, 141, 151;57
208, 211, 212, 310, 316, 319, 370, 372, 376;58
210, 227, 270, 272, 279, 300, 314, 327, 336, 375;59
24, 28, 38, 60, 71, 92, 107, 118, 127, 135, 172;60
175, 187, 200, 214, 259, 268, 269, 278, 332, 348, 373;61
181, 183, 194, 235, 289, 293, 331, 333, 337, 342, 351, 356;62
222, 248, 253, 297, 301, 302, 308, 317, 328, 352, 359, 383;63
3, 35, 39, 40, 42, 119, 133, 134, 136, 138, 146, 148, 157, 171;64
6, 7, 9, 18, 27, 45, 54, 62, 68, 70, 74, 76, 113, 123, 153;65
12, 32, 34, 44, 49, 57, 63, 99, 106, 111, 131, 139, 142, 149, 159;66
5, 15, 17, 21, 47, 48, 73, 89, 96, 105, 122, 124, 132, 137, 143, 152, 156, 169, 174;67
184, 193, 196, 201, 203, 205, 213, 221, 223, 239, 240, 244, 287, 292, 294, 298, 299, 307, 309, 313, 335, 353, 358, 360, 364;68
177, 180, 182, 186, 190, 204, 206, 216, 224, 226, 228, 229, 234, 237, 241, 242, 247, 250, 251, 254, 257, 266, 311, 320, 321, 326, 338, 340, 344, 346, 349, 354, 355, 357, 365, 368, 369, 379, 390;69
188, 191, 197, 209, 218, 220, 231, 232, 238, 243, 245, 246, 249, 256, 261, 265, 273, 274, 290, 291, 303, 305, 306, 315, 322, 324, 325, 334, 341, 343, 347, 350, 363, 367, 381, 385, 387, 388, 389;70