id;Age;Is.Obese;bmi;wc;hc;whr;SBP;DBP;preh
1;20;NO;27.94;95;112;85;120.00;80.00;REGULAR
7;19;NO;18.65;69;85;81;100.00;63.33;REGULAR
8;31;NO;27.62;102;107;95;106.67;70.00;REGULAR
13;22;NO;24.96;86;107;80;120.00;80.00;REGULAR
15;19;NO;25.15;82;99;83;126.67;80.00;REGULAR
17;31;NO;22.50;79;97;81;170.00;103.33;HYPER
20;21;NO;25.31;92;104;88;130.00;90.00;REGULAR
21;20;NO;25.73;90;94;96;130.00;80.00;REGULAR
22;17;NO;25.16;84;99;85;142.00;82.67;HYPER
23;25;NO;25.12;84;104;81;166.67;106.67;HYPER
24;20;NO;25.56;84;104;81;146.67;90.00;HYPER
25;27;NO;27.56;85;106;80;136.67;93.33;REGULAR
30;23;NO;19.69;77;92;84;110.00;73.33;REGULAR
31;18;NO;17.26;76;93;82;130.00;70.33;REGULAR
32;17;NO;26.78;82;104;79;133.33;76.00;REGULAR
33;29;NO;19.62;73;97;75;143.67;99.33;HYPER
35;25;NO;26.45;93;113;82;156.33;97.33;HYPER
37;37;NO;21.44;83;97;86;138.67;92.00;REGULAR
43;26;NO;27.46;97;109;89;122.00;85.33;REGULAR
45;31;NO;29.49;103;113;91;150.67;87.33;HYPER
51;18;NO;23.10;87;103;84;125.67;77.00;REGULAR
52;22;NO;19.15;68;89;76;156.67;103.33;HYPER
55;20;NO;28.58;100;112;89;136.00;101.33;REGULAR
57;22;NO;24.69;80;105;76;140.00;86.67;REGULAR
59;23;NO;23.99;79;96;82;123.33;60.00;REGULAR
62;18;NO;25.23;88;110;80;170.00;110.00;HYPER
64;19;NO;26.37;87;106;82;146.67;76.67;HYPER
65;22;NO;25.02;65;111;59;153.33;90.00;HYPER
67;22;NO;22.38;77;97;79;123.33;70.00;REGULAR
69;18;NO;27.92;87;107;81;136.67;86.33;REGULAR
71;22;NO;29.63;93;112;83;167.00;95.33;HYPER
73;19;NO;26.78;87;103;84;146.00;80.33;HYPER
75;20;NO;23.67;86;97;89;134.67;84.33;REGULAR
77;19;NO;21.45;76;92;83;125.00;74.33;REGULAR
78;21;NO;23.14;81;103;79;102.00;61.33;REGULAR
79;23;NO;22.68;76;98;78;115.00;61.67;REGULAR
82;19;NO;22.00;87;102;85;147.67;84.33;HYPER
83;17;NO;22.62;81;99;82;124.67;71.67;REGULAR
85;20;NO;22.49;76;98;78;120.00;70.00;REGULAR
88;20;NO;22.28;73;92;79;127.67;74.33;REGULAR
89;23;NO;21.31;73;95;77;123.33;73.33;REGULAR
91;21;NO;22.86;86;101;85;145.67;50.00;HYPER
93;20;NO;17.32;69;87;79;127.33;79.00;REGULAR
94;25;NO;28.28;94;106;89;139.33;89.67;REGULAR
97;25;NO;21.86;81;107;76;139.33;85.33;REGULAR
98;31;NO;27.84;98;114;86;145.33;85.33;HYPER
99;19;NO;22.75;81;97;84;139.33;83.00;REGULAR
101;35;NO;23.93;88;98;90;129.33;85.67;REGULAR
103;27;NO;23.44;78;101;77;123.67;85.67;REGULAR
105;21;NO;17.09;68;95;72;114.67;71.33;REGULAR
106;20;NO;26.34;92;104;88;130.00;90.00;REGULAR
107;17;NO;25.36;79;97;81;117.67;66.67;REGULAR
108;18;NO;20.41;77;95;81;152.67;102.33;HYPER
109;19;NO;21.90;73;93;78;121.00;83.33;REGULAR
110;20;NO;25.21;80;102;78;136.67;76.67;REGULAR
112;19;NO;24.87;79;106;75;121.00;97.00;REGULAR
114;19;NO;20.55;71;85;84;111.00;78.33;REGULAR
118;31;NO;21.73;73;96;76;134.33;84.00;REGULAR
119;21;NO;23.83;86;99;87;140.33;89.00;HYPER
125;18;NO;25.44;85;102;83;134.00;81.33;REGULAR
126;22;NO;20.45;76;91;84;136.33;81.00;REGULAR
127;21;NO;22.76;80;104;77;152.67;77.67;HYPER
129;23;NO;27.82;98;112;88;140.00;83.33;REGULAR
130;21;NO;22.60;83;96;86;110.33;70.33;REGULAR
133;18;NO;26.20;94;108;87;130.00;76.67;REGULAR
134;21;NO;28.23;90;110;82;128.67;83.67;REGULAR
136;30;NO;26.91;99;106;93;112.67;74.00;REGULAR
143;19;NO;19.82;80;94;85;98.00;66.33;REGULAR
144;29;NO;26.72;94;106;89;120.00;86.67;REGULAR
145;28;NO;28.28;96;107;90;138.33;88.67;REGULAR
151;27;NO;28.30;94;110;85;136.33;98.33;REGULAR
155;23;NO;22.30;74;95;78;122.00;63.67;REGULAR
161;48;NO;28.26;100;108;93;123.33;86.67;REGULAR
163;25;NO;23.02;80;99;81;133.33;76.67;REGULAR
164;21;NO;25.17;95;106;90;133.67;81.00;REGULAR
167;19;NO;25.10;83;104;80;129.00;82.67;REGULAR
168;27;NO;25.15;91;103;88;140.00;96.67;REGULAR
170;45;NO;27.04;93;105;89;153.33;100.00;HYPER
175;19;NO;23.16;82;101;81;142.33;96.67;HYPER
38;26;YES;34.42;119;121;98;143.33;103.33;HYPER
63;29;YES;32.99;103;117;88;126.67;80.00;REGULAR
87;19;YES;30.71;103;119;87;140.00;90.00;REGULAR
95;20;YES;31.83;98;120;82;161.00;89.00;HYPER
104;24;YES;40.40;126;130;97;129.33;86.33;REGULAR
115;23;YES;30.79;103;113;91;139.67;94.33;REGULAR
159;20;YES;43.60;121;123;98;175.00;112.00;HYPER
165;34;YES;32.82;115;122;94;145.33;98.67;HYPER
174;21;YES;32.11;97;112;87;141.00;101.00;HYPER
2;19;NO;25.35;79;102;77;113.33;70.00;REGULAR
3;20;NO;20.73;91;80;114;130.00;76.67;REGULAR
4;19;NO;24.54;83;98;85;130.00;80.00;REGULAR
5;19;NO;24.66;81;99;82;136.67;90.00;REGULAR
6;21;NO;20.61;79;96;82;130.00;80.00;REGULAR
9;22;NO;27.17;92;110;84;136.67;93.33;REGULAR
10;27;NO;25.06;83;106;78;123.33;73.33;REGULAR
12;22;NO;28.52;90;99;91;127.33;79.67;REGULAR
14;21;NO;20.64;79;95;83;136.67;66.67;REGULAR
16;19;NO;23.32;81;97;84;130.00;90.00;REGULAR
26;18;NO;23.11;48;98;49;135.33;90.67;REGULAR
27;23;NO;20.51;69;92;75;118.00;50.33;REGULAR
28;32;NO;21.03;83;102;81;140.00;80.00;REGULAR
29;28;NO;27.48;96;113;85;153.33;90.00;HYPER
34;17;NO;29.64;92;114;81;136.00;79.67;REGULAR
36;19;NO;24.82;83;101;82;123.00;72.33;REGULAR
39;19;NO;20.73;81;101;80;120.00;80.00;REGULAR
40;23;NO;21.43;75;91;82;130.00;76.67;REGULAR
41;31;NO;21.59;70;90;78;122.00;83.00;REGULAR
42;21;NO;24.57;81;112;72;127.33;60.33;REGULAR
44;31;NO;28.20;94;110;85;119.67;83.67;REGULAR
47;20;NO;27.13;97;112;87;129.67;77.67;REGULAR
50;20;NO;29.80;92;108;85;99.67;62.00;REGULAR
53;31;NO;17.67;75;87;86;106.33;56.67;REGULAR
54;19;NO;22.10;80;100;80;113.00;67.00;REGULAR
56;35;NO;25.62;99;110;90;127.67;85.00;REGULAR
58;29;NO;28.93;95;116;82;143.67;89.33;HYPER
60;22;NO;27.00;88;107;82;131.00;80.00;REGULAR
61;19;NO;26.23;93;114;82;130.00;86.67;REGULAR
66;19;NO;21.49;80;99;81;130.00;80.00;REGULAR
68;24;NO;21.45;74;95;78;145.00;90.00;HYPER
70;22;NO;18.50;77;90;86;116.67;80.00;REGULAR
72;19;NO;24.21;85;105;81;140.00;93.33;REGULAR
74;26;NO;25.33;99;105;94;126.67;73.33;REGULAR
76;22;NO;22.97;85;103;83;133.33;73.33;REGULAR
80;21;NO;28.08;80;106;75;133.33;76.67;REGULAR
81;20;NO;23.49;78;95;82;136.00;76.33;REGULAR
84;27;NO;26.01;93;108;86;118.67;78.33;REGULAR
86;43;NO;25.49;86;100;86;146.67;100.00;HYPER
92;21;NO;23.11;83;94;88;151.00;98.00;HYPER
96;18;NO;20.85;75;88;85;135.67;87.33;REGULAR
100;19;NO;23.78;85;102;83;117.67;82.33;REGULAR
102;19;NO;22.23;78;99;79;119.33;88.67;REGULAR
111;20;NO;20.75;73;93;78;139.67;89.00;REGULAR
113;20;NO;20.13;77;95;81;151.00;99.67;HYPER
116;24;NO;19.75;75;84;89;126.33;82.67;REGULAR
117;26;NO;24.88;77;102;75;126.67;76.67;REGULAR
120;24;NO;23.33;81;107;76;156.67;96.67;HYPER
121;31;NO;23.63;84;101;83;113.33;65.00;REGULAR
122;21;NO;24.42;82;110;75;123.33;86.67;REGULAR
128;20;NO;20.20;88;120;73;124.67;78.67;REGULAR
131;31;NO;22.82;82;97;85;108.67;75.00;REGULAR
132;22;NO;26.19;89;103;86;146.33;110.33;HYPER
135;24;NO;27.00;84;104;81;153.33;93.33;HYPER
137;29;NO;19.85;79;94;84;117.00;68.67;REGULAR
139;20;NO;19.61;71;90;79;130.33;79.00;REGULAR
140;48;NO;28.57;96;105;91;126.67;86.67;REGULAR
141;19;NO;17.64;73;91;80;142.67;66.67;HYPER
142;28;NO;22.95;83;103;81;119.00;75.33;REGULAR
146;63;NO;23.56;92;97;95;112.67;70.00;REGULAR
147;22;NO;24.95;87;99;88;126.00;76.67;REGULAR
148;31;NO;20.36;82;104;79;122.67;76.33;REGULAR
149;33;NO;26.27;91;109;83;139.33;88.33;REGULAR
150;22;NO;26.78;85;104;82;131.33;84.33;REGULAR
154;20;NO;21.22;81;100;81;144.67;90.33;HYPER
156;21;NO;25.60;91;101;90;141.00;77.00;HYPER
160;25;NO;27.18;90;103;87;126.67;103.33;REGULAR
162;22;NO;25.30;79;99;80;156.33;84.00;HYPER
166;25;NO;19.84;81;94;86;144.00;98.67;HYPER
171;20;NO;22.43;77;101;76;116.67;76.67;REGULAR
172;21;NO;17.67;65;88;74;140.67;82.67;HYPER
173;21;NO;22.35;80;103;78;106.67;70.00;REGULAR
11;21;YES;32.08;100;111;90;126.67;73.33;REGULAR
46;19;YES;33.29;114;120;95;143.33;80.00;HYPER
90;29;YES;30.20;93;110;85;110.33;76.33;REGULAR
123;25;YES;37.97;118;122;97;126.33;84.00;REGULAR
124;42;YES;32.07;108;117;92;143.33;98.66;HYPER
138;19;YES;37.35;104;125;83;124.00;93.33;REGULAR
157;29;YES;35.81;111;126;88;152.00;88.33;HYPER
158;26;YES;33.97;110;122;90;121.33;76.33;REGULAR
169;48;YES;30.86;103;107;96;146.00;100.67;HYPER
18;21;NO;24.97;87;107;81;153.33;93.33;HYPER
19;23;NO;25.78;93;106;88;150.00;83.33;HYPER
48;25;NO;22.78;87;104;84;119.00;74.67;REGULAR
49;23;NO;22.43;78;96;81;133.33;73.33;REGULAR
152;19;NO;21.92;81;104;78;116.67;80.00;REGULAR
153;25;NO;23.15;84;96;88;123.33;86.67;REGULAR