[{
  "firstSet0": {
    "0": [
      0.0,
      0.0
    ],
    "1": [
      0.0,
      1.0
    ],
    "2": [
      1.0,
      0.0
    ],
    "3": [
      1.0,
      1.0
    ],
    "4": [
      2.0,
      0.0
    ],
    "5": [
      2.0,
      1.0
    ]
  }},
  {"secondSet0": {
    "0": [
      0.0,
      0.0
    ],
    "1": [
      0.0,
      1.0
    ],
    "2": [
      1.0,
      0.0
    ],
    "3": [
      1.0,
      1.0
    ],
    "4": [
      2.0,
      0.0
    ],
    "5": [
      2.0,
      1.0
    ]
  }},
  {"firstSet1": {
    "0": [
      0.0,
      0.0
    ],
    "1": [
      0.0,
      1.0
    ],
    "2": [
      1.0,
      0.0
    ],
    "3": [
      1.0,
      1.0
    ],
    "4": [
      2.0,
      0.0
    ],
    "5": [
      2.0,
      1.0
    ]
  }},
  {"secondSet1": {
    "0": [
      0.0,
      0.0
    ],
    "1": [
      0.0,
      1.0
    ],
    "2": [
      1.0,
      0.0
    ],
    "3": [
      1.0,
      1.0
    ]
  }},
  {"firstSet2": {
    "0": [
      0.0,
      0.0
    ],
    "1": [
      0.0,
      1.0
    ],
    "2": [
      1.0,
      0.0
    ],
    "3": [
      1.0,
      1.0
    ],
    "4": [
      2.0,
      0.0
    ],
    "5": [
      2.0,
      1.0
    ]
  }},
  {"secondSet2": {
    "0": [
      0.0,
      0.0
    ],
    "1": [
      0.0,
      1.0
    ],
    "2": [
      1.0,
      0.0
    ],
    "3": [
      1.0,
      1.0
    ],
    "4": [
      2.0,
      0.0
    ],
    "5": [
      2.0,
      1.0
    ]
  }},
  {"firstSet3": {
    "0": [
      0.0,
      0.0
    ],
    "1": [
      0.0,
      1.0
    ],
    "2": [
      1.0,
      0.0
    ],
    "3": [
      1.0,
      1.0
    ],
    "4": [
      2.0,
      0.0
    ],
    "5": [
      2.0,
      1.0
    ]
  }},
  {"secondSet3": {
    "0": [
      0.0,
      0.0
    ],
    "1": [
      0.0,
      1.0
    ],
    "2": [
      1.0,
      0.0
    ],
    "3": [
      1.0,
      1.0
    ],
    "4": [
      2.0,
      0.0
    ],
    "5": [
      2.0,
      1.0
    ]
  }},
  {"firstSet4": {
    "0": [
      0.0,
      0.0
    ],
    "1": [
      0.0,
      1.0
    ],
    "2": [
      1.0,
      0.0
    ],
    "3": [
      1.0,
      1.0
    ],
    "4": [
      2.0,
      0.0
    ],
    "5": [
      2.0,
      1.0
    ]
  }},
  {"secondSet4": {
    "0": [
      0.0,
      0.0
    ],
    "1": [
      0.0,
      1.0
    ],
    "2": [
      1.0,
      0.0
    ],
    "3": [
      1.0,
      1.0
    ],
    "4": [
      2.0,
      0.0
    ],
    "5": [
      2.0,
      1.0
    ]
  }},
  {"firstSet5": {
    "0": [
      0.0,
      0.0
    ],
    "1": [
      0.0,
      1.0
    ],
    "2": [
      1.0,
      0.0
    ],
    "3": [
      1.0,
      1.0
    ],
    "4": [
      2.0,
      0.0
    ],
    "5": [
      2.0,
      1.0
    ]
  }},
  {"secondSet5": {
    "0": [
      0.0,
      0.0
    ],
    "1": [
      0.0,
      1.0
    ],
    "2": [
      1.0,
      0.0
    ],
    "3": [
      1.0,
      1.0
    ],
    "4": [
      2.0,
      0.0
    ]
  }},
  {"firstSet6": {
    "0": [
      0.0,
      0.0
    ],
    "1": [
      0.0,
      1.0
    ],
    "2": [
      1.0,
      0.0
    ],
    "3": [
      1.0,
      1.0
    ],
    "4": [
      2.0,
      0.0
    ],
    "5": [
      2.0,
      1.0
    ]
  }},
  {"secondSet6": {
    "0": [
      0.0,
      0.0
    ],
    "1": [
      0.0,
      1.0
    ],
    "2": [
      1.0,
      0.0
    ],
    "3": [
      1.0,
      1.0
    ],
    "4": [
      2.0,
      0.0
    ],
    "5": [
      2.0,
      1.0
    ]
  }},
  {"firstSet7": {
    "0": [
      0.0,
      0.0
    ],
    "1": [
      0.0,
      1.0
    ],
    "2": [
      1.0,
      0.0
    ],
    "3": [
      1.0,
      1.0
    ],
    "4": [
      2.0,
      0.0
    ],
    "5": [
      2.0,
      1.0
    ]
  }},
  {"secondSet7": {
    "0": [
      0.0,
      0.0
    ],
    "1": [
      0.0,
      1.0
    ],
    "2": [
      1.0,
      0.0
    ],
    "3": [
      1.0,
      1.0
    ],
    "4": [
      2.0,
      0.0
    ],
    "5": [
      2.0,
      1.0
    ]
  }},
  {"firstSet8": {
    "0": [
      0.0,
      0.0
    ],
    "1": [
      0.0,
      1.0
    ],
    "2": [
      1.0,
      0.0
    ],
    "3": [
      1.0,
      1.0
    ],
    "4": [
      2.0,
      0.0
    ],
    "5": [
      2.0,
      1.0
    ]
  }},
  {"secondSet8": {
    "0": [
      0.0,
      0.0
    ],
    "1": [
      0.0,
      1.0
    ],
    "2": [
      1.0,
      0.0
    ],
    "3": [
      1.0,
      1.0
    ],
    "4": [
      2.0,
      0.0
    ],
    "5": [
      2.0,
      1.0
    ]
  }},
  {"firstSet9": {
    "0": [
      0.0,
      0.0
    ],
    "1": [
      0.0,
      1.0
    ],
    "2": [
      1.0,
      0.0
    ],
    "3": [
      1.0,
      1.0
    ],
    "4": [
      2.0,
      0.0
    ],
    "5": [
      2.0,
      1.0
    ]
  }},
  {"secondSet9": {
    "0": [
      0.0,
      0.0
    ],
    "1": [
      0.0,
      1.0
    ],
    "2": [
      1.0,
      0.0
    ],
    "3": [
      1.0,
      1.0
    ],
    "4": [
      2.0,
      0.0
    ],
    "5": [
      2.0,
      1.0
    ]
  }
}]