[{
  "firstSet0": {
    "0": [
      -1.0023858762,
      -0.8692243084
    ],
    "1": [
      -0.1438768814,
      -0.1930518679
    ],
    "2": [
      0.3512365838,
      0.263204543
    ],
    "3": [
      1.0312840261,
      0.8234682131
    ],
    "4": [
      1.3869581043,
      1.778333008
    ],
    "5": [
      2.1542739507,
      2.6020224219
    ]
  }},
  {"secondSet0": {
    "0": [
      -0.9588641219,
      -0.8188933431
    ],
    "1": [
      -0.0272544679,
      -0.1639309353
    ],
    "2": [
      0.5221362535,
      0.1315602245
    ],
    "3": [
      0.9338372259,
      0.8332004038
    ],
    "4": [
      1.276457439,
      1.8088851469
    ],
    "5": [
      2.2609280982,
      2.7781397789
    ]
  }},
  {"firstSet1": {
    "0": [
      -1.0119865653,
      -0.8984333332
    ],
    "1": [
      -0.1372157242,
      -0.194948969
    ],
    "2": [
      0.4387610031,
      0.1960527428
    ],
    "3": [
      0.994092773,
      0.7455177551
    ],
    "4": [
      1.3058003877,
      1.7651683548
    ],
    "5": [
      2.1543737208,
      2.5704810351
    ]
  }},
  {"secondSet1": {
    "0": [
      -0.9379956154,
      -0.7534944253
    ],
    "1": [
      -0.0374160066,
      -0.1544753387
    ],
    "2": [
      0.3368383906,
      0.2738145862
    ],
    "3": [
      1.0185765055,
      0.9943488788
    ],
    "4": [
      1.4327371926,
      1.8665530901
    ],
    "5": [
      2.3141055169,
      2.9135105376
    ]
  }},
  {"firstSet2": {
    "0": [
      -1.0011930784,
      -0.8934688178
    ],
    "1": [
      -0.0994933046,
      -0.2105969827
    ],
    "2": [
      0.4247407635,
      0.2261843848
    ],
    "3": [
      0.9830482558,
      0.7515415939
    ],
    "4": [
      1.3785503361,
      1.776300609
    ],
    "5": [
      2.6266849781,
      2.5615465651
    ]
  }},
  {"secondSet2": {
    "0": [
      -0.962594725,
      -0.7648089022
    ],
    "1": [
      -0.164480999,
      -0.1017662401
    ],
    "2": [
      0.3361062548,
      0.2172116924
    ],
    "3": [
      1.0291130565,
      0.9329871126
    ],
    "4": [
      1.2266123389,
      1.8350117033
    ],
    "5": [
      1.6056386309,
      2.9269122427
    ]
  }},
  {"firstSet3": {
    "0": [
      -0.9971187968,
      -0.8782520394
    ],
    "1": [
      -0.1007376137,
      -0.1886763357
    ],
    "2": [
      0.4325997902,
      0.2691063084
    ],
    "3": [
      1.087015946,
      0.8174395555
    ],
    "4": [
      1.218101189,
      1.8263167353
    ],
    "5": [
      2.8627408368,
      2.5886207168
    ]
  }},
  {"secondSet3": {
    "0": [
      -0.9718802972,
      -0.7994890017
    ],
    "1": [
      -0.1546180202,
      -0.1768491734
    ],
    "2": [
      0.319636377,
      0.1008671611
    ],
    "3": [
      0.8151248743,
      0.8460741629
    ],
    "4": [
      1.495971429,
      1.7465063013
    ],
    "5": [
      1.7886168409,
      2.787074249
    ]
  }},
  {"firstSet4": {
    "0": [
      -1.0139049595,
      -0.8533513896
    ],
    "1": [
      -0.093413241,
      -0.1440019168
    ],
    "2": [
      0.4191369464,
      0.2094326678
    ],
    "3": [
      0.9638070303,
      0.7705763867
    ],
    "4": [
      1.0755804881,
      1.7763420165
    ],
    "5": [
      2.2341897339,
      2.7577664798
    ]
  }},
  {"secondSet4": {
    "0": [
      -0.9297072906,
      -0.8563801947
    ],
    "1": [
      -0.1603136821,
      -0.2770636998
    ],
    "2": [
      0.3562852296,
      0.2633120715
    ],
    "3": [
      1.0814776635,
      0.9423040287
    ],
    "4": [
      1.8326653031,
      1.8202562906
    ],
    "5": [
      2.1545732608,
      2.5073982616
    ]
  }},
  {"firstSet5": {
    "0": [
      -1.039700996,
      -0.895780308
    ],
    "1": [
      -0.1194324611,
      -0.202182844
    ],
    "2": [
      0.4374115556,
      0.2295957279
    ],
    "3": [
      1.0221014118,
      0.9089244173
    ],
    "4": [
      1.2425156794,
      1.7790358946
    ],
    "5": [
      2.448795039,
      2.7510656272
    ]
  }},
  {"secondSet5": {
    "0": [
      -0.8821599832,
      -0.7655959415
    ],
    "1": [
      -0.0984232711,
      -0.1337123142
    ],
    "2": [
      0.3303329321,
      0.2122731934
    ],
    "3": [
      0.9667871339,
      0.6812373912
    ],
    "4": [
      1.9815720525,
      1.8754875601
    ],
    "5": [
      1.2961520402,
      2.5342016718
    ]
  }},
  {"firstSet6": {
    "0": [
      -1.0192586953,
      -0.8508534867
    ],
    "1": [
      -0.1032827836,
      -0.2232426663
    ],
    "2": [
      0.412471399,
      0.2364024882
    ],
    "3": [
      1.0377558424,
      0.9271242276
    ],
    "4": [
      1.3177878809,
      1.8014590938
    ],
    "5": [
      2.2182664392,
      2.7076928361
    ]
  }},
  {"secondSet6": {
    "0": [
      -0.9055565014,
      -0.8637287656
    ],
    "1": [
      -0.1373657256,
      -0.1077843016
    ],
    "2": [
      0.3696751973,
      0.1840806946
    ],
    "3": [
      0.945611697,
      0.6671594347
    ],
    "4": [
      1.3717777126,
      1.7763059176
    ]
  }},
  {"firstSet7": {
    "0": [
      -1.0182886121,
      -0.8823347612
    ],
    "1": [
      -0.0931799033,
      -0.2369903579
    ],
    "2": [
      0.4085572524,
      0.1735621794
    ],
    "3": [
      0.9774902361,
      0.8518926442
    ],
    "4": [
      1.3176275362,
      1.7729442104
    ],
    "5": [
      2.2182664392,
      2.7076928361
    ]
  }},
  {"secondSet7": {
    "0": [
      -0.9213791015,
      -0.7879901328
    ],
    "1": [
      -0.1559934211,
      -0.0849034203
    ],
    "2": [
      0.3850855077,
      0.3609595121
    ],
    "3": [
      1.0560814361,
      0.7702773677
    ],
    "4": [
      1.3875698809,
      1.8342961721
    ]
  }},
  {"firstSet8": {
    "0": [
      -1.0685184162,
      -0.8498178477
    ],
    "1": [
      -0.0922638629,
      -0.2213300391
    ],
    "2": [
      0.4594367844,
      0.1985525055
    ],
    "3": [
      1.0108065224,
      0.8074522197
    ],
    "4": [
      1.5926531796,
      1.7409081998
    ],
    "5": [
      2.2182664392,
      2.7076928361
    ]
  }},
  {"secondSet8": {
    "0": [
      -0.8540453042,
      -0.8617872787
    ],
    "1": [
      -0.1756643108,
      -0.0868469576
    ],
    "2": [
      0.2340591345,
      0.2984819255
    ],
    "3": [
      0.9739368959,
      0.887181275
    ],
    "4": [
      1.0090538412,
      1.8575373975
    ]
  }},
  {"firstSet9": {
    "0": [
      -0.9550985164,
      -0.8116129748
    ],
    "1": [
      -0.1171213171,
      -0.1814111997
    ],
    "2": [
      0.4217336528,
      0.1427360887
    ],
    "3": [
      1.0752013621,
      0.7624421082
    ],
    "4": [
      1.3201342579,
      1.8000014408
    ],
    "5": [
      2.2182664392,
      2.7076928361
    ]
  }},
  {"secondSet9": {
    "0": [
      -1.0499927134,
      -0.9294423374
    ],
    "1": [
      -0.1067413695,
      -0.1975310124
    ],
    "2": [
      0.3564681413,
      0.4146610921
    ],
    "3": [
      0.7825958581,
      1.0182251567
    ],
    "4": [
      1.3818402314,
      1.7724510741
    ]
  }
}]