[
  {
    "id": "D010382",
    "sn": null,
    "name": "Garage West Side Back Door",
    "state": "Unregistered",
    "status": "Occupied",
    "createdAt": "2020-02-05T19:18:20.128Z"
  },
  {
    "id": "D010383",
    "sn": null,
    "name": "Garage Door",
    "state": "Inactive",
    "status": "Paid",
    "createdAt": "2020-01-05T01:32:17.254Z"
  },
  {
    "id": "D010384",
    "sn": "D010384",
    "name": "Main Office's 2nd Floor Door",
    "state": "Disabled",
    "status": "Available",
    "createdAt": "2020-04-25T10:17:37.975Z"
  },
  {
    "id": "D010385",
    "sn": null,
    "name": "Office's Floor South Door",
    "state": "Inactive",
    "status": "Occupied",
    "createdAt": "2020-01-11T22:28:06.317Z"
  },
  {
    "id": "D010386",
    "sn": null,
    "name": "Garage 1",
    "state": "Active",
    "status": "Available",
    "createdAt": "2020-01-05T06:21:18.985Z"
  },
  {
    "id": "D010387",
    "sn": "D010387",
    "name": "Garage 1",
    "state": "Active",
    "status": "Paid",
    "createdAt": "2020-01-18T10:23:49.216Z"
  },
  {
    "id": "D010388",
    "sn": null,
    "name": "Garage 1",
    "state": "Unregistered",
    "status": "Available",
    "createdAt": "2020-03-25T09:15:57.689Z"
  },
  {
    "id": "D010389",
    "sn": null,
    "name": "Warehouse",
    "state": "Unregistered",
    "status": "Occupied",
    "createdAt": "2020-04-19T21:41:18.101Z"
  },
  {
    "id": "D010390",
    "sn": null,
    "name": "Main Office's 2nd Floor Door",
    "state": "Active",
    "status": "Paid",
    "createdAt": "2020-03-18T13:51:49.866Z"
  },
  {
    "id": "D010391",
    "sn": "D010391",
    "name": "Office's Floor South Door",
    "state": "Low Battery",
    "status": "Paid",
    "createdAt": "2020-01-01T12:57:02.370Z"
  },
  {
    "id": "D010392",
    "sn": "D010392",
    "name": "Office's Floor South Door",
    "state": "Low Battery",
    "status": "Occupied",
    "createdAt": "2020-04-15T17:06:42.720Z"
  },
  {
    "id": "D010393",
    "sn": null,
    "name": "Side Door",
    "state": "Unregistered",
    "status": "Available",
    "createdAt": "2020-02-19T07:56:40.567Z"
  },
  {
    "id": "D010394",
    "sn": "D010394",
    "name": "Garage Door",
    "state": "Inactive",
    "status": "Needs Maintenance",
    "createdAt": "2020-03-08T01:17:46.745Z"
  },
  {
    "id": "D010395",
    "sn": null,
    "name": "Main Office's 2nd Floor Door",
    "state": "Inactive",
    "status": "Needs Maintenance",
    "createdAt": "2020-04-04T21:55:59.669Z"
  },
  {
    "id": "D010396",
    "sn": null,
    "name": "Garage Door",
    "state": "Disabled",
    "status": "Available",
    "createdAt": "2020-04-20T18:04:23.121Z"
  },
  {
    "id": "D010397",
    "sn": "D010397",
    "name": "Garage Door",
    "state": "Unregistered",
    "status": "Needs Maintenance",
    "createdAt": "2020-01-25T22:19:40.952Z"
  },
  {
    "id": "D010398",
    "sn": null,
    "name": "Garage West Side Back Door",
    "state": "Inactive",
    "status": "Occupied",
    "createdAt": "2020-03-26T18:21:28.887Z"
  },
  {
    "id": "D010399",
    "sn": null,
    "name": "Main Office's 2nd Floor Door",
    "state": "Inactive",
    "status": "Paid",
    "createdAt": "2020-01-17T23:05:18.187Z"
  },
  {
    "id": "D010400",
    "sn": null,
    "name": "Side Door",
    "state": "Disabled",
    "status": "Available",
    "createdAt": "2020-02-22T04:55:49.583Z"
  },
  {
    "id": "D010401",
    "sn": "D010401",
    "name": "Office's Floor South Door",
    "state": "Inactive",
    "status": "Available",
    "createdAt": "2020-02-20T12:32:36.144Z"
  },
  {
    "id": "D010402",
    "sn": "D010402",
    "name": "Garage Door",
    "state": "Inactive",
    "status": "Occupied",
    "createdAt": "2020-04-27T06:42:56.229Z"
  },
  {
    "id": "D010403",
    "sn": null,
    "name": "Garage Door",
    "state": "Disabled",
    "status": "Needs Maintenance",
    "createdAt": "2020-04-15T17:11:08.269Z"
  },
  {
    "id": "D010404",
    "sn": null,
    "name": "Garage Door",
    "state": "Disabled",
    "status": "Available",
    "createdAt": "2020-01-23T00:25:11.165Z"
  },
  {
    "id": "D010405",
    "sn": "D010405",
    "name": "Main Door",
    "state": "Unregistered",
    "status": "Needs Maintenance",
    "createdAt": "2020-03-05T04:02:49.551Z"
  },
  {
    "id": "D010406",
    "sn": null,
    "name": "Main Office's 2nd Floor Door",
    "state": "Low Battery",
    "status": "Needs Maintenance",
    "createdAt": "2020-02-08T12:35:15.790Z"
  },
  {
    "id": "D010407",
    "sn": "D010407",
    "name": "Side Door",
    "state": "Inactive",
    "status": "Available",
    "createdAt": "2020-01-13T06:33:47.975Z"
  },
  {
    "id": "D010408",
    "sn": null,
    "name": "Garage 1",
    "state": "Active",
    "status": "Paid",
    "createdAt": "2020-01-15T02:18:55.830Z"
  },
  {
    "id": "D010409",
    "sn": null,
    "name": "Garage 1",
    "state": "Disabled",
    "status": "Occupied",
    "createdAt": "2020-04-28T16:20:33.274Z"
  },
  {
    "id": "D010410",
    "sn": null,
    "name": "Garage 1",
    "state": "Unregistered",
    "status": "Occupied",
    "createdAt": "2020-01-14T00:23:52.144Z"
  },
  {
    "id": "D010411",
    "sn": null,
    "name": "Office's Floor South Door",
    "state": "Disabled",
    "status": "Needs Maintenance",
    "createdAt": "2020-03-11T14:38:03.489Z"
  }
]
