[
  {
    "id": "A023041",
    "role": "Administrator",
    "firstName": "Mark",
    "lastName": "Code",
    "email": "mark_code@example.com",
    "password": "password",
    "avatar": null,
    "question": "What's my first cat's name?",
    "answer": "answer",
    "state": "Inactive",
    "status": "Primary",
    "disabledReason": null,
    "permissions": {
      "administrators": {
        "read": true,
        "edit": true
      },
      "keyholders": {
        "read": true,
        "edit": true
      },
      "devices": {
        "read": true,
        "edit": true
      },
      "spaces": {
        "read": true,
        "edit": true
      },
      "accessHistory": {
        "read": true,
        "edit": true
      },
      "configurations": {
        "read": true,
        "edit": true
      }
    },
    "toolkit": {
      "sn": "T040703",
      "pin": "9448",
      "dns": "012345.908.mercury.com"
    },
    "createdAt": "2020-01-11T07:53:02.224Z",
    "recentActivity": {
      "activity": "Removed Keyholder SN: K042012",
      "createdAt": "2020-04-12T05:30:00.000Z"
    }
  },
  {
    "id": "A023042",
    "role": "Administrator",
    "firstName": "Lord",
    "lastName": "Code",
    "email": "lord_code@example.com",
    "password": "password",
    "avatar": null,
    "question": "What's my first cat's name?",
    "answer": "answer",
    "state": "Active",
    "status": "Backup",
    "disabledReason": null,
    "permissions": {
      "administrators": {
        "read": true,
        "edit": false
      },
      "keyholders": {
        "read": true,
        "edit": false
      },
      "devices": {
        "read": true,
        "edit": false
      },
      "spaces": {
        "read": true,
        "edit": false
      },
      "accessHistory": {
        "read": false,
        "edit": false
      },
      "configurations": {
        "read": true,
        "edit": false
      }
    },
    "toolkit": null,
    "createdAt": "2020-02-14T09:19:47.927Z",
    "recentActivity": {
      "activity": "Edited Space ID: S042076",
      "createdAt": "2020-04-12T05:30:00.000Z"
    }
  },
  {
    "id": "A023043",
    "role": "Administrator",
    "firstName": "Lord",
    "lastName": "Johnson",
    "email": "lord_johnson@example.com",
    "password": "password",
    "avatar": null,
    "question": "What's my first cat's name?",
    "answer": "answer",
    "state": "Invited",
    "status": "Backup",
    "disabledReason": null,
    "permissions": {
      "administrators": {
        "read": false,
        "edit": false
      },
      "keyholders": {
        "read": false,
        "edit": false
      },
      "devices": {
        "read": false,
        "edit": false
      },
      "spaces": {
        "read": false,
        "edit": true
      },
      "accessHistory": {
        "read": false,
        "edit": false
      },
      "configurations": {
        "read": false,
        "edit": false
      }
    },
    "toolkit": null,
    "createdAt": "2020-02-11T08:44:48.139Z",
    "recentActivity": {
      "activity": "Removed Keyholder SN: K042012",
      "createdAt": "2020-04-12T05:30:00.000Z"
    }
  }
]
