{
    "initialPeriod": [
        "2021-01-31 16:25:24",
        "2022-06-05 16:25:24"
    ],
    "timeChunks": [
        [
            "2021-01-31 16:25:24",
            "2021-03-02 16:25:24"
        ],
        [
            "2021-03-02 16:25:25",
            "2021-04-01 16:25:25"
        ],
        [
            "2021-04-01 16:25:26",
            "2021-05-01 16:25:26"
        ],
        [
            "2021-05-01 16:25:27",
            "2021-05-05 10:25:27"
        ],
        [
            "2021-05-05 10:25:28",
            "2021-05-09 04:25:27"
        ],
        [
            "2021-05-09 04:25:28",
            "2021-05-11 01:25:28"
        ],
        [
            "2021-05-11 01:25:29",
            "2021-05-11 04:25:29"
        ],
        [
            "2021-05-11 04:25:30",
            "2021-05-11 07:25:29"
        ],
        [
            "2021-05-11 07:25:30",
            "2021-05-11 09:25:30"
        ],
        [
            "2021-05-11 09:25:31",
            "2021-05-11 10:25:30"
        ],
        [
            "2021-05-11 10:25:31",
            "2021-05-11 13:25:29"
        ],
        [
            "2021-05-11 13:25:30",
            "2021-05-12 00:25:29"
        ],
        [
            "2021-05-12 00:25:30",
            "2021-05-12 12:25:30"
        ],
        [
            "2021-05-12 12:25:31",
            "2021-05-12 13:25:31"
        ],
        [
            "2021-05-12 13:25:32",
            "2021-05-12 14:25:31"
        ],
        [
            "2021-05-12 14:25:32",
            "2021-05-12 15:25:31"
        ],
        [
            "2021-05-12 15:25:32",
            "2021-05-12 17:25:32"
        ],
        [
            "2021-05-12 17:25:33",
            "2021-05-12 18:25:31"
        ],
        [
            "2021-05-12 18:25:32",
            "2021-05-12 20:25:32"
        ],
        [
            "2021-05-12 20:25:33",
            "2021-05-12 21:25:32"
        ],
        [
            "2021-05-12 21:25:33",
            "2021-05-12 22:25:28"
        ],
        [
            "2021-05-12 22:25:29",
            "2021-05-16 16:25:27"
        ],
        [
            "2021-05-16 16:25:28",
            "2021-05-31 16:25:27"
        ],
        [
            "2021-05-31 16:25:28",
            "2021-06-15 16:25:28"
        ],
        [
            "2021-06-15 16:25:29",
            "2021-06-16 04:25:29"
        ],
        [
            "2021-06-16 04:25:30",
            "2021-06-16 06:25:30"
        ],
        [
            "2021-06-16 06:25:31",
            "2021-06-16 07:25:30"
        ],
        [
            "2021-06-16 07:25:31",
            "2021-06-16 09:25:31"
        ],
        [
            "2021-06-16 09:25:32",
            "2021-06-16 10:25:30"
        ],
        [
            "2021-06-16 10:25:31",
            "2021-06-16 13:25:31"
        ],
        [
            "2021-06-16 13:25:32",
            "2021-06-16 15:25:29"
        ],
        [
            "2021-06-16 15:25:30",
            "2021-06-17 03:25:30"
        ],
        [
            "2021-06-17 03:25:31",
            "2021-06-17 09:25:31"
        ],
        [
            "2021-06-17 09:25:32",
            "2021-06-17 10:25:32"
        ],
        [
            "2021-06-17 10:25:33",
            "2021-06-17 11:25:32"
        ],
        [
            "2021-06-17 11:25:33",
            "2021-06-17 12:25:32"
        ],
        [
            "2021-06-17 12:25:33",
            "2021-06-17 13:25:29"
        ],
        [
            "2021-06-17 13:25:30",
            "2021-06-19 10:25:29"
        ],
        [
            "2021-06-19 10:25:30",
            "2021-06-21 07:25:30"
        ],
        [
            "2021-06-21 07:25:31",
            "2021-06-21 10:25:31"
        ],
        [
            "2021-06-21 10:25:32",
            "2021-06-21 12:25:32"
        ],
        [
            "2021-06-21 12:25:33",
            "2021-06-21 13:25:31"
        ],
        [
            "2021-06-21 13:25:32",
            "2021-06-21 19:25:31"
        ],
        [
            "2021-06-21 19:25:32",
            "2021-06-22 06:25:31"
        ],
        [
            "2021-06-22 06:25:32",
            "2021-06-23 04:25:29"
        ],
        [
            "2021-06-23 04:25:30",
            "2021-06-30 16:25:28"
        ],
        [
            "2021-06-30 16:25:29",
            "2021-07-15 16:25:29"
        ],
        [
            "2021-07-15 16:25:30",
            "2021-07-30 16:25:29"
        ],
        [
            "2021-07-30 16:25:30",
            "2021-08-29 16:25:30"
        ],
        [
            "2021-08-29 16:25:31",
            "2021-09-13 16:25:31"
        ],
        [
            "2021-09-13 16:25:32",
            "2021-09-28 16:25:31"
        ],
        [
            "2021-09-28 16:25:32",
            "2021-10-28 16:25:32"
        ],
        [
            "2021-10-28 16:25:33",
            "2021-11-27 16:25:33"
        ],
        [
            "2021-11-27 16:25:34",
            "2021-12-27 16:25:34"
        ],
        [
            "2021-12-27 16:25:35",
            "2021-12-27 22:25:35"
        ],
        [
            "2021-12-27 22:25:36",
            "2021-12-28 01:25:36"
        ],
        [
            "2021-12-28 01:25:37",
            "2021-12-28 03:25:37"
        ],
        [
            "2021-12-28 03:25:38",
            "2021-12-28 04:25:35"
        ],
        [
            "2021-12-28 04:25:36",
            "2021-12-28 07:25:36"
        ],
        [
            "2021-12-28 07:25:37",
            "2021-12-28 09:25:37"
        ],
        [
            "2021-12-28 09:25:38",
            "2021-12-28 10:25:36"
        ],
        [
            "2021-12-28 10:25:37",
            "2021-12-28 13:25:37"
        ],
        [
            "2021-12-28 13:25:38",
            "2021-12-28 15:25:35"
        ],
        [
            "2021-12-28 15:25:36",
            "2021-12-29 13:25:35"
        ],
        [
            "2021-12-29 13:25:36",
            "2021-12-31 10:25:35"
        ],
        [
            "2021-12-31 10:25:36",
            "2022-01-04 04:25:35"
        ],
        [
            "2022-01-04 04:25:36",
            "2022-01-06 01:25:36"
        ],
        [
            "2022-01-06 01:25:37",
            "2022-01-07 00:25:37"
        ],
        [
            "2022-01-07 00:25:38",
            "2022-01-07 22:25:36"
        ],
        [
            "2022-01-07 22:25:37",
            "2022-01-11 16:25:35"
        ],
        [
            "2022-01-11 16:25:36",
            "2022-01-26 16:25:35"
        ],
        [
            "2022-01-26 16:25:36",
            "2022-02-25 16:25:36"
        ],
        [
            "2022-02-25 16:25:37",
            "2022-03-27 16:25:37"
        ],
        [
            "2022-03-27 16:25:38",
            "2022-04-26 16:25:38"
        ],
        [
            "2022-04-26 16:25:39",
            "2022-05-11 16:25:39"
        ],
        [
            "2022-05-11 16:25:40",
            "2022-05-26 16:25:39"
        ],
        [
            "2022-05-26 16:25:40",
            "2022-05-30 10:25:40"
        ],
        [
            "2022-05-30 10:25:41",
            "2022-06-01 07:25:41"
        ],
        [
            "2022-06-01 07:25:42",
            "2022-06-03 04:25:40"
        ],
        [
            "2022-06-03 04:25:41",
            "2022-06-05 16:25:24"
        ]
    ]
}