<svg xmlns="http://www.w3.org/2000/svg" width="39" height="39" viewBox="0 0 39 39">
  <g id="right-arrow-icon" transform="translate(-1.5 -1.5)">
    <path id="Path_28727" data-name="Path 28727" d="M39,21A18,18,0,1,1,21,3,18,18,0,0,1,39,21Z" transform="translate(0 0)" fill="none" stroke="#ffcc84" stroke-linecap="round" stroke-linejoin="round" stroke-width="3"/>
    <path id="Path_28728" data-name="Path 28728" d="M18,26.4l7.2-7.2L18,12" transform="translate(3 1.8)" fill="none" stroke="#ffcc84" stroke-linecap="round" stroke-linejoin="round" stroke-width="3"/>
    <path id="Path_28729" data-name="Path 28729" d="M12,18H26.4" transform="translate(1.8 3)" fill="none" stroke="#ffcc84" stroke-linecap="round" stroke-linejoin="round" stroke-width="3"/>
  </g>
</svg>
