<svg xmlns="http://www.w3.org/2000/svg" width="9.022" height="15.356" viewBox="0 0 9.022 15.356">
  <path id="right-arw" d="M110.255,7.079,103.421.245a.842.842,0,0,0-1.188,0l-.5.5a.841.841,0,0,0,0,1.188l5.739,5.738-5.745,5.745a.842.842,0,0,0,0,1.188l.5.5a.842.842,0,0,0,1.188,0l6.84-6.84a.848.848,0,0,0,0-1.192Z" transform="translate(-101.478)" fill="#fff"/>
</svg>
