{
        "crTxnPaymentData":
            [{
                "traceID": "transaction_id",
                "referenceNo": "lan_no",
                "narration": "funding",
                "transactionRefNumber": "transaction_id",
                "txntype": "D",
                "originalrefnumber": "original_transaction_id",
                "txnAmount": "bill_amount",
                "txnDateTime": "",
                "reftype": "ref_type",
                "source": "debit",
                "repaymentFlag": "",
                "repaymentDate": "",
                "repaymentAmount": "",
                "dpd": "",
                "dealNo": "deal_no",
                "lanNo": "lan_no",
                "due_date": "due_date"
            }],

        "userCredentials": {
            "userPassword": "",
            "userId": "ADMIN"
        }

}