﻿mages = {
	texture = "gfx/interface/icons/pops_icons/mages.dds"
	color = hsv{ 0.90 0.58 0.46 }
	start_quality_of_life = 10
	wage_weight = 4
	paid_private_wage = yes
	literacy_target = 0.80
	education_access = 0.5
	dependent_wage = 0.5	# per year
	unemployment = yes

	
	# 70% - 100% politically engaged
	political_engagement_base = 0.7
	political_engagement_literacy_factor = 0.3
	
	political_engagement_mult = {
		value = 1

		add = {
			desc = "POP_STARVATION"	
			
			if = {
				limit = {
					is_in_mild_starvation = yes
				}
				value = 0.5
			}
			else_if = {
				limit = {
					is_in_severe_starvation = yes
				}
				value = 1.5
			}
		}
		
	}
	
	qualifications_growth_desc = "MAGES_QUALIFICATIONS_DESC"
	qualifications = {
		if = {
			limit = {
				is_peasant_under_serfdom = no
				literacy_rate > 0.2
			}
			# baseline: ( literacy - 0.2 ) * 10 + ( wealth / 10 ), norm 5
			add = {
				value = literacy_rate
				subtract = 0.2
				multiply = 20
				desc = "QUALIFICATIONS_LITERACY_FACTOR"
			}
			add = {
				value = wealth
				divide = 10
				desc = "QUALIFICATIONS_WEALTH_FACTOR"
			}
			if = {
				limit = {
					OR = {
						is_pop_type = clerks
						is_pop_type = academics
						is_pop_type = aristocrats
						is_pop_type = clergymen
					}	
				}
				multiply = {
					value = 5
					desc = "QUALIFICATIONS_FAVORED_TYPE"
				}
			}
			if = {
				limit = {
					state = {
						state_cultural_acceptance = {
							target = PREV.culture
						   	value < acceptance_status_4
					   	}
					}
				}
				multiply = {
					value = 0.1
					desc = "QUALIFICATIONS_CULTURAL_DISCRIMINATION"
				}
			}
		}
		else_if = {
			limit = { 
				is_peasant_under_serfdom = yes 
			}
			value = {
				desc = "QUALIFICATIONS_PEASANTS_UNDER_SERFDOM"
				value = 0
			}
		}
		else = {
			value = {
				desc = "QUALIFICATIONS_INSUFFICIENT_LITERACY_DECAY"
				value = -1
			}
		}
	}
	
	portrait_age = {
		integer_range = {
			min = define:NPortrait|GRACEFUL_AGING_START
			max = define:NPortrait|GRACEFUL_AGING_END
		}
	}			
	portrait_pose = { value = 0 }			
	portrait_is_female = { always = yes }
}
