﻿object={
	name="palm_dense_generator_1_0"
	clamp_to_water_level=no
	render_under_water=no
	generated_content=yes
	layer="semidynamic"
	pdxmesh="tree_palm_01_mesh"
	count=7
	transform="2155.601562 0.000000 2086.337646 0.000000 0.095823 0.000000 0.995398 0.466511 0.466511 0.466511
2162.842529 0.000000 2107.791748 0.000000 0.813490 0.000000 0.581579 0.796355 0.796355 0.796355
2166.385498 0.000000 2093.830811 0.000000 0.766837 0.000000 0.641842 0.795094 0.795094 0.795094
2165.097412 0.000000 2091.707275 0.000000 0.158876 0.000000 0.987299 0.910157 0.910157 0.910157
2165.929688 0.000000 2105.992676 0.000000 0.730478 0.000000 0.682936 0.914979 0.914979 0.914979
4772.276367 0.000000 2405.590576 0.000000 0.640568 0.000000 0.767901 0.341634 0.341634 0.341634
4783.917480 0.000000 2409.125732 0.000000 0.635469 0.000000 0.772126 0.339114 0.339114 0.339114
"}
object={
	name="palm_dense_generator_1_1"
	clamp_to_water_level=no
	render_under_water=no
	generated_content=yes
	layer="semidynamic"
	pdxmesh="tree_palm_02_mesh"
	count=13
	transform="2159.722412 0.000000 2077.757080 0.000000 0.983120 0.000000 0.182962 0.469751 0.469751 0.469751
2173.248291 0.000000 2079.439453 0.000000 0.989687 0.000000 0.143244 0.477877 0.477877 0.477877
2171.305908 0.000000 2083.216553 0.000000 0.984363 0.000000 0.176152 0.731085 0.731085 0.731085
2164.003906 0.000000 2093.249512 0.000000 0.995989 0.000000 0.089475 0.511100 0.511100 0.511100
2164.014648 0.000000 2098.765137 0.000000 0.871619 0.000000 0.490183 0.823401 0.823401 0.823401
2165.566895 0.000000 2102.384033 0.000000 0.999929 0.000000 -0.011950 0.595011 0.595011 0.595011
2166.255859 0.000000 2098.681885 0.000000 0.995725 0.000000 0.092363 0.962178 0.962178 0.962178
2162.132324 0.000000 2109.343018 0.000000 0.941223 0.000000 -0.337786 1.038452 1.038452 1.038452
5526.478027 0.000000 1221.065186 0.000000 0.873278 0.000000 0.487223 0.417099 0.417099 0.417099
5527.339844 0.000000 1218.579346 0.000000 0.905222 0.000000 0.424940 0.449567 0.449567 0.449567
4781.434082 0.000000 2402.072998 0.000000 0.978928 0.000000 -0.204205 0.539970 0.539970 0.539970
4847.447754 0.000000 2441.513916 0.000000 0.998453 0.000000 0.055594 0.491064 0.491064 0.491064
4833.491699 0.000000 2434.723389 0.000000 0.878201 0.000000 0.478292 0.431541 0.431541 0.431541
"}
object={
	name="palm_dense_generator_1_2"
	clamp_to_water_level=no
	render_under_water=no
	generated_content=yes
	layer="semidynamic"
	pdxmesh="tree_palm_03_mesh"
	count=13
	transform="2170.368164 0.000000 2085.363525 0.000000 0.813675 0.000000 -0.581320 0.870087 0.870087 0.870087
2154.009521 0.000000 2088.374268 0.000000 0.695422 0.000000 -0.718601 0.811080 0.811080 0.811080
2170.305176 0.000000 2077.418945 0.000000 0.499236 0.000000 -0.866466 0.684861 0.684861 0.684861
2152.015625 0.000000 2097.550537 0.000000 0.599147 0.000000 -0.800639 0.846599 0.846599 0.846599
2158.042969 0.000000 2095.776611 0.000000 0.212051 0.000000 -0.977259 0.724124 0.724124 0.724124
2165.427979 0.000000 2107.763184 0.000000 0.617259 0.000000 -0.786760 0.949499 0.949499 0.949499
5485.375000 0.000000 1267.577881 0.000000 0.668519 0.000000 -0.743695 0.641629 0.641629 0.641629
4785.272949 0.000000 2405.968750 0.000000 0.125505 0.000000 -0.992093 0.801399 0.801399 0.801399
4789.519043 0.000000 2398.969238 0.000000 0.843905 0.000000 -0.536493 0.589701 0.589701 0.589701
4844.062988 0.000000 2437.817139 0.000000 0.307550 0.000000 -0.951532 0.968638 0.968638 0.968638
4840.015625 0.000000 2436.456787 0.000000 0.710110 0.000000 -0.704090 0.615547 0.615547 0.615547
4847.663086 0.000000 2438.840088 0.000000 0.816930 0.000000 -0.576737 0.730468 0.730468 0.730468
4845.587891 0.000000 2436.600342 0.000000 0.794365 0.000000 -0.607441 0.870520 0.870520 0.870520
"}
