﻿object={
	name="palm_dense_generator_3_0"
	clamp_to_water_level=no
	render_under_water=no
	generated_content=yes
	layer="semidynamic_high"
	pdxmesh="tree_palm_01_mesh"
	count=21
	transform="2159.960449 0.000000 2076.389160 0.000000 0.521382 0.000000 0.853323 0.331932 0.331932 0.331932
2154.690674 0.000000 2089.480713 0.000000 0.159649 0.000000 0.987174 0.453199 0.453199 0.453199
2152.923828 0.000000 2096.619873 0.000000 0.303298 0.000000 0.952896 0.491358 0.491358 0.491358
2163.813232 0.000000 2104.140869 0.000000 0.629480 0.000000 0.777016 0.556612 0.556612 0.556612
2165.110840 0.000000 2106.769531 0.000000 0.759284 0.000000 0.650759 0.690008 0.690008 0.690008
2164.065186 0.000000 2097.782471 0.000000 0.499607 0.000000 0.866252 0.682350 0.682350 0.682350
2166.939697 0.000000 2090.193848 0.000000 0.021811 0.000000 0.999762 0.734513 0.734513 0.734513
2165.164307 0.000000 2101.551758 0.000000 0.480444 0.000000 0.877025 0.867815 0.867815 0.867815
2164.323975 0.000000 2091.541016 0.000000 0.085371 0.000000 0.996349 0.905442 0.905442 0.905442
2165.364502 0.000000 2090.291260 0.000000 0.742645 0.000000 0.669685 0.953286 0.953286 0.953286
5526.619629 0.000000 1219.692993 0.000000 0.350663 0.000000 0.936502 0.334749 0.334749 0.334749
5476.916016 0.000000 1383.687378 0.000000 0.432945 0.000000 0.901420 0.279207 0.279207 0.279207
4780.412598 0.000000 2414.617432 0.000000 0.010976 0.000000 0.999940 0.171138 0.171138 0.171138
4774.646484 0.000000 2404.500977 0.000000 0.595152 0.000000 0.803613 0.310211 0.310211 0.310211
4790.180664 0.000000 2396.193848 0.000000 0.863798 0.000000 0.503838 0.397768 0.397768 0.397768
4788.319336 0.000000 2399.969482 0.000000 0.283955 0.000000 0.958838 0.296784 0.296784 0.296784
4771.506348 0.000000 2404.213867 0.000000 0.484187 0.000000 0.874965 0.320867 0.320867 0.320867
4782.644531 0.000000 2417.340088 0.000000 0.225081 0.000000 0.974340 0.391160 0.391160 0.391160
4830.608887 0.000000 2434.367676 0.000000 0.179930 0.000000 0.983679 0.213212 0.213212 0.213212
4843.440918 0.000000 2436.516602 0.000000 0.462640 0.000000 0.886546 0.348765 0.348765 0.348765
4845.243652 0.000000 2437.690186 0.000000 0.668509 0.000000 0.743704 0.628783 0.628783 0.628783
"}
object={
	name="palm_dense_generator_3_1"
	clamp_to_water_level=no
	render_under_water=no
	generated_content=yes
	layer="semidynamic_high"
	pdxmesh="tree_palm_02_mesh"
	count=18
	transform="2146.837891 0.000000 2081.528809 0.000000 0.877673 0.000000 -0.479260 0.585911 0.585911 0.585911
2163.955811 0.000000 2078.872314 0.000000 0.999364 0.000000 0.035653 0.592433 0.592433 0.592433
2161.067871 0.000000 2094.450928 0.000000 0.953666 0.000000 -0.300869 0.595641 0.595641 0.595641
2163.308350 0.000000 2105.096924 0.000000 0.977939 0.000000 -0.208891 0.735120 0.735120 0.735120
2162.121826 0.000000 2106.974854 0.000000 0.965960 0.000000 -0.258691 0.932546 0.932546 0.932546
2163.106445 0.000000 2106.790039 0.000000 0.992037 0.000000 -0.125945 0.911649 0.911649 0.911649
2164.881104 0.000000 2105.844238 0.000000 0.973114 0.000000 0.230323 0.973716 0.973716 0.973716
2156.346680 0.000000 2090.832031 0.000000 0.964480 0.000000 -0.264157 1.026629 1.026629 1.026629
2164.295410 0.000000 2100.769043 0.000000 0.998688 0.000000 -0.051210 1.006331 1.006331 1.006331
2162.672119 0.000000 2109.974609 0.000000 0.960212 0.000000 -0.279271 1.031585 1.031585 1.031585
2165.949951 0.000000 2091.766602 0.000000 0.980938 0.000000 -0.194323 1.012450 1.012450 1.012450
5486.203125 0.000000 1266.177612 0.000000 0.935988 0.000000 0.352033 0.438704 0.438704 0.438704
4781.465820 0.000000 2416.639648 0.000000 0.928444 0.000000 -0.371473 0.573401 0.573401 0.573401
4790.403320 0.000000 2392.029541 0.000000 0.999030 0.000000 -0.044032 0.507901 0.507901 0.507901
4790.848633 0.000000 2394.856445 0.000000 0.992596 0.000000 0.121463 0.479344 0.479344 0.479344
4782.588379 0.000000 2416.125000 0.000000 0.975804 0.000000 0.218647 0.568201 0.568201 0.568201
4836.099609 0.000000 2410.661621 0.000000 0.944832 0.000000 -0.327555 0.562110 0.562110 0.562110
4840.398438 0.000000 2437.694580 0.000000 0.915834 0.000000 -0.401557 0.561123 0.561123 0.561123
"}
object={
	name="palm_dense_generator_3_2"
	clamp_to_water_level=no
	render_under_water=no
	generated_content=yes
	layer="semidynamic_high"
	pdxmesh="tree_palm_03_mesh"
	count=23
	transform="2161.315186 0.000000 2076.135742 0.000000 0.191227 0.000000 -0.981546 0.772027 0.772027 0.772027
2156.208740 0.000000 2087.524170 0.000000 0.069761 0.000000 -0.997564 0.720901 0.720901 0.720901
2162.113525 0.000000 2079.192871 0.000000 0.186832 0.000000 -0.982392 0.815448 0.815448 0.815448
2146.961670 0.000000 2082.618652 0.000000 0.650028 0.000000 -0.759911 1.043211 1.043211 1.043211
2165.270996 0.000000 2093.221924 0.000000 0.162553 0.000000 -0.986700 0.735176 0.735176 0.735176
2167.173828 0.000000 2092.969482 0.000000 0.676899 0.000000 -0.736076 1.028818 1.028818 1.028818
2165.339111 0.000000 2098.242432 0.000000 0.327831 0.000000 -0.944736 1.091618 1.091618 1.091618
2152.990479 0.000000 2097.873291 0.000000 0.405738 0.000000 -0.913990 0.883023 0.883023 0.883023
2158.127686 0.000000 2093.224854 0.000000 0.522768 0.000000 -0.852475 1.106261 1.106261 1.106261
2162.836914 0.000000 2108.739746 0.000000 0.112883 0.000000 -0.993608 1.162670 1.162670 1.162670
2158.859131 0.000000 2092.610840 0.000000 0.593798 0.000000 -0.804614 1.097342 1.097342 1.097342
2167.102539 0.000000 2092.062256 0.000000 0.813030 0.000000 -0.582222 0.997260 0.997260 0.997260
2164.795654 0.000000 2090.876465 0.000000 0.696777 0.000000 -0.717288 1.050923 1.050923 1.050923
2166.692627 0.000000 2100.749512 0.000000 0.246240 0.000000 -0.969209 1.101983 1.101983 1.101983
2167.902100 0.000000 2095.238281 0.000000 0.587433 0.000000 -0.809273 1.082626 1.082626 1.082626
5485.839355 0.000000 1269.342041 0.000000 0.338028 0.000000 -0.941136 0.722667 0.722667 0.722667
5514.329590 0.000000 1267.360840 0.000000 0.568661 0.000000 -0.822572 0.699307 0.699307 0.699307
4788.072754 0.000000 2420.846924 0.000000 0.000877 0.000000 -1.000000 0.779256 0.779256 0.779256
4770.559570 0.000000 2405.549316 0.000000 0.704119 0.000000 -0.710082 0.632768 0.632768 0.632768
4783.705078 0.000000 2403.627686 0.000000 0.436886 0.000000 -0.899517 0.730654 0.730654 0.730654
4846.908691 0.000000 2440.137451 0.000000 0.420939 0.000000 -0.907089 0.682552 0.682552 0.682552
4842.844238 0.000000 2437.728027 0.000000 0.143884 0.000000 -0.989595 0.720580 0.720580 0.720580
4844.467773 0.000000 2436.833496 0.000000 0.500102 0.000000 -0.865966 0.934421 0.934421 0.934421
"}
