calumn1;column2;column3;column4
10530.64;Matthew;12-03-2020;False
135.19;Bob;25-011-2021;True
76.40;Ben;01-07-2020;False
435.50;Joshua;27-02-2020;True
10530.64;Matthew;12-03-2020;False
135.19;Bob;25-011-2021;True
76.40;Ben;01-07-2020;False
435.50;Joshua;27-02-2020;True
10530.64;Matthew;12-03-2020;False
135.19;Bob;25-011-2021;True
76.40;Ben;01-07-2020;False
435.50;Joshua;27-02-2020;True
10530.64;Matthew;12-03-2020;False
135.19;Bob;25-011-2021;True
76.40;Ben;01-07-2020;False
435.50;Joshua;27-02-2020;True
10530.64;Matthew;12-03-2020;False
135.19;Bob;25-011-2021;True
76.40;Ben;01-07-2020;False
435.50;Joshua;27-02-2020;True
10530.64;Matthew;12-03-2020;False
135.19;Bob;25-011-2021;True
76.40;Ben;01-07-2020;False
435.50;Joshua;27-02-2020;True