{
    "type": "FeatureCollection",
    "features": [{
            "type": "Feature",
            "geometry": {
                "type": "Point",
                "coordinates": [5.903804,
                    45.595314
                ]
            },
            "properties": {
                "adr1": "1 PLACE PAUL VACHEZ",
                "adr3": "73000 CHAMBERY LE VIEUX",
                "adr2": "MAISON DE
                QUARTIER SALLE PAUL BATTAIL ", "
                tel ": "
                04.79 .72 .06 .85 ", "
                nom ": "
                ART FLORAL ", "
                mailpres ": "
                sandrineetvalerie @wanadoo.fr ",
                "quartier": "CHAMBERY LE VIEUX",
                "code": "10794",
                "adr1cont": "104 RUE DES ARDENNES",
                "service": "VIE ASSOCIATIVE",
                "mailcont": "sandrineetvalerie@wanadoo.fr",
                "objet": "Compositions florales.",
                "nompres": "MME Annie MARCHESE",
                "sousrubrique": "CREATION ARTISTIQUE",
                "rubrique": "LOISIRS",
                "localisation": [45.595314, 5.903804],
                "mail": "sandrineetvalerie@wanadoo.fr",
                "adr1pres": "104 RUE DES ARDENNES",
                "telpres": "04.79.72.06.85",
                "adr2cont": "73000
                CHAMBERY ", "
                telcont ": "
                04.79 .72 .06 .85 ", "
                adr2pres ": "
                73000 CHAMBERY ", "
                nomcont ": "
                MME Annie MARCHESE "}},{"
                type ":
                "Feature",
                "geometry": {
                    "type": "Point",
                    "coordinates": [5.906819, 45.587854]
                },
                "properties": {
                    "adr1": "136 RUE DE LA
                    BALME ", "
                    nom ": "
                    ASSOC PORTUGAISE DE LA CROIX ROUGE ", "
                    adr3 ": "
                    73020 CHAMBERY CEDEX ", "
                    code ": "
                    1033 ", "
                    adr1cont ": "
                    420
                    CHEMIN DE LA CASSINE ", "
                    service ": "
                    RELATIONS INTERNATIONALES ", "
                    objet ": "
                    Pratique du football.
                    ", "
                    telcont ":
                    "06.22.26.47.52",
                    "nompres": "M Jos\u00e9 carlos LOPEZ",
                    "adr2pres": "BP 40333",
                    "rubrique": "RELATIONS
                    INTERNATIONALES ", "
                    localisation ": [45.587854, 5.906819], "
                    adr3pres ": "
                    73020 CHAMBERY CEDEX ", "
                    adr2 ": "
                    BOITE POSTALE
                    40333 ", "
                    adr1pres ": "
                    136 RUE DE LA BALME ", "
                    adr2cont ": "
                    73000 CHAMBERY ", "
                    mail ": "
                    jmc73 @sfr.fr ", "
                    sousrubrique ":
                    "AMICALE",
                    "quartier": "CHAMBERY LE VIEUX",
                    "nomcont": "M Hermani SOARES",
                    "tel": "04.79.62.38.73"
                }
            },
            {
                "type": "Feature",
                "geometry": {
                    "type": "Point",
                    "coordinates": [5.914564, 45.601627]
                },
                "properties": {
                    "adr1": "28 RUE DE SONNAZ",
                    "web": "http://www.cat-santiag-chambery.e-monsite.com/",
                    "adr3": "73000 CHAMBERY",
                    "code": "10863",
                    "tel": "06.21.79.14.10",
                    "service": "CULTURE",
                    "objet": "D\u00e9couvrir et pratiquer de la danse country.",
                    "nompres": "M Geoffrey BERNARD",
                    "sousrubrique": "LOISIRS",
                    "quartier": "CHAMBERY LE VIEUX",
                    "localisation": [45.601627, 5.914564],
                    "adr2": "APPT 603
                    BAT6 C / O M.BEQUET FABRICE ", "
                    nom ": "
                    CHAMBERY CAT 'S SANTIAG", "mailcont": "acide34@hotmail.fr", "mail":
                    "chambery.cats.santiag@gmail.com",
                    "rubrique": "CULTURE",
                    "nomcont": "MME Annick BERNARD"
                }
            },
            {
                "type": "Feature",
                "geometry": {
                    "type": "Point",
                    "coordinates": [5.914564, 45.601627]
                },
                "properties": {
                    "adr1": "28 RUE DE SONNAZ",
                    "web": "http://www.cat-santiag-chambery.e-monsite.com/",
                    "adr3": "73000 CHAMBERY",
                    "code": "10863",
                    "tel": "06.21.79.14.10",
                    "service": "CULTURE",
                    "objet": "D\u00e9couvrir et pratiquer de la danse country.",
                    "nompres": "M Geoffrey BERNARD",
                    "sousrubrique": "DANSE",
                    "quartier": "CHAMBERY LE VIEUX",
                    "localisation": [45.601627, 5.914564],
                    "adr2": "APPT 603 BAT6
                    C / O M.BEQUET FABRICE ", "
                    nom ": "
                    CHAMBERY CAT 'S SANTIAG", "mailcont": "acide34@hotmail.fr", "mail":
                    "chambery.cats.santiag@gmail.com",
                    "rubrique": "CULTURE",
                    "nomcont": "MME Annick BERNARD"
                }
            },
            {
                "type": "Feature",
                "geometry": {
                    "type": "Point",
                    "coordinates": [5.903623, 45.597768]
                },
                "properties": {
                    "adr1": "80 RUE DU BOIS DE CANDIE",
                    "nom": "FD PROD",
                    "adr3": "73000 CHAMBERY",
                    "mailpres": "frederic.dupuy73@orange.fr",
                    "adr1cont": "80 RUE DU BOIS DE
                    CANDIE ", "
                    service ": "
                    CULTURE ", "
                    objet ": "
                    Promouvoir la musique actuelle.
                    ", "
                    telcont ": "
                    06.08 .98 .37 .03 ", "
                    nompres ": "
                    M
                    Fr\u00e9d\u00e9ric DUPUY ", "
                    adr2pres ": "
                    73000 CHAMBERY ", "
                    quartier ": "
                    CHAMBERY LE VIEUX ", "
                    localisation ": [45.597768,
                    5.903623],
                "telpres": "06.08.98.37.03",
                "code": "11126",
                "adr1pres": "80 RUE DU BOIS DE CANDIE",
                "adr2cont": "73000
                CHAMBERY ", "
                mailcont ": "
                frederic.dupuy73 @orange.fr ", "
                sousrubrique ": "
                MUSIQUES ACTUELLES ", "
                rubrique ": "
                CULTURE ",
                "adr2": "C/O M. DUPUY FR\u00c9D\u00c9RIC",
                "nomcont": "M Fr\u00e9d\u00e9ric DUPUY"
            }
        }, {
            "type": "Feature",
            "geometry": {
                "type": "Point",
                "coordinates": [5.903804, 45.595314]
            },
            "properties": {
                "adr1": "PLACE PAUL VACHEZ",
                "nom": "GROUPE
                D 'ART ET TRADITIONS POPULAIRES LES EMBRUNES", "telpres": "06.07.48.70.55", "code": "11150", "adr1cont": "1560 RUE DU
                BOIS DE CANDIE ", "
                service ": "
                CULTURE ", "
                objet ": "
                Transmettre,
                diffuser par le biais de chants,
                danses,
                sayn\u00e8tes,
                contes,
                le folklore traditionnel.
                ", "
                mailpres ": "
                geo.bon @outlook.fr ", "
                nompres ": "
                M Georges BON ", "
                adr2pres ": "
                73000
                CHAMBERY ", "
                rubrique ": "
                CULTURE ", "
                localisation ": [45.595314, 5.903804], "
                adr2 ": "
                73000 CHAMBERY ", "
                adr2cont ": "
                73000
                CHAMBERY ", "
                nomcont ": "
                MME Anne ROULET ", "
                sousrubrique ": "
                DANSE ", "
                quartier ": "
                CHAMBERY LE VIEUX ", "
                adr1pres ": "
                58 ALLEE
                DU VERT BOIS "}},{"
                type ": "
                Feature ", "
                geometry ": {"
                type ": "
                Point ", "
                coordinates ": [5.900098, 45.610413]}, "
                properties ": {
                    "adr1": "38 ALLEE DES IRIS",
                    "adr2": "73000 CHAMBERY",
                    "tel": "09.51.67.40.07",
                    "nom": "LES SPECTACULAIRES",
                    "nompres": "M Gr\u00e9gory HAUFF",
                    "quartier": "CHAMBERY LE VIEUX",
                    "code": "11074",
                    "adr1cont": "RDC PORTE G",
                    "service": "CULTURE",
                    "adr3cont": "73190 CHALLES LES EAUX",
                    "mail": "spectaculaires73@yahoo.fr",
                    "objet": "Spectacles et
                    animations.
                    ", "
                    sousrubrique ": "
                    SPECTACLES ", "
                    rubrique ": "
                    CULTURE ", "
                    localisation ": [45.610413, 5.900098], "
                    adr1pres ":
                    "RDC PORTE G",
                    "telpres": "09.51.67.40.07",
                    "adr2cont": "1995 ROUTE ROYALE",
                    "telcont": "09.51.67.40.07",
                    "adr2pres": "1995 ROUTE ROYALE",
                    "adr3pres": "73190 CHALLES LES EAUX",
                    "nomcont": "M Gr\u00e9gory HAUFF"
                }
            },
            {
                "type": "Feature",
                "geometry": {
                    "type": "Point",
                    "coordinates": [5.903804, 45.595314]
                },
                "properties": {
                    "adr1": "PLACE PAUL VACHEZ",
                    "objet": "Pratiquer la gym hommes, femmes, gym douce, tonique, danse, marche nordique, yoga, combine actimarch' ...",
                    "code": "613",
                    "tel": "06.95.94.55.37",
                    "service": "SPORTS",
                    "nom": "SPORT SANTE GV CHAMBERY LE VIEUX",
                    "mailpres": "gvchamberylevieux@gmail.com",
                    "nompres": "MME Elisabeth GIROD",
                    "sousrubrique": "GYMNASTIQUE",
                    "quartier": "CHAMBERY LE
                    VIEUX ", "
                    localisation ": [45.595314, 5.903804], "
                    adr2 ": "
                    73000 CHAMBERY ", "
                    mailcont ": "
                    henonin - olivier @orange.fr ",
                    "mail": "gvchamberylevieux@gmail.com",
                    "rubrique": "SPORTS",
                    "nomcont": "M Olivier H\u00c9NONIN"
                }
            },
            {
                "type": "Feature",
                "geometry": {
                    "type": "Point",
                    "coordinates": [5.918358, 45.605288]
                },
                "properties": {
                    "adr1": "706 RUE DE SONNAZ",
                    "nom": "TOEEGA",
                    "telpres": "06.23.74.04.44",
                    "code": "2282",
                    "adr1cont": "706 RUE DE SONNAZ",
                    "service": "RELATIONS
                    INTERNATIONALES ", "
                    objet ": "
                    Aide \u00e0 la r\u00e9alisation de projets au Burkina Faso.
                    ", "
                    telcont ": "
                    06.23 .74 .04 .44 ",
                    "nompres": "MME Marie-christine MOUCHET",
                    "adr2pres": "73000 CHAMBERY",
                    "rubrique": "RELATIONS INTERNATIONALES",
                    "localisation": [45.605288, 5.918358],
                    "adr2": "73000 CHAMBERY",
                    "adr1pres": "706 RUE DE SONNAZ",
                    "adr2cont": "73000
                    CHAMBERY ", "
                    mail ": "
                    toeega73 @gmail.com ", "
                    sousrubrique ": "
                    AFRIQUE ", "
                    quartier ": "
                    CHAMBERY LE VIEUX ", "
                    nomcont ": "
                    MME
                    Marie - christine MOUCHET ", "
                    tel ": "
                    04.79 .72 .01 .36 "}},{"
                    type ": "
                    Feature ", "
                    geometry ": {"
                    type ": "
                    Point ", "
                    coordinates ": [5.899446, 45.611233]
                },
                "properties": {
                    "adr1": "919 RUE DU CARRE",
                    "nom": "DES AILES POUR GA\u00cbL",
                    "telpres": "06.33.23.16.18",
                    "mailpres": "desailespourgael@gmail.com",
                    "adr1cont": "25 BIS RUE VICTOR HUGO",
                    "service": "MISSION
                    HANDICAPS ", "
                    adr2cont ": "
                    69100 VILLEURBANNE ", "
                    telcont ": "
                    06.33 .23 .16 .18 ", "
                    nompres ": "
                    MME M\u00e9lanie FOUCAULT ",
                    "adr2pres": "69100 VILLEURBANNE",
                    "rubrique": "HANDICAPS",
                    "localisation": [45.611233, 5.899446],
                    "adr1pres": "25 BIS
                    RUE VICTOR HUGO ", "
                    code ": "
                    2286 ", "
                    objet ": "
                    Aider Ga\u00ebl LYARI BALBUENA et sa famille.Soutenir le milieu du handicap
                    et sensibiliser \u00e0 la maladie.
                    ", "
                    mailcont ": "
                    desailespourgael @gmail.com ", "
                    mail ": "
                    desailespourgael @gmail.com ",
                    "sousrubrique": "SOLIDARITE",
                    "quartier": "CHAMBERY LE VIEUX",
                    "adr2": "73000 CHAMBERY",
                    "nomcont": "MME M\u00e9lanie
                    FOUCAULT "}},{"
                    type ": "
                    Feature ", "
                    geometry ": {"
                    type ": "
                    Point ", "
                    coordinates ": [5.910559, 45.601777]}, "
                    properties ": {
                        "adr1": "106 RUE DU LIMOUSIN",
                        "nom": "ELEFTERIA",
                        "adr3": "73000 CHAMBERY",
                        "code": "2191",
                        "adr1cont": "106 RUE DU
                        LIMOUSIN ", "
                        service ": "
                        CULTURE ", "
                        objet ": "
                        Rencontres et discussions autour de l '\u00e9ducation populaire ainsi que de
                        la promotion de celle - \u00e7i.
                        ", "
                        telcont ": "
                        06.65 .69 .53 .26 ", "
                        nompres ": "
                        M Fabien MALLET ", "
                        adr2pres ": "
                        73000
                        CHAMBERY ", "
                        quartier ": "
                        CHAMBERY LE VIEUX ", "
                        localisation ": [45.601777, 5.910559], "
                        telpres ": "
                        06.65 .69 .53 .26 ", "
                        adr2 ":
                        "C/O M. MALLET",
                        "adr1pres": "106 RUE DU LIMOUSIN",
                        "adr2cont": "73000 CHAMBERY",
                        "mail": "fabienmallet@no-log.org",
                        "sousrubrique": "LECTURE/ECRITURE",
                        "rubrique": "CULTURE",
                        "nomcont": "M Fabien MALLET",
                        "tel": "06.65.69.53.26"
                    }
                },
                {
                    "type": "Feature",
                    "geometry": {
                        "type": "Point",
                        "coordinates": [5.903804, 45.595314]
                    },
                    "properties": {
                        "adr1": "PLACE PAUL VACHEZ",
                        "nom": "EN ATTENDANT ULYSSE",
                        "adr3": "73000 CHAMBERY",
                        "mailpres": "paule.chatel@wanadoo.fr",
                        "adr1cont": "104 RUE DES ARDENNES",
                        "service": "JEUNESSE et COHESION SOCIALE",
                        "objet": "Loisirs cr\u00e9atifs.",
                        "telcont": "04.79.72.06.85",
                        "nompres": "MME Paule CHATEL",
                        "adr2pres": "73000 CHAMBERY",
                        "quartier": "CHAMBERY LE VIEUX",
                        "localisation": [45.595314, 5.903804],
                        "telpres": "06.86.94.63.58",
                        "code": "2118",
                        "adr1pres": "168 RUE DU COMMANDANT BULLE",
                        "adr2cont": "73000 CHAMBERY",
                        "mailcont": "sandrineetvalerie@wanadoo.fr",
                        "sousrubrique": "ANIMATIONS",
                        "rubrique": "VIE DE QUARTIER",
                        "adr2": "MAISON DE QUARTIER PAUL BATTAIL",
                        "nomcont": "MME
                        Annie MARCHESE "}},{"
                        type ": "
                        Feature ", "
                        geometry ": {"
                        type ": "
                        Point ", "
                        coordinates ": [5.903804, 45.595314]}, "
                        properties ": {
                            "adr1": "PLACE PAUL VACHEZ",
                            "nom": "GROUPE D'ART ET TRADITIONS POPULAIRES LES EMBRUNES",
                            "telpres": "06.07.48.70.55",
                            "code": "11150",
                            "adr1cont": "1560 RUE DU BOIS DE CANDIE",
                            "service": "CULTURE",
                            "objet": "Transmettre, diffuser par le
                            biais de chants,
                            danses,
                            sayn\u00e8tes,
                            contes,
                            le folklore traditionnel.
                            ", "
                            mailpres ": "
                            geo.bon @outlook.fr ", "
                            nompres ":
                            "M Georges BON",
                            "adr2pres": "73000 CHAMBERY",
                            "rubrique": "CULTURE",
                            "localisation": [45.595314, 5.903804],
                            "adr2": "73000 CHAMBERY",
                            "adr2cont": "73000 CHAMBERY",
                            "nomcont": "MME Anne ROULET",
                            "sousrubrique": "TRADITION",
                            "quartier": "CHAMBERY LE VIEUX",
                            "adr1pres": "58 ALLEE DU VERT BOIS"
                        }
                    },
                    {
                        "type": "Feature",
                        "geometry": {
                            "type": "Point",
                            "coordinates": [5.912942, 45.603287]
                        },
                        "properties": {
                            "adr1": "23 RUE DES BOIS",
                            "objet": "Favoriser la pratique de la
                            danse autour d 'ateliers chor\u00e9graphiques, jazz african cabaret, orental, boolywood, dance hall.", "code": "11139",
                            "service": "CULTURE",
                            "nom": "KREARTDANSE",
                            "mailpres": "christine.lamesta@gmail.com",
                            "nompres": "MME Christine
                            LAMESTA ", "
                            sousrubrique ": "
                            DANSE JAZZ ", "
                            quartier ": "
                            CHAMBERY LE VIEUX ", "
                            localisation ": [45.603287, 5.912942], "
                            adr2 ":
                            "73000 CHAMBERY LE VIEUX",
                            "nomcont": "MME Christine LAMESTA",
                            "mailcont": "christine.lamesta@gmail.com",
                            "rubrique": "CULTURE"
                        }
                    },
                    {
                        "type": "Feature",
                        "geometry": {
                            "type": "Point",
                            "coordinates": [5.904801, 45.596616]
                        },
                        "properties": {
                            "adr1": "187 RUE COMMANDANT BULLE",
                            "web": "http://randoleo.wordpress.com",
                            "code": "2000",
                            "tel": "04.56.76.58.75",
                            "service": "VIE ASSOCIATIVE",
                            "objet": "Randonn\u00e9e, marche lente en moyenne montagne, nuit\u00e9e en g\u00eete,
                            itin\u00e9rance.
                            ", "
                            nompres ": "
                            M Charles ZIANI ", "
                            sousrubrique ": "
                            RANDONNEES ", "
                            quartier ": "
                            CHAMBERY LE VIEUX ",
                            "localisation": [45.596616, 5.904801],
                            "adr2": "73000 CHAMBERY LE VIEUX",
                            "nom": "RANDOLEO",
                            "nomcont": "M Christian
                            KERHARO ", "
                            mail ": "
                            rando3sources @orange.fr ", "
                            rubrique ": "
                            LOISIRS "}},{"
                            type ": "
                            Feature ", "
                            geometry ": {"
                            type ": "
                            Point ",
                            "coordinates": [5.906819, 45.587854]
                        },
                        "properties": {
                            "adr1": "136 RUE DE LA BALME",
                            "nom": "ASSOC PORTUGAISE DE LA
                            CROIX ROUGE ", "
                            adr3 ": "
                            73020 CHAMBERY CEDEX ", "
                            code ": "
                            1033 ", "
                            adr1cont ": "
                            420 CHEMIN DE LA CASSINE ", "
                            service ":
                            "RELATIONS INTERNATIONALES",
                            "objet": "Pratique du football.",
                            "telcont": "06.22.26.47.52",
                            "nompres": "M Jos\u00e9
                            carlos LOPEZ ", "
                            adr2pres ": "
                            BP 40333 ", "
                            rubrique ": "
                            RELATIONS INTERNATIONALES ", "
                            localisation ": [45.587854, 5.906819],
                            "adr3pres": "73020 CHAMBERY CEDEX",
                            "adr2": "BOITE POSTALE 40333",
                            "adr1pres": "136 RUE DE LA BALME",
                            "adr2cont": "73000
                            CHAMBERY ", "
                            mail ": "
                            jmc73 @sfr.fr ", "
                            sousrubrique ": "
                            PORTUGAL ", "
                            quartier ": "
                            CHAMBERY LE VIEUX ", "
                            nomcont ": "
                            M Hermani
                            SOARES ", "
                            tel ": "
                            04.79 .62 .38 .73 "}},{"
                            type ": "
                            Feature ", "
                            geometry ": {"
                            type ": "
                            Point ", "
                            coordinates ": [5.911195,
                            45.602486]
                    },
                    "properties": {
                        "adr1": "38 RUE DE TOURAINE",
                        "nom": "BABY BOUM GENERATION",
                        "adr3": "73000 CHAMBERY",
                        "code": "2103",
                        "adr1cont": "231 CHEMIN DES SABLI\u00c8RES",
                        "service": "VIE ASSOCIATIVE",
                        "objet": "Nouer liens
                        d 'amiti\u00e9 et de solidarit\u00e9 entre les gens n\u00e9s entre 1948 et 1952 et r\u00e9sidant \u00e0 Chamb\u00e9ry et
                        environs.
                        ", "
                        telcont ": "
                        04.79 .72 .01 .85 ", "
                        nompres ": "
                        M G\u00e9rard VALESINI ", "
                        adr2pres ": "
                        73000 CHAMBERY ", "
                        quartier ":
                        "CHAMBERY LE VIEUX",
                        "localisation": [45.602486, 5.911195],
                        "telpres": "04.79.72.21.32",
                        "adr2": "C/O G\u00c9RARD
                        VALESINI ", "
                        adr1pres ": "
                        38 RUE DE TOURAINE ", "
                        adr2cont ": "
                        73000 SONNAZ ", "
                        mail ": "
                        gvaloche @bbox.fr ", "
                        sousrubrique ":
                        "CONVIVIALITE",
                        "rubrique": "LOISIRS",
                        "nomcont": "MME Josette MILLION-BRODAZ",
                        "tel": "04.79.72.21.32"
                    }
                },
                {
                    "type": "Feature",
                    "geometry": {
                        "type": "Point",
                        "coordinates": [5.911195, 45.602486]
                    },
                    "properties": {
                        "adr1": "38 RUE DE
                        TOURAINE ", "
                        nom ": "
                        BABY BOUM GENERATION ", "
                        adr3 ": "
                        73000 CHAMBERY ", "
                        code ": "
                        2103 ", "
                        adr1cont ": "
                        231 CHEMIN DES
                        SABLI\u00c8RES ", "
                        service ": "
                        VIE ASSOCIATIVE ", "
                        objet ": "
                        Nouer liens d 'amiti\u00e9 et de solidarit\u00e9 entre les gens
                        n\u00e9s entre 1948 et 1952 et r\u00e9sidant \u00e0 Chamb\u00e9ry et environs.
                        ", "
                        telcont ": "
                        04.79 .72 .01 .85 ", "
                        nompres ":
                        "M G\u00e9rard VALESINI",
                        "adr2pres": "73000 CHAMBERY",
                        "quartier": "CHAMBERY LE VIEUX",
                        "localisation": [45.602486,
                            5.911195
                        ],
                        "telpres": "04.79.72.21.32",
                        "adr2": "C/O G\u00c9RARD VALESINI",
                        "adr1pres": "38 RUE DE TOURAINE",
                        "adr2cont": "73000 SONNAZ",
                        "mail": "gvaloche@bbox.fr",
                        "sousrubrique": "AMICALE",
                        "rubrique": "LOISIRS",
                        "nomcont": "MME Josette MILLION-BRODAZ",
                        "tel": "04.79.72.21.32"
                    }
                },
                {
                    "type": "Feature",
                    "geometry": {
                        "type": "Point",
                        "coordinates": [5.906912, 45.598242]
                    },
                    "properties": {
                        "adr1": "47 RUE COMMANDANT BULLE",
                        "nom": "CLUB DES AINES DE SAINT-OMBRE",
                        "adr3": "73000 CHAMBERY",
                        "code": "416",
                        "adr1cont": "ROUTE DE SAINT SULPICE",
                        "service": "CCAS",
                        "objet": "Coordonner
                        les activit\u00e9s du 3 \u00e8me \u00e2ge.
                        ", "
                        telcont ": "
                        04.79 .69 .02 .80 ", "
                        nompres ": "
                        MME Gilberte TOINET ", "
                        adr2pres ":
                        "73160 COGNIN",
                        "quartier": "CHAMBERY LE VIEUX",
                        "localisation": [45.598242, 5.906912],
                        "telpres": "04.79.69.02.80",
                        "adr2": "MAISON DE QUARTIER",
                        "adr2cont": "73160 COGNIN",
                        "nomcont": "MME Gilberte TOINET",
                        "sousrubrique": "CONVIVIALITE",
                        "rubrique": "ACTION SOCIALE",
                        "adr1pres": "ROUTE DE SAINT SULPICE",
                        "tel": "04.79.96.34.30"
                    }
                },
                {
                    "type": "Feature",
                    "geometry": {
                        "type": "Point",
                        "coordinates": [5.906912, 45.598242]
                    },
                    "properties": {
                        "adr1": "47 RUE
                        COMMANDANT BULLE ", "
                        nom ": "
                        CLUB DES AINES DE SAINT - OMBRE ", "
                        adr3 ": "
                        73000 CHAMBERY ", "
                        code ": "
                        416 ", "
                        adr1cont ": "
                        ROUTE
                        DE SAINT SULPICE ", "
                        service ": "
                        CCAS ", "
                        objet ": "
                        Coordonner les activit\u00e9s du 3 \u00e8me \u00e2ge.
                        ", "
                        telcont ":
                        "04.79.69.02.80",
                        "nompres": "MME Gilberte TOINET",
                        "adr2pres": "73160 COGNIN",
                        "quartier": "CHAMBERY LE VIEUX",
                        "localisation": [45.598242, 5.906912],
                        "telpres": "04.79.69.02.80",
                        "adr2": "MAISON DE QUARTIER",
                        "adr2cont": "73160
                        COGNIN ", "
                        nomcont ": "
                        MME Gilberte TOINET ", "
                        sousrubrique ": "
                        LOISIRS ", "
                        rubrique ": "
                        ACTION SOCIALE ", "
                        adr1pres ": "
                        ROUTE
                        DE SAINT SULPICE ", "
                        tel ": "
                        04.79 .96 .34 .30 "}},{"
                        type ": "
                        Feature ", "
                        geometry ": {"
                        type ": "
                        Point ", "
                        coordinates ": [5.911668,
                        45.60285]
                },
                "properties": {
                    "adr1": "206 RUE DES ARDENNES",
                    "nom": "TERR'SPECTIVE",
                    "telpres": "06.78.84.06.70",
                    "code": "10887",
                    "adr1cont": "206 RUE DES ARDENNES",
                    "service": "DEVELOPPEMENT DURABLE",
                    "objet": "Maintenir et promouvoir une
                    agriculture nourrici\u00e8re sur Chamb\u00e9ry le Vieux et les espaces adjacents.
                    ", "
                    telcont ": "
                    06.78 .84 .06 .70 ",
                    "nompres": "MME Micheline DALMAIS",
                    "adr2pres": "73000 CHAMBERY",
                    "rubrique": "ENVIRONNEMENT / CADRE DE VIE",
                    "localisation": [45.60285, 5.911668],
                    "adr2": "73000 CHAMBERY",
                    "adr1pres": "206 RUE DES ARDENNES",
                    "adr2cont": "73000
                    CHAMBERY ", "
                    mail ": "
                    terrspective @hotmail.fr ", "
                    sousrubrique ": "
                    AGRICULTURE ", "
                    quartier ": "
                    CHAMBERY LE VIEUX ", "
                    nomcont ":
                    "MME Micheline DALMAIS",
                    "tel": "06.78.84.06.70"
                }
            },
            {
                "type": "Feature",
                "geometry": {
                    "type": "Point",
                    "coordinates": [5.918358, 45.605288]
                },
                "properties": {
                    "adr1": "706 RUE DE SONNAZ",
                    "nom": "TOEEGA",
                    "telpres": "06.23.74.04.44",
                    "code": "2282",
                    "adr1cont": "706 RUE DE SONNAZ",
                    "service": "RELATIONS INTERNATIONALES",
                    "objet": "Aide \u00e0 la
                    r\u00e9alisation de projets au Burkina Faso.
                    ", "
                    telcont ": "
                    06.23 .74 .04 .44 ", "
                    nompres ": "
                    MME Marie - christine MOUCHET ",
                    "adr2pres": "73000 CHAMBERY",
                    "rubrique": "RELATIONS INTERNATIONALES",
                    "localisation": [45.605288, 5.918358],
                    "adr2": "73000 CHAMBERY",
                    "adr1pres": "706 RUE DE SONNAZ",
                    "adr2cont": "73000 CHAMBERY",
                    "mail": "toeega73@gmail.com",
                    "sousrubrique": "BURKINA FASO",
                    "quartier": "CHAMBERY LE VIEUX",
                    "nomcont": "MME Marie-christine MOUCHET",
                    "tel": "04.79.72.01.36"
                }
            },
            {
                "type": "Feature",
                "geometry": {
                    "type": "Point",
                    "coordinates": [5.903804, 45.595314]
                },
                "properties": {
                    "adr1": "1 PLACE PAUL VACHEZ",
                    "nom": "CLUB DE LA COUTURE",
                    "adr3": "73000 CHAMBERY LE VIEUX",
                    "code": "10793",
                    "adr1cont": "60 RUE DU FONTANIL",
                    "service": "VIE ASSOCIATIVE",
                    "objet": "Art de la couture, cr\u00e9ation sous
                    toutes ses formes.
                    ", "
                    telcont ": "
                    04.79 .68 .94 .50 ", "
                    nompres ": "
                    MME Raymonde LIAUD ", "
                    adr2pres ": "
                    73290 LA MOTTE
                    SERVOLEX ", "
                    quartier ": "
                    CHAMBERY LE VIEUX ", "
                    localisation ": [45.595314, 5.903804], "
                    telpres ": "
                    04.79 .68 .94 .50 ", "
                    adr2 ":
                    "MAISON DE QUARTIER SALLE PAUL BATTAIL",
                    "adr2cont": "73290 LA MOTTE SERVOLEX",
                    "nomcont": "MME Raymonde LIAUD",
                    "sousrubrique": "CREATION ARTISTIQUE",
                    "rubrique": "LOISIRS",
                    "adr1pres": "60 RUE DU FONTANIL"
                }
            },
            {
                "type": "Feature",
                "geometry": {
                    "type": "Point",
                    "coordinates": [5.903623, 45.597768]
                },
                "properties": {
                    "adr1": "80 RUE DU BOIS DE CANDIE",
                    "nom": "FD PROD",
                    "adr3": "73000 CHAMBERY",
                    "mailpres": "frederic.dupuy73@orange.fr",
                    "adr1cont": "80 RUE DU BOIS DE
                    CANDIE ", "
                    service ": "
                    CULTURE ", "
                    objet ": "
                    Promouvoir la musique actuelle.
                    ", "
                    telcont ": "
                    06.08 .98 .37 .03 ", "
                    nompres ": "
                    M
                    Fr\u00e9d\u00e9ric DUPUY ", "
                    adr2pres ": "
                    73000 CHAMBERY ", "
                    quartier ": "
                    CHAMBERY LE VIEUX ", "
                    localisation ": [45.597768,
                    5.903623],
                "telpres": "06.08.98.37.03",
                "code": "11126",
                "adr1pres": "80 RUE DU BOIS DE CANDIE",
                "adr2cont": "73000
                CHAMBERY ", "
                mailcont ": "
                frederic.dupuy73 @orange.fr ", "
                sousrubrique ": "
                MUSIQUE ", "
                rubrique ": "
                CULTURE ", "
                adr2 ": "
                C / O M.
                DUPUY FR\u00c9D\u00c9RIC ", "
                nomcont ": "
                M Fr\u00e9d\u00e9ric DUPUY "}},{"
                type ": "
                Feature ", "
                geometry ": {"
                type ": "
                Point ",
                "coordinates": [5.903804, 45.595314]
            },
            "properties": {
                "adr1": "PLACE PAUL VACHEZ",
                "nom": "GROUPE D'ART ET TRADITIONS
                POPULAIRES LES EMBRUNES ", "
                telpres ": "
                06.07 .48 .70 .55 ", "
                code ": "
                11150 ", "
                adr1cont ": "
                1560 RUE DU BOIS DE CANDIE ",
                "service": "CULTURE",
                "objet": "Transmettre, diffuser par le biais de chants, danses, sayn\u00e8tes, contes, le folklore
                traditionnel.
                ", "
                mailpres ": "
                geo.bon @outlook.fr ", "
                nompres ": "
                M Georges BON ", "
                adr2pres ": "
                73000 CHAMBERY ", "
                rubrique ":
                "CULTURE",
                "localisation": [45.595314, 5.903804],
                "adr2": "73000 CHAMBERY",
                "adr2cont": "73000 CHAMBERY",
                "nomcont": "MME Anne ROULET",
                "sousrubrique": "FOLKLORE",
                "quartier": "CHAMBERY LE VIEUX",
                "adr1pres": "58 ALLEE DU VERT
                BOIS "}},{"
                type ": "
                Feature ", "
                geometry ": {"
                type ": "
                Point ", "
                coordinates ": [5.921512, 45.581027]}, "
                properties ": {"
                adr1 ":
                "213 RUE DE SAINT OMBRE",
                "adr3": "73000 CHAMBERY",
                "adr2": "MAISON DE QUARTIER CHANTEMERLE",
                "tel": "04.79.62.06.83",
                "nom": "GYMNASTIQUE VOLONTAIRE CHANTEMERLE",
                "mailpres": "michele.amblard@laposte.net",
                "quartier": "CHAMBERY LE VIEUX",
                "code": "619",
                "adr1cont": "257 CHEMIN DE CHANTEMERLE",
                "service": "SPORTS",
                "mailcont": "michele.amblard@laposte.net",
                "objet": "Gymnastique d'entretien mixte et s\u00e9niors.",
                "nompres": "MME Mich\u00e8le AMBLARD",
                "sousrubrique": "GYMNASTIQUE VOLONTAIRE",
                "rubrique": "SPORTS",
                "localisation": [45.581027, 5.921512],
                "mail": "michele.amblard@laposte.net",
                "adr1pres": "257 CHEMIN DE CHANTEMERLE",
                "telpres": "04.56.75.29.71",
                "adr2cont": "73000
                CHAMBERY ", "
                telcont ": "
                04.56 .75 .29 .71 ", "
                adr2pres ": "
                73000 CHAMBERY ", "
                nomcont ": "
                MME Mich\u00e8le AMBLARD "}},{"
                type ":
                "Feature",
                "geometry": {
                    "type": "Point",
                    "coordinates": [5.912942, 45.603287]
                },
                "properties": {
                    "adr1": "23 RUE DES
                    BOIS ", "
                    objet ": "
                    Favoriser la pratique de la danse autour d 'ateliers chor\u00e9graphiques, jazz african cabaret,
                    orental,
                    boolywood,
                    dance hall.
                    ", "
                    code ": "
                    11139 ", "
                    service ": "
                    CULTURE ", "
                    nom ": "
                    KREARTDANSE ", "
                    mailpres ":
                    "christine.lamesta@gmail.com",
                    "nompres": "MME Christine LAMESTA",
                    "sousrubrique": "DANSE",
                    "quartier": "CHAMBERY LE
                    VIEUX ", "
                    localisation ": [45.603287, 5.912942], "
                    adr2 ": "
                    73000 CHAMBERY LE VIEUX ", "
                    nomcont ": "
                    MME Christine LAMESTA ",
                    "mailcont": "christine.lamesta@gmail.com",
                    "rubrique": "CULTURE"
                }
            },
            {
                "type": "Feature",
                "geometry": {
                    "type": "Point",
                    "coordinates": [5.912942, 45.603287]
                },
                "properties": {
                    "adr1": "23 RUE DES BOIS",
                    "objet": "Favoriser la pratique de la
                    danse autour d 'ateliers chor\u00e9graphiques, jazz african cabaret, orental, boolywood, dance hall.", "code": "11139",
                    "service": "CULTURE",
                    "nom": "KREARTDANSE",
                    "mailpres": "christine.lamesta@gmail.com",
                    "nompres": "MME Christine
                    LAMESTA ", "
                    sousrubrique ": "
                    DANSE AFRICAINE ", "
                    quartier ": "
                    CHAMBERY LE VIEUX ", "
                    localisation ": [45.603287, 5.912942],
                    "adr2": "73000 CHAMBERY LE VIEUX",
                    "nomcont": "MME Christine LAMESTA",
                    "mailcont": "christine.lamesta@gmail.com",
                    "rubrique": "CULTURE"
                }
            },
            {
                "type": "Feature",
                "geometry": {
                    "type": "Point",
                    "coordinates": [5.906912, 45.598242]
                },
                "properties": {
                    "adr1": "47 RUE COMMANDANT BULLE",
                    "adr2": "73000 CHAMBERY",
                    "tel": "04.79.96.34.30",
                    "nom": "MAISON DE
                    QUARTIER DE CHAMBERY - LE - VIEUX COMITE DE GESTION ", "
                    mailpres ": "
                    janin.rene @noos.fr ", "
                    quartier ": "
                    CHAMBERY LE VIEUX ",
                    "code": "457",
                    "adr1cont": "171 CHEMIN DU PETIT COTEAU",
                    "service": "FETES ET EVENEMENTS",
                    "mailcont": "paulchatel@sfr.fr",
                    "objet": "Gestion de la maison de quartier.",
                    "nompres": "M Ren\u00e9 JANIN",
                    "sousrubrique": "ANIMATIONS",
                    "rubrique": "VIE DE QUARTIER",
                    "localisation": [45.598242, 5.906912],
                    "mail": "janin.rene@noos.fr",
                    "adr1pres": "47 ALLEE DE ROBERTY",
                    "telpres": "04.79.96.05.34",
                    "adr2cont": "73000 CHAMBERY",
                    "telcont": "04.79.62.20.16",
                    "adr2pres": "73000 CHAMBERY",
                    "nomcont": "M Paul CHATEL"
                }
            },
            {
                "type": "Feature",
                "geometry": {
                    "type": "Point",
                    "coordinates": [5.904801, 45.596616]
                },
                "properties": {
                    "adr1": "187 RUE COMMANDANT BULLE",
                    "nom": "MONTAGNES-
                    LOISIRS ", "
                    telpres ": "
                    04.79 .68 .71 .80 ", "
                    code ": "
                    11136 ", "
                    adr1cont ": "
                    37 CHEMIN DU CHANEY ", "
                    service ": "
                    VIE ASSOCIATIVE ",
                    "objet": "Tisser du lien social en \u00e9changeant les savoirs, la culture, par la pratique de la marche.",
                    "telcont": "06.04.50.46.17",
                    "nompres": "MME Marie-jo DAUPHANT",
                    "sousrubrique": "RANDONNEES",
                    "quartier": "CHAMBERY LE VIEUX",
                    "localisation": [45.596616, 5.904801],
                    "nomcont": "MME Muriel ARVIEUX",
                    "adr2": "73000 CHAMBERY",
                    "adr2cont": "73190
                    SAINT BALDOPH ", "
                    mailcont ": "
                    jp.muriel.arvieux @orange.fr ", "
                    rubrique ": "
                    LOISIRS ", "
                    adr2pres ": "
                    73000 CHAMBERY LE VIEUX ",
                    "adr1pres": "157 ALLEE DU BOIS DE CANDIE"
                }
            },
            {
                "type": "Feature",
                "geometry": {
                    "type": "Point",
                    "coordinates": [5.904801,
                        45.596616
                    ]
                },
                "properties": {
                    "adr1": "187 RUE COMMANDANT BULLE",
                    "web": "http://randoleo.wordpress.com",
                    "code": "2000",
                    "tel": "04.56.76.58.75",
                    "service": "VIE ASSOCIATIVE",
                    "objet": "Randonn\u00e9e, marche lente en moyenne montagne,
                    nuit\u00e9e en g\u00eete,
                    itin\u00e9rance.
                    ", "
                    nompres ": "
                    M Charles ZIANI ", "
                    sousrubrique ": "
                    FAMILLES ", "
                    quartier ":
                    "CHAMBERY LE VIEUX",
                    "localisation": [45.596616, 5.904801],
                    "adr2": "73000 CHAMBERY LE VIEUX",
                    "nom": "RANDOLEO",
                    "nomcont": "M Christian KERHARO",
                    "mail": "rando3sources@orange.fr",
                    "rubrique": "LOISIRS"
                }
            },
            {
                "type": "Feature",
                "geometry": {
                    "type": "Point",
                    "coordinates": [5.92803, 45.601182]
                },
                "properties": {
                    "adr1": "740 RUE DE MONTAGNY",
                    "adr3": "73000 CHAMBERY",
                    "adr2": "LA CROIX-ROUGE DESSOUS",
                    "tel": "04.79.33.24.44",
                    "nom": "SPA SOCIETE PROTECTRICE DES
                    ANIMAUX ", "
                    nompres ": "
                    M Robin VEDIE ", "
                    quartier ": "
                    CHAMBERY LE VIEUX ", "
                    code ": "
                    818 ", "
                    adr1cont ": "
                    740 ROUTE DE
                    MONTAGNY ", "
                    service ": "
                    MISSION VIE ANIMALE ", "
                    mailcont ": "
                    spa - savoie @orange.fr ", "
                    objet ": "
                    Engager toutes actions
                    li\u00e9es \u00e0 la protection animale.
                    ", "
                    fax ": "
                    04.79 .85 .15 .82 ", "
                    sousrubrique ": "
                    PROTECTION DES ANIMAUX ",
                    "rubrique": "VIE ANIMALE",
                    "localisation": [45.601182, 5.92803],
                    "adr1pres": "744 ROUTE DE MONTAGNY",
                    "telpres": "04.79.33.24.44",
                    "adr2cont": "73000 CHAMBERY",
                    "telcont": "04.79.33.24.44",
                    "adr2pres": "73000 CHAMBERY",
                    "nomcont": "M
                    Patricia BABOULAZ ", "
                    faxcont ": "
                    47.98 .70 .64 .13 "}},{"
                    type ": "
                    Feature ", "
                    geometry ": {"
                    type ": "
                    Point ", "
                    coordinates ": [5.906912, 45.598242]
                },
                "properties": {
                    "adr1": "47 RUE DU COMMANDANT BULLE",
                    "adr3": "73000 CHAMBERY",
                    "adr2": "MAISON
                    DE QUARTIER PAUL BATTAIL ", "
                    tel ": "
                    04.79 .96 .24 .30 ", "
                    nom ": "
                    UNION FEDERALE DES ASSOCIATIONS ANCIENS COMBATTANTS DE
                    CHAMBERY LE VIEUX ET VICTIMES DE GUERRE ", "
                    mailpres ": "
                    paulchatel @sfr.fr ", "
                    quartier ": "
                    CHAMBERY LE VIEUX ", "
                    code ":
                    "875",
                    "adr1cont": "171 CHEMIN DU PETIT COTEAU",
                    "service": "PROTOCOLE",
                    "mailcont": "paulchatel@sfr.fr",
                    "objet": "Cr\u00e9er et maintenir des liens, une assistance et la d\u00e9fense des droits des adh\u00e9rents.",
                    "nompres": "M
                    Paul CHATEL ", "
                    sousrubrique ": "
                    MILITAIRES ", "
                    rubrique ": "
                    PATRIOTISME ", "
                    localisation ": [45.598242, 5.906912],
                    "adr1pres": "171 CHEMIN DU PETIT COTEAU",
                    "telpres": "04.79.62.20.16",
                    "adr2cont": "73000 CHAMBERY",
                    "telcont": "04.79.62.20.16",
                    "adr2pres": "73000 CHAMBERY",
                    "nomcont": "M Paul CHATEL"
                }
            },
            {
                "type": "Feature",
                "geometry": {
                    "type": "Point",
                    "coordinates": [5.899446, 45.611233]
                },
                "properties": {
                    "adr1": "919 RUE DU CARRE",
                    "nom": "DES AILES POUR
                    GA\u00cbL ", "
                    telpres ": "
                    06.33 .23 .16 .18 ", "
                    mailpres ": "
                    desailespourgael @gmail.com ", "
                    adr1cont ": "
                    25 BIS RUE VICTOR HUGO ",
                    "service": "MISSION HANDICAPS",
                    "adr2cont": "69100 VILLEURBANNE",
                    "telcont": "06.33.23.16.18",
                    "nompres": "MME
                    M\u00e9lanie FOUCAULT ", "
                    adr2pres ": "
                    69100 VILLEURBANNE ", "
                    rubrique ": "
                    HANDICAPS ", "
                    localisation ": [45.611233,
                    5.899446],
                "adr1pres": "25 BIS RUE VICTOR HUGO",
                "code": "2286",
                "objet": "Aider Ga\u00ebl LYARI BALBUENA et sa famille.
                Soutenir le milieu du handicap et sensibiliser \u00e0 la maladie.
                ", "
                mailcont ": "
                desailespourgael @gmail.com ", "
                mail ":
                "desailespourgael@gmail.com",
                "sousrubrique": "HANDICAP PHYSIQUE",
                "quartier": "CHAMBERY LE VIEUX",
                "adr2": "73000
                CHAMBERY ", "
                nomcont ": "
                MME M\u00e9lanie FOUCAULT "}},{"
                type ": "
                Feature ", "
                geometry ": {"
                type ": "
                Point ", "
                coordinates ": [5.910559, 45.601777]
            },
            "properties": {
                "adr1": "106 RUE DU LIMOUSIN",
                "nom": "ELEFTERIA",
                "adr3": "73000 CHAMBERY",
                "code": "2191",
                "adr1cont": "106 RUE DU LIMOUSIN",
                "service": "CULTURE",
                "objet": "Rencontres et discussions autour de
                l '\u00e9ducation populaire ainsi que de la promotion de celle-\u00e7i.", "telcont": "06.65.69.53.26", "nompres": "M
                Fabien MALLET ", "
                adr2pres ": "
                73000 CHAMBERY ", "
                quartier ": "
                CHAMBERY LE VIEUX ", "
                localisation ": [45.601777, 5.910559],
                "telpres": "06.65.69.53.26",
                "adr2": "C/O M. MALLET",
                "adr1pres": "106 RUE DU LIMOUSIN",
                "adr2cont": "73000 CHAMBERY",
                "mail": "fabienmallet@no-log.org",
                "sousrubrique": "LITTERATURE",
                "rubrique": "CULTURE",
                "nomcont": "M Fabien MALLET",
                "tel": "06.65.69.53.26"
            }
        }, {
            "type": "Feature",
            "geometry": {
                "type": "Point",
                "coordinates": [5.903804, 45.595314]
            },
            "properties": {
                "adr1": "PLACE PAUL VACHEZ",
                "nom": "GROUPE D'ART ET TRADITIONS POPULAIRES LES EMBRUNES",
                "telpres": "06.07.48.70.55",
                "code": "11150",
                "adr1cont": "1560 RUE DU BOIS DE CANDIE",
                "service": "CULTURE",
                "objet": "Transmettre, diffuser par le biais de chants, danses, sayn\u00e8tes, contes, le folklore traditionnel.",
                "mailpres": "geo.bon@outlook.fr",
                "nompres": "M Georges BON",
                "adr2pres": "73000 CHAMBERY",
                "rubrique": "CULTURE",
                "localisation": [45.595314, 5.903804],
                "adr2": "73000 CHAMBERY",
                "adr2cont": "73000 CHAMBERY",
                "nomcont": "MME Anne ROULET",
                "sousrubrique": "CHANTS",
                "quartier": "CHAMBERY LE VIEUX",
                "adr1pres": "58 ALLEE DU VERT BOIS"
            }
        }, {
            "type": "Feature",
            "geometry": {
                "type": "Point",
                "coordinates": [5.912942, 45.603287]
            },
            "properties": {
                "adr1": "23 RUE DES BOIS",
                "objet": "Favoriser la pratique de la danse autour d'ateliers chor\u00e9graphiques, jazz african cabaret, orental, boolywood,
                dance hall.
                ", "
                code ": "
                11139 ", "
                service ": "
                CULTURE ", "
                nom ": "
                KREARTDANSE ", "
                mailpres ": "
                christine.lamesta @gmail.com ",
                "nompres": "MME Christine LAMESTA",
                "sousrubrique": "DANSE ORIENTALE",
                "quartier": "CHAMBERY LE VIEUX",
                "localisation": [45.603287, 5.912942],
                "adr2": "73000 CHAMBERY LE VIEUX",
                "nomcont": "MME Christine LAMESTA",
                "mailcont": "christine.lamesta@gmail.com",
                "rubrique": "CULTURE"
            }
        }, {
            "type": "Feature",
            "geometry": {
                "type": "Point",
                "coordinates": [5.900098, 45.610413]
            },
            "properties": {
                "adr1": "38 ALLEE DES IRIS",
                "adr2": "73000 CHAMBERY",
                "tel": "09.51.67.40.07",
                "nom": "LES SPECTACULAIRES",
                "nompres": "M Gr\u00e9gory HAUFF",
                "quartier": "CHAMBERY LE VIEUX",
                "code": "11074",
                "adr1cont": "RDC PORTE G",
                "service": "CULTURE",
                "adr3cont": "73190 CHALLES LES EAUX",
                "mail": "spectaculaires73@yahoo.fr",
                "objet": "Spectacles et animations.",
                "sousrubrique": "ANIMATIONS",
                "rubrique": "CULTURE",
                "localisation": [45.610413, 5.900098],
                "adr1pres": "RDC PORTE G",
                "telpres": "09.51.67.40.07",
                "adr2cont": "1995 ROUTE
                ROYALE ", "
                telcont ": "
                09.51 .67 .40 .07 ", "
                adr2pres ": "
                1995 ROUTE ROYALE ", "
                adr3pres ": "
                73190 CHALLES LES EAUX ", "
                nomcont ":
                "M Gr\u00e9gory HAUFF"
            }
        }, {
            "type": "Feature",
            "geometry": {
                "type": "Point",
                "coordinates": [5.906912, 45.598242]
            },
            "properties": {
                "adr1": "47 RUE COMMANDANT BULLE",
                "adr2": "73000 CHAMBERY",
                "tel": "04.79.96.34.30",
                "nom": "MAISON DE
                QUARTIER DE CHAMBERY - LE - VIEUX COMITE DE GESTION ", "
                mailpres ": "
                janin.rene @noos.fr ", "
                quartier ": "
                CHAMBERY LE VIEUX ",
                "code": "457",
                "adr1cont": "171 CHEMIN DU PETIT COTEAU",
                "service": "FETES ET EVENEMENTS",
                "mailcont": "paulchatel@sfr.fr",
                "objet": "Gestion de la maison de quartier.",
                "nompres": "M Ren\u00e9 JANIN",
                "sousrubrique": "LOISIRS",
                "rubrique": "VIE DE QUARTIER",
                "localisation": [45.598242, 5.906912],
                "mail": "janin.rene@noos.fr",
                "adr1pres": "47 ALLEE DE ROBERTY",
                "telpres": "04.79.96.05.34",
                "adr2cont": "73000 CHAMBERY",
                "telcont": "04.79.62.20.16",
                "adr2pres": "73000 CHAMBERY",
                "nomcont": "M Paul CHATEL"
            }
        }, {
            "type": "Feature",
            "geometry": {
                "type": "Point",
                "coordinates": [5.903804, 45.595314]
            },
            "properties": {
                "adr1": "1 PLACE PAUL VACHEZ",
                "adr3": "73000 CHAMBERY",
                "adr2": "MAIRIE DE QUARTIER DE CHAMBERY LE VIEUX",
                "tel": "04.79.70.59.45",
                "nom": "PASSION TRIAL CHAMBERY",
                "mailpres": "passiontrial73@gmail.com",
                "quartier": "CHAMBERY LE VIEUX",
                "code": "2111",
                "web": "http://www.passiontrial.org",
                "adr1cont": "MONT ROSSET",
                "service": "SPORTS",
                "mail": "passiontrial73@gmail.com",
                "objet": "Club de v\u00e9lo Trial.",
                "nompres": "M S\u00e9bastien PEREZ",
                "sousrubrique": "TRIAL",
                "rubrique": "SPORTS",
                "localisation": [45.595314,
                    5.903804
                ],
                "adr1pres": "MONT ROSSET",
                "telpres": "06.78.99.31.65",
                "adr2cont": "73110 PRESLE",
                "telcont": "06.78.99.31.65",
                "adr2pres": "73110 PRESLE",
                "nomcont": "M Sebastien PEREZ"
            }
        }, {
            "type": "Feature",
            "geometry": {
                "type": "Point",
                "coordinates": [5.904801, 45.596616]
            },
            "properties": {
                "adr1": "187 RUE COMMANDANT BULLE",
                "web": "http://randoleo.wordpress.com",
                "code": "2000",
                "tel": "04.56.76.58.75",
                "service": "VIE ASSOCIATIVE",
                "objet": "Randonn\u00e9e, marche lente en moyenne montagne, nuit\u00e9e en g\u00eete, itin\u00e9rance.",
                "nompres": "M Charles
                ZIANI ", "
                sousrubrique ": "
                CONVIVIALITE ", "
                quartier ": "
                CHAMBERY LE VIEUX ", "
                localisation ": [45.596616, 5.904801], "
                adr2 ":
                "73000 CHAMBERY LE VIEUX",
                "nom": "RANDOLEO",
                "nomcont": "M Christian KERHARO",
                "mail": "rando3sources@orange.fr",
                "rubrique": "LOISIRS"
            }
        }, {
            "type": "Feature",
            "geometry": {
                "type": "Point",
                "coordinates": [5.903804, 45.595314]
            },
            "properties": {
                "adr1": "PLACE PAUL VACHEZ",
                "objet": "Pratiquer la gym hommes, femmes, gym douce, tonique, danse, marche
                nordique,
                yoga,
                combine actimarch ' ...", "code": "613", "tel": "06.95.94.55.37", "service": "SPORTS", "nom": "SPORT
                SANTE GV CHAMBERY LE VIEUX ", "
                mailpres ": "
                gvchamberylevieux @gmail.com ", "
                nompres ": "
                MME Elisabeth GIROD ",
                "sousrubrique": "DANSE",
                "quartier": "CHAMBERY LE VIEUX",
                "localisation": [45.595314, 5.903804],
                "adr2": "73000
                CHAMBERY ", "
                mailcont ": "
                henonin - olivier @orange.fr ", "
                mail ": "
                gvchamberylevieux @gmail.com ", "
                rubrique ": "
                SPORTS ",
                "nomcont": "M Olivier H\u00c9NONIN"
            }
        }, {
            "type": "Feature",
            "geometry": {
                "type": "Point",
                "coordinates": [5.903804,
                    45.595314
                ]
            },
            "properties": {
                "adr1": "PLACE PAUL VACHEZ",
                "objet": "Pratiquer la gym hommes, femmes, gym douce, tonique,
                danse,
                marche nordique,
                yoga,
                combine actimarch ' ...", "code": "613", "tel": "06.95.94.55.37", "service": "SPORTS",
                "nom": "SPORT SANTE GV CHAMBERY LE VIEUX",
                "mailpres": "gvchamberylevieux@gmail.com",
                "nompres": "MME Elisabeth GIROD",
                "sousrubrique": "GYMNASTIQUE VOLONTAIRE",
                "quartier": "CHAMBERY LE VIEUX",
                "localisation": [45.595314, 5.903804],
                "adr2": "73000 CHAMBERY",
                "mailcont": "henonin-olivier@orange.fr",
                "mail": "gvchamberylevieux@gmail.com",
                "rubrique": "SPORTS",
                "nomcont": "M Olivier H\u00c9NONIN"
            }
        }, {
            "type": "Feature",
            "geometry": {
                "type": "Point",
                "coordinates": [5.903804, 45.595314]
            },
            "properties": {
                "adr1": "PLACE PAUL VACHEZ",
                "objet": "Pratiquer la gym hommes, femmes, gym
                douce,
                tonique,
                danse,
                marche nordique,
                yoga,
                combine actimarch ' ...", "code": "613", "tel": "06.95.94.55.37",
                "service": "SPORTS",
                "nom": "SPORT SANTE GV CHAMBERY LE VIEUX",
                "mailpres": "gvchamberylevieux@gmail.com",
                "nompres": "MME Elisabeth GIROD",
                "sousrubrique": "MARCHE NORDIQUE",
                "quartier": "CHAMBERY LE VIEUX",
                "localisation": [45.595314,
                    5.903804
                ],
                "adr2": "73000 CHAMBERY",
                "mailcont": "henonin-olivier@orange.fr",
                "mail": "gvchamberylevieux@gmail.com",
                "rubrique": "SPORTS",
                "nomcont": "M Olivier H\u00c9NONIN"
            }
        }, {
            "type": "Feature",
            "geometry": {
                "type": "Point",
                "coordinates": [5.913018, 45.604217]
            },
            "properties": {
                "adr1": "5, RUE DES ANCOLIES",
                "objet": "Activit\u00e9s
                religieuses et cultuelles.
                ", "
                code ": "
                1692 ", "
                tel ": "
                04.79 .72 .30 .75 ", "
                service ": "
                VIE ASSOCIATIVE ", "
                nom ": "
                ALCTJ ASSOC
                LOCALE POUR LE CULTE DES TEMOINS DE JEHOVAH ", "
                nompres ": "
                M Thierry FALGUIERES ", "
                sousrubrique ": "
                TEMOINS DE JEHOVAH ",
                "quartier": "CHAMBERY LE VIEUX",
                "localisation": [45.604217, 5.913018],
                "adr2": "73000 CHAMBERY",
                "nomcont": "M Thierry
                FALGUIERES ", "
                mail ": "
                alctjchambery @gmail.com ", "
                rubrique ": "
                SPIRITUALITE / RELIGION "}},{"
                type ": "
                Feature ", "
                geometry ": {
                    "type": "Point",
                    "coordinates": [5.903804, 45.595314]
                },
                "properties": {
                    "adr1": "1 PLACE PAUL VACHEZ",
                    "nom": "CLUB DE
                    LA COUTURE ", "
                    adr3 ": "
                    73000 CHAMBERY LE VIEUX ", "
                    code ": "
                    10793 ", "
                    adr1cont ": "
                    60 RUE DU FONTANIL ", "
                    service ": "
                    VIE
                    ASSOCIATIVE ", "
                    objet ": "
                    Art de la couture,
                    cr\u00e9ation sous toutes ses formes.
                    ", "
                    telcont ": "
                    04.79 .68 .94 .50 ",
                    "nompres": "MME Raymonde LIAUD",
                    "adr2pres": "73290 LA MOTTE SERVOLEX",
                    "quartier": "CHAMBERY LE VIEUX",
                    "localisation": [45.595314, 5.903804],
                    "telpres": "04.79.68.94.50",
                    "adr2": "MAISON DE QUARTIER SALLE PAUL BATTAIL",
                    "adr2cont": "73290
                    LA MOTTE SERVOLEX ", "
                    nomcont ": "
                    MME Raymonde LIAUD ", "
                    sousrubrique ": "
                    COUTURE ", "
                    rubrique ": "
                    LOISIRS ", "
                    adr1pres ": "
                    60
                    RUE DU FONTANIL "}},{"
                    type ": "
                    Feature ", "
                    geometry ": {"
                    type ": "
                    Point ", "
                    coordinates ": [5.906912, 45.598242]},
                    "properties": {
                        "adr1": "47 RUE COMMANDANT BULLE",
                        "nom": "CLUB DES AINES DE SAINT-OMBRE",
                        "adr3": "73000 CHAMBERY",
                        "code": "416",
                        "adr1cont": "ROUTE DE SAINT SULPICE",
                        "service": "CCAS",
                        "objet": "Coordonner les activit\u00e9s du
                        3 \u00e8me \u00e2ge.
                        ", "
                        telcont ": "
                        04.79 .69 .02 .80 ", "
                        nompres ": "
                        MME Gilberte TOINET ", "
                        adr2pres ": "
                        73160 COGNIN ",
                        "quartier": "CHAMBERY LE VIEUX",
                        "localisation": [45.598242, 5.906912],
                        "telpres": "04.79.69.02.80",
                        "adr2": "MAISON DE
                        QUARTIER ", "
                        adr2cont ": "
                        73160 COGNIN ", "
                        nomcont ": "
                        MME Gilberte TOINET ", "
                        sousrubrique ": "
                        RETRAITES ", "
                        rubrique ":
                        "ACTION SOCIALE",
                        "adr1pres": "ROUTE DE SAINT SULPICE",
                        "tel": "04.79.96.34.30"
                    }
                },
                {
                    "type": "Feature",
                    "geometry": {
                        "type": "Point",
                        "coordinates": [5.903804, 45.595314]
                    },
                    "properties": {
                        "adr1": "1 PLACE PAUL VACHEZ",
                        "adr3": "73000
                        CHAMBERY LE VIEUX ", "
                        adr2 ": "
                        MAISON DE QUARTIER SALLE PAUL BATTAIL ", "
                        tel ": "
                        04.79 .72 .06 .85 ", "
                        nom ": "
                        ART FLORAL ",
                        "mailpres": "sandrineetvalerie@wanadoo.fr",
                        "quartier": "CHAMBERY LE VIEUX",
                        "code": "10794",
                        "adr1cont": "104 RUE DES
                        ARDENNES ", "
                        service ": "
                        VIE ASSOCIATIVE ", "
                        mailcont ": "
                        sandrineetvalerie @wanadoo.fr ", "
                        objet ": "
                        Compositions florales.
                        ",
                        "nompres": "MME Annie MARCHESE",
                        "sousrubrique": "ANIMATIONS",
                        "rubrique": "LOISIRS",
                        "localisation": [45.595314,
                            5.903804
                        ],
                        "mail": "sandrineetvalerie@wanadoo.fr",
                        "adr1pres": "104 RUE DES ARDENNES",
                        "telpres": "04.79.72.06.85",
                        "adr2cont": "73000 CHAMBERY",
                        "telcont": "04.79.72.06.85",
                        "adr2pres": "73000 CHAMBERY",
                        "nomcont": "MME Annie
                        MARCHESE "}},{"
                        type ": "
                        Feature ", "
                        geometry ": {"
                        type ": "
                        Point ", "
                        coordinates ": [5.903804, 45.595314]}, "
                        properties ": {
                            "adr1": "1 PLACE PAUL VACHEZ",
                            "adr3": "73000 CHAMBERY LE VIEUX",
                            "adr2": "MAISON DE QUARTIER SALLE PAUL BATTAIL",
                            "tel": "04.79.72.06.85",
                            "nom": "ART FLORAL",
                            "mailpres": "sandrineetvalerie@wanadoo.fr",
                            "quartier": "CHAMBERY LE
                            VIEUX ", "
                            code ": "
                            10794 ", "
                            adr1cont ": "
                            104 RUE DES ARDENNES ", "
                            service ": "
                            VIE ASSOCIATIVE ", "
                            mailcont ":
                            "sandrineetvalerie@wanadoo.fr",
                            "objet": "Compositions florales.",
                            "nompres": "MME Annie MARCHESE",
                            "sousrubrique": "ART
                            FLORAL ", "
                            rubrique ": "
                            LOISIRS ", "
                            localisation ": [45.595314, 5.903804], "
                            mail ": "
                            sandrineetvalerie @wanadoo.fr ",
                            "adr1pres": "104 RUE DES ARDENNES",
                            "telpres": "04.79.72.06.85",
                            "adr2cont": "73000 CHAMBERY",
                            "telcont": "04.79.72.06.85",
                            "adr2pres": "73000 CHAMBERY",
                            "nomcont": "MME Annie MARCHESE"
                        }
                    },
                    {
                        "type": "Feature",
                        "geometry": {
                            "type": "Point",
                            "coordinates": [5.903804, 45.595314]
                        },
                        "properties": {
                            "adr1": "1 PLA PAUL VACHEZ",
                            "web": "http://www.apechamberylevieux.fr/facebook",
                            "adr3": "73000 CHAMBERY",
                            "adr2": "ECOLE DE CHAMBERY LE VIEUX",
                            "adr1cont": "208 RUE DE LA FONTAINE",
                            "service": "EDUCATION",
                            "objet": "Etablir un lien entre les familles et l'\u00e9cole.
                            Promouvoir les activit\u00e9s scolaires et p\u00e9riscolaires,
                            ...", "
                            telcont ": "
                            06.95 .79 .06 .20 ", "
                            nompres ": "
                            M Xavier
                            DELAHAIE ", "
                            adr2pres ": "
                            73000 CHAMBERY ", "
                            quartier ": "
                            CHAMBERY LE VIEUX ", "
                            localisation ": [45.595314, 5.903804],
                            "telpres": "06.95.79.06.20",
                            "code": "2102",
                            "nom": "ASSOC DES PARENTS D'ELEVES DES ECOLES PUBLIQUES DE CHAMBERY LE
                            VIEUX ", "
                            adr2cont ": "
                            73000 CHAMBERY ", "
                            nomcont ": "
                            M Xavier DELAHAIE ", "
                            sousrubrique ": "
                            ENSEIGNEMENT PUBLIC ", "
                            rubrique ":
                            "EDUCATION",
                            "adr1pres": "208 RUE DE LA FONTAINE",
                            "tel": "06.95.79.06.20"
                        }
                    },
                    {
                        "type": "Feature",
                        "geometry": {
                            "type": "Point",
                            "coordinates": [5.905302, 45.588702]
                        },
                        "properties": {
                            "adr1": "515 AVENUE DES LANDIERS",
                            "adr2": "73000
                            CHAMBERY ", "
                            tel ": "
                            06.08 .71 .22 .97 ", "
                            nom ": "
                            ASSOCIATION CULTUELLE ET CULTURELLE MAROCAINE DE CHAMBERY ", "
                            mailpres ":
                            "mohamed_serbi@hotmail.com",
                            "quartier": "CHAMBERY LE VIEUX",
                            "code": "10260",
                            "adr1cont": "205 CHEMIN DES CARLINES",
                            "service": "VIE ASSOCIATIVE",
                            "mailcont": "mohamed_serbi@hotmail.com",
                            "objet": "Enseigner la religion musulmane et la
                            langue arabe.Pratiquer des activit\u00e9s culturelles,
                            exercer le culte musulman.
                            ", "
                            nompres ": "
                            M Mohamed SERBI ",
                            "sousrubrique": "CULTE MUSULMAN",
                            "rubrique": "SPIRITUALITE / RELIGION",
                            "localisation": [45.588702, 5.905302],
                            "mail": "mohamed_serbi@hotmail.com",
                            "adr1pres": "205 CHEMIN DES CARLINES",
                            "telpres": "06.08.71.22.97",
                            "adr2cont": "73000
                            JACOB BELLECOMBETTE ", "
                            telcont ": "
                            06.08 .71 .22 .97 ", "
                            adr2pres ": "
                            73000 JACOB BELLECOMBETTE ", "
                            nomcont ": "
                            M Mohamed
                            SERBI "}},{"
                            type ": "
                            Feature ", "
                            geometry ": {"
                            type ": "
                            Point ", "
                            coordinates ": [5.903804, 45.595314]}, "
                            properties ": {"
                            adr1 ":
                            "PLACE PAUL VACHEZ",
                            "nom": "GROUPE D'ART ET TRADITIONS POPULAIRES LES EMBRUNES",
                            "telpres": "06.07.48.70.55",
                            "code": "11150",
                            "adr1cont": "1560 RUE DU BOIS DE CANDIE",
                            "service": "CULTURE",
                            "objet": "Transmettre, diffuser par le biais de
                            chants,
                            danses,
                            sayn\u00e8tes,
                            contes,
                            le folklore traditionnel.
                            ", "
                            mailpres ": "
                            geo.bon @outlook.fr ", "
                            nompres ": "
                            M
                            Georges BON ", "
                            adr2pres ": "
                            73000 CHAMBERY ", "
                            rubrique ": "
                            CULTURE ", "
                            localisation ": [45.595314, 5.903804], "
                            adr2 ": "
                            73000
                            CHAMBERY ", "
                            adr2cont ": "
                            73000 CHAMBERY ", "
                            nomcont ": "
                            MME Anne ROULET ", "
                            sousrubrique ": "
                            MANIFESTATIONS CULTURELLES ",
                            "quartier": "CHAMBERY LE VIEUX",
                            "adr1pres": "58 ALLEE DU VERT BOIS"
                        }
                    },
                    {
                        "type": "Feature",
                        "geometry": {
                            "type": "Point",
                            "coordinates": [5.912942, 45.603287]
                        },
                        "properties": {
                            "adr1": "23 RUE DES BOIS",
                            "objet": "Favoriser la pratique de la
                            danse autour d 'ateliers chor\u00e9graphiques, jazz african cabaret, orental, boolywood, dance hall.", "code": "11139",
                            "service": "CULTURE",
                            "nom": "KREARTDANSE",
                            "mailpres": "christine.lamesta@gmail.com",
                            "nompres": "MME Christine
                            LAMESTA ", "
                            sousrubrique ": "
                            DANSE CONTEMPORAINE ", "
                            quartier ": "
                            CHAMBERY LE VIEUX ", "
                            localisation ": [45.603287, 5.912942],
                            "adr2": "73000 CHAMBERY LE VIEUX",
                            "nomcont": "MME Christine LAMESTA",
                            "mailcont": "christine.lamesta@gmail.com",
                            "rubrique": "CULTURE"
                        }
                    },
                    {
                        "type": "Feature",
                        "geometry": {
                            "type": "Point",
                            "coordinates": [5.904801, 45.596616]
                        },
                        "properties": {
                            "adr1": "187 RUE COMMANDANT BULLE",
                            "nom": "MONTAGNES- LOISIRS",
                            "telpres": "04.79.68.71.80",
                            "code": "11136",
                            "adr1cont": "37 CHEMIN DU CHANEY",
                            "service": "VIE ASSOCIATIVE",
                            "objet": "Tisser du lien social en
                            \u00e9changeant les savoirs,
                            la culture,
                            par la pratique de la marche.
                            ", "
                            telcont ": "
                            06.04 .50 .46 .17 ", "
                            nompres ": "
                            MME
                            Marie - jo DAUPHANT ", "
                            sousrubrique ": "
                            CONVIVIALITE ", "
                            quartier ": "
                            CHAMBERY LE VIEUX ", "
                            localisation ": [45.596616,
                            5.904801],
                        "nomcont": "MME Muriel ARVIEUX",
                        "adr2": "73000 CHAMBERY",
                        "adr2cont": "73190 SAINT BALDOPH",
                        "mailcont": "jp.muriel.arvieux@orange.fr",
                        "rubrique": "LOISIRS",
                        "adr2pres": "73000 CHAMBERY LE VIEUX",
                        "adr1pres": "157 ALLEE DU
                        BOIS DE CANDIE "}},{"
                        type ": "
                        Feature ", "
                        geometry ": {"
                        type ": "
                        Point ", "
                        coordinates ": [5.911668, 45.60285]}, "
                        properties ": {
                            "adr1": "206 RUE DES ARDENNES",
                            "nom": "TERR'SPECTIVE",
                            "telpres": "06.78.84.06.70",
                            "code": "10887",
                            "adr1cont": "206
                            RUE DES ARDENNES ", "
                            service ": "
                            DEVELOPPEMENT DURABLE ", "
                            objet ": "
                            Maintenir et promouvoir une agriculture
                            nourrici\u00e8re sur Chamb\u00e9ry le Vieux et les espaces adjacents.
                            ", "
                            telcont ": "
                            06.78 .84 .06 .70 ", "
                            nompres ": "
                            MME
                            Micheline DALMAIS ", "
                            adr2pres ": "
                            73000 CHAMBERY ", "
                            rubrique ": "
                            ENVIRONNEMENT / CADRE DE VIE ", "
                            localisation ": [45.60285,
                            5.911668],
                        "adr2": "73000 CHAMBERY",
                        "adr1pres": "206 RUE DES ARDENNES",
                        "adr2cont": "73000 CHAMBERY",
                        "mail": "terrspective@hotmail.fr",
                        "sousrubrique": "ENVIRONNEMENT",
                        "quartier": "CHAMBERY LE VIEUX",
                        "nomcont": "MME Micheline
                        DALMAIS ", "
                        tel ": "
                        06.78 .84 .06 .70 "}},{"
                        type ": "
                        Feature ", "
                        geometry ": {"
                        type ": "
                        Point ", "
                        coordinates ": [5.918358,
                        45.605288]
                },
                "properties": {
                    "adr1": "706 RUE DE SONNAZ",
                    "nom": "TOEEGA",
                    "telpres": "06.23.74.04.44",
                    "code": "2282",
                    "adr1cont": "706 RUE DE SONNAZ",
                    "service": "RELATIONS INTERNATIONALES",
                    "objet": "Aide \u00e0 la r\u00e9alisation de
                    projets au Burkina Faso.
                    ", "
                    telcont ": "
                    06.23 .74 .04 .44 ", "
                    nompres ": "
                    MME Marie - christine MOUCHET ", "
                    adr2pres ": "
                    73000
                    CHAMBERY ", "
                    rubrique ": "
                    RELATIONS INTERNATIONALES ", "
                    localisation ": [45.605288, 5.918358], "
                    adr2 ": "
                    73000 CHAMBERY ",
                    "adr1pres": "706 RUE DE SONNAZ",
                    "adr2cont": "73000 CHAMBERY",
                    "mail": "toeega73@gmail.com",
                    "sousrubrique": "SOLIDARITE
                    INTERNATIONALE ", "
                    quartier ": "
                    CHAMBERY LE VIEUX ", "
                    nomcont ": "
                    MME Marie - christine MOUCHET ", "
                    tel ":
                    "04.79.72.01.36"
                }
            },
            {
                "type": "Feature",
                "geometry": {
                    "type": "Point",
                    "coordinates": [5.906912, 45.598242]
                },
                "properties": {
                    "adr1": "47 RUE DU COMMANDANT BULLE",
                    "adr3": "73000 CHAMBERY",
                    "adr2": "MAISON DE QUARTIER PAUL
                    BATTAIL ", "
                    tel ": "
                    04.79 .96 .24 .30 ", "
                    nom ": "
                    UNION FEDERALE DES ASSOCIATIONS ANCIENS COMBATTANTS DE CHAMBERY LE VIEUX ET
                    VICTIMES DE GUERRE ", "
                    mailpres ": "
                    paulchatel @sfr.fr ", "
                    quartier ": "
                    CHAMBERY LE VIEUX ", "
                    code ": "
                    875 ", "
                    adr1cont ": "
                    171
                    CHEMIN DU PETIT COTEAU ", "
                    service ": "
                    PROTOCOLE ", "
                    mailcont ": "
                    paulchatel @sfr.fr ", "
                    objet ": "
                    Cr\u00e9er et maintenir des
                    liens,
                    une assistance et la d\u00e9fense des droits des adh\u00e9rents.
                    ", "
                    nompres ": "
                    M Paul CHATEL ", "
                    sousrubrique ":
                    "ANCIENS COMBATTANTS",
                    "rubrique": "PATRIOTISME",
                    "localisation": [45.598242, 5.906912],
                    "adr1pres": "171 CHEMIN DU
                    PETIT COTEAU ", "
                    telpres ": "
                    04.79 .62 .20 .16 ", "
                    adr2cont ": "
                    73000 CHAMBERY ", "
                    telcont ": "
                    04.79 .62 .20 .16 ", "
                    adr2pres ":
                    "73000 CHAMBERY",
                    "nomcont": "M Paul CHATEL"
                }
            }]
    }