543730 852462
244937 730075
710583 691691
57867 542501
486077 575239
367766 34212
354449 385997
308080 48701
351005 757532
690886 189324
826109 845103
510300 533346
428966 125600
186410 657208
36333 46806
616937 256302
798626 712980
846480 713901
813670 726103
927227 587999
233657 325036
378450 28972
488649 490313
296896 109368
974745 782477
405835 349555
111739 287857
895839 204362
341953 193957
440333 874837
289295 177920
604756 166578
491641 261046
934086 218946
230150 543717
613324 231859
575392 653906
724480 279875
977934 622945
369841 275071
498766 988373
770538 314941
463404 98253
92474 565334
876603 376422
561657 921043
791567 908866
813806 945676
88176 872366
531003 897294
276379 199231
528656 241185
896875 392929
91335 405406
843960 581215
122543 253577
981180 438100
549587 154865
812908 273390
262080 335074
358561 969986
226638 50685
230783 298388
730270 383353
724403 668619
816232 207880
832443 891575
426958 800668
292929 333615
53853 992412
499132 694957
16436 559875
460076 502646
846675 663160
315082 459678
847175 622189
307449 600929
12759 899418
475476 441594
418051 153494
273134 711745
655521 227566
622199 138997
614147 23517
641882 556236
453023 563791
97831 506241
731608 550853
932015 626737
954130 684659
641933 110820
232959 965927
630898 46660
219718 431874
911928 702483
412994 263009
502712 76569
781384 740302
539042 714342
28244 700462
405712 547837
600009 831290
921546 165655
936599 95160
184983 143639
197521 95395
495791 760822
26699 425376
877076 906787
304402 363409
646426 543745
653729 623097
580135 318751
219863 192322
764129 345571
5567 68023
315216 232222
608417 484613
595651 816085
436720 20379
544014 583513
700022 987931
627209 940188
667753 730079
970367 857065
859299 32733
706806 423317
750301 165196
885862 763526
63795 208976
790429 702870
205360 488936
371428 954051
631595 374380
862604 168351
746907 305800
566673 593652
341592 823050
574883 755521
908751 850971
839699 468899
659559 965162
234580 793064
523242 873692
718543 325867
591661 994472
485052 413553
478250 436338
873702 874959
102129 352508
359924 479548
29773 133152
748191 231472
361513 597501
911789 3243
308615 58984
652521 239735
773779 50646
20616 655354
397617 153242
908890 139087
100716 486107
907860 478194
369583 636030
632530 454367
239022 748531
198069 296546
636322 460812
855145 692816
868161 245837
141430 143235
53097 503395
776230 944153
777134 80625
405502 667912
682860 577253
320812 952445
588082 859662
591921 619035
641656 79977
135942 196439
889264 574609
387050 600875
194215 410704
787474 736498
916418 645171
766469 183570
866557 672181
822906 121766
419447 815858
705941 14321
14850 316724
31773 916209
609145 504939
838725 148109
430648 68144
426743 257344
795702 93425
104017 433211
319470 14736
693511 531941
241697 95627
786577 204057
127084 513410
147396 861689
260365 344928
