253504 263732 407
795669 373286 509
387068 672769 509
422913 199986 449
126723 214543 383
556653 533851 452
389568 811425 509
675400 374718 509
406748 24436 443
298841 146907 443
81904 446901 449
873638 371658 525
330880 103825 443
962640 440425 525
363570 614566 470
238471 457008 449
661255 82830 509
88458 841017 525
113552 419037 449
700937 504431 509
185178 575424 470
287964 293693 389
380723 665024 509
515490 213810 470
327468 566235 470
849600 695496 525
433330 491916 444
743810 775419 468
454127 971509 525
375946 776634 509
248273 530266 470
767130 539163 509
558755 721262 509
485898 665283 509
140030 903765 525
383758 406299 436
968666 499058 525
233057 964498 525
73399 532497 470
172056 146904 383
697755 48392 509
13735 206296 383
625586 413727 470
704187 783213 504
331748 177962 443
905493 667274 525
759498 352475 509
941561 142647 525
299952 499735 449
549467 676486 509
294982 332979 384
707937 546257 509
101965 986306 525
625383 326465 470
64707 110333 354
418196 384338 449
866137 879574 432
164340 222580 386
476471 627638 509
411536 265111 449
328154 255475 407
83918 689002 509
365478 793891 509
611508 221666 470
364482 783200 509
374912 577442 470
163712 651742 509
430699 850939 525
602259 516397 452
727382 492387 509
237866 437202 449
808213 510064 509
388105 654060 509
185228 947162 525
313309 705334 509
204784 970227 525
52233 695896 509
257859 317286 407
829186 595026 509
709010 604028 509
887016 343117 525
855186 265616 525
794989 570763 509
321807 422424 449
390810 299861 441
265663 325872 407
930396 507212 525
993310 556212 525
885013 506837 525
590147 244012 470
238073 725400 509
285257 180679 443
16403 222702 386
264572 154739 443
595502 508970 470
358209 126329 443
780222 368415 509
988186 845864 507
240086 949091 525
864726 840783 419
366710 217467 443
679687 598071 509
820994 723387 468
735548 245219 509
466917 664420 509
98981 769628 509
365864 542599 470
552888 737446 509
136040 693092 509
236090 74581 443
876235 761847 525
635251 118773 509
331574 634946 509
399870 294984 441
102638 906200 525
969961 779241 525
835388 939949 525
422834 958858 525
37172 493041 449
400063 603185 470
628614 694502 442
955660 301877 525
147582 33647 375
50120 350912 443
396264 752086 509
319081 841782 525
793304 6687 509
885866 548924 525
159400 796553 509
428601 512720 470
559987 59510 470
474072 320083 449
605264 485283 470
94218 436493 449
733333 184177 509
513687 76284 470
820547 978994 525
35380 460326 449
628883 11003 509
33384 98742 351
984304 865923 507
127084 693531 509
771535 244843 509
866230 427275 525
272459 827312 509
194209 692806 509
581841 920344 525
922825 306990 525
401915 137061 443
8233 985493 525
280723 35397 443
863666 934386 476
879362 115931 525
182941 481729 449
92848 787132 509
212646 571222 470
820695 447893 509
633855 190658 509
330192 643148 509
296423 521130 470
90262 821129 509
912300 936783 476
27272 680604 509
99891 506093 449
713991 84726 509
868463 478154 525
284635 994399 525
826092 526064 509
310600 111945 443
346371 803713 509
603419 592865 403
865684 128352 525
794986 596894 509
165131 770595 509
634971 793374 504
445443 542639 470
188396 162878 365
322215 652461 509
984226 59287 525
880829 525501 525
546118 744781 509
458945 348461 449
900813 297541 525
238500 647805 509
908097 243249 525
214354 341844 443
3905 827798 509
271493 984160 525
778876 231128 509
529446 310975 470
570756 275581 470
74539 313751 443
546305 113984 470
840466 569855 525
559535 398105 470
134677 754480 509
914331 423220 525
490834 328079 449
643077 827106 504
951422 381600 525
869868 104028 525
109552 132893 349
77037 312841 443
903975 849799 445
12051 945975 525
81201 768958 509
95503 144309 375
252792 567530 470
389361 581784 470
233580 326629 407
446504 406268 449
484301 306585 449
792714 409898 509
713361 100581 509
395410 126449 443
820737 536420 509
560332 959728 525
603991 648402 509
574486 216327 470
999645 432222 525
601414 424529 470
507924 49388 449
