24284 296748 443
900425 867143 445
952611 182119 525
514988 888879 525
390989 121253 443
950336 649818 525
701880 245633 509
258044 542593 470
153527 915464 525
174072 693023 509
509080 65481 449
337276 762382 509
509822 144625 449
686316 409316 509
898148 684599 525
477371 711187 509
179089 279245 443
98496 698556 509
450887 685548 509
921675 672916 525
131782 318740 443
231457 945056 525
439271 592271 470
926641 291022 525
254567 817227 509
698483 87292 509
85158 319232 443
779507 479817 509
820072 537299 509
492488 912685 525
330352 745921 509
173462 858440 525
910721 369269 525
103777 354362 443
654831 312656 509
918615 257961 525
82682 725379 509
673030 381983 509
879790 532888 525
606303 571928 434
758867 267619 509
235377 226584 443
110435 274199 443
333158 901632 525
378691 93712 443
402845 93389 443
652936 752485 504
15364 500377 449
553151 336382 470
268234 740283 509
738006 509528 509
503943 903522 525
226685 176324 386
59654 709864 509
900839 164644 525
237063 644491 509
927617 686564 525
584032 277241 470
691515 627987 442
611594 77417 470
773411 500391 509
829661 630704 504
366620 667081 509
69298 157218 383
675323 957595 525
374649 276355 441
794147 148968 509
327921 174300 443
932427 803955 525
541366 837439 509
733596 653164 504
116132 592427 470
27878 66426 340
335909 771035 509
956934 869094 507
359302 555702 470
697619 297303 509
232322 696324 509
361403 990705 525
85429 533074 470
360796 362515 366
62734 563886 470
876122 563668 525
354441 724104 509
90536 854642 525
817993 210849 509
752916 726199 424
882604 744002 525
868892 247431 525
544002 223855 470
41885 555562 470
801953 984986 525
509597 773859 509
110889 962739 525
398381 277043 441
111933 181633 383
834824 647016 504
518434 978986 525
752306 310448 509
57273 373861 443
993255 573539 525
520388 452709 470
746703 362362 509
549809 546315 452
970940 964594 458
241073 884576 525
219793 887751 525
549808 401357 470
328365 181975 443
782611 488980 509
220992 625287 470
119402 979325 525
691095 786486 504
586287 423645 470
935453 506319 525
979291 103390 525
269925 985360 525
314012 969641 525
720440 574211 509
244709 18514 443
519804 419170 470
141512 688167 509
433384 986256 525
371894 631440 509
401883 123330 443
375014 925423 525
644226 226940 509
342405 984924 525
888252 285162 525
150104 97925 375
857057 520218 525
841500 319041 525
92516 831587 509
895731 78444 525
376836 765044 509
313984 155899 443
811988 397180 509
542046 766333 509
687052 109149 509
367344 151792 443
903901 900225 401
683978 756105 504
611286 299646 470
964673 215452 525
246983 911229 525
453078 73562 449
246592 290428 407
537159 398863 470
349036 309404 441
403323 171770 443
231498 862514 525
702062 985479 525
445616 773580 509
638449 111076 509
645960 17982 509
423480 942022 525
882343 31776 525
871704 636738 525
114966 92972 354
919855 525076 525
117287 409880 443
875903 244387 525
379684 921078 525
848980 335918 525
729601 663649 504
934211 329722 525
843730 27348 525
546652 730645 509
252159 172696 443
229782 241731 443
32254 497165 449
846170 173619 525
784644 82234 509
358205 519801 470
268593 777007 509
28262 984329 525
729429 391312 509
77024 144558 375
422474 692924 509
555561 444849 470
517748 249494 470
246111 834596 509
375276 443561 449
715264 927983 525
711469 36429 509
979309 777078 525
328389 254332 407
379014 664437 509
763920 569168 509
255301 312689 407
855416 723428 525
832509 216834 509
495634 239763 449
723824 703259 504
875380 125303 525
185080 657197 509
1903 42238 324
403141 379341 436
771799 46719 509
669858 311020 509
265601 266513 332
296872 416266 449
801225 572611 509
853921 62275 525
864481 399650 525
930227 759608 525
616824 779562 509
619641 168636 470
199744 598062 470
144175 694277 509
594014 731243 509
790916 665004 504
379429 204368 443
898311 435937 525
207041 748872 509
845765 580450 525
84543 231799 443
923717 693891 525
616404 810633 509
423583 825924 509
193050 821637 509
19779 501998 449
298041 575258 470
802321 901999 525
246088 557178 470
877729 780783 525
579642 261024 470
856709 36730 525
42175 214763 383
457233 366934 449
431371 356145 449
99945 296297 443
156276 532676 470
