564056 756799
119446 92831
662742 670323
864038 906596
775900 174231
821009 598966
7362 568685
991753 538844
781103 701430
359881 886585
871391 14032
853907 454301
622936 490575
809099 46604
116211 349859
597381 326549
627399 140688
386586 212223
217082 893924
386231 526783
646086 450551
320565 267365
864454 503428
913646 647698
333720 599323
979170 579733
854249 605442
786478 921482
219221 387216
127945 711658
10558 829658
50171 730553
397193 835301
866990 884580
540565 383383
304652 491479
56641 855904
37591 380217
834347 749637
626703 894772
485731 818978
331221 422113
222775 739434
960654 611072
541012 233358
329563 653514
574887 922178
538648 887130
57601 443579
429278 403605
817790 598746
551417 382148
251631 180276
867684 562753
560750 525408
251746 525558
410179 301501
416984 93251
437130 140624
644240 645481
498622 632345
150714 626542
295422 636700
24378 299439
60929 545776
402217 474237
877918 314685
883549 330415
901020 638222
458054 330037
437839 307144
386856 650260
917288 735588
442346 496349
891082 781684
982882 406502
450752 719067
46197 353147
395886 499456
871429 744277
791129 110435
964776 685469
393767 869848
70095 765497
117985 741631
909916 319414
120877 853342
326478 916772
440565 123957
549036 347774
481011 95722
279048 482694
257771 384174
734454 698899
284467 707611
700424 322539
130985 416817
547849 638564
266607 573615
486699 57315
938079 825965
689259 694868
459115 587086
336020 75410
433915 724896
17876 910147
521594 273837
208236 866139
237459 917873
103696 297584
298786 637731
835334 63347
17024 876712
244902 450266
903586 538427
673060 160384
806753 797998
81698 789423
804052 516407
988531 410642
786989 155644
166392 707564
201585 353688
387781 396410
283869 436935
241616 861261
788942 179441
156827 312486
582672 235146
728259 189920
902053 217121
497793 269922
959902 94993
30115 529173
236697 317396
996392 498214
735697 588968
512941 150989
949797 418799
518856 929623
454471 148305
892722 258158
256172 738705
860342 980276
705836 101424
23731 410292
466324 205534
189050 544446
422333 895173
648499 616483
109378 563968
277605 286639
399397 989472
408268 742599
12928 943468
727062 476275
700664 513645
794735 361129
479882 76336
120036 254924
911610 744202
941913 230444
696941 696598
86874 413557
815043 933736
570250 22338
785794 143241
731564 324584
546502 681525
524280 30999
579328 96983
271956 242843
637325 110871
162094 294180
438644 882495
360704 875008
992827 677784
427476 497889
59297 68327
229792 827286
277983 600124
108333 677459
268856 221851
283832 288252
9292 968820
826883 931379
542783 396813
44618 531637
755295 614746
165317 529989
704492 870799
998116 565741
469256 167425
955027 162464
274035 438103
381123 846179
244239 479410
337237 365409
455881 808292
265519 194904
187290 381757
961324 382252
883692 456473
554677 698399
395465 269309
599708 556419
821561 363755
901362 634834
634042 411250
512705 281636
448299 402413
458728 526121
821065 964875
147318 990894
127917 997511
344701 137717
164556 48879
221144 861335
368548 262137
460297 18680
536320 363696
34126 53973
88086 176080
975622 469024
889865 501591
205287 896776
900450 852532
784773 872215
492900 88246
90875 813170
791417 766352
617845 212879
675139 51387
45658 222637
920958 390434
406507 877255
112030 895693
98358 417440
596416 844499
63898 927559
907829 639548
149309 843956
282177 633768
681142 464379
639172 193560
520139 118377
340210 856364
928218 855413
580633 659852
930540 213332