92433 998855 525
843989 24422 525
872916 699560 525
374802 710377 509
918894 991829 507
972565 651001 525
453423 914722 525
212617 326041 443
371375 17890 443
793004 110029 509
369421 736785 509
443676 861410 525
132027 496002 449
286621 395925 441
521453 12564 470
125426 446901 449
240358 486609 449
231150 240790 381
645794 71420 509
154464 481861 449
602241 42354 470
378342 772128 509
4857 990654 525
64519 113322 354
470336 610402 470
200697 343313 443
270357 350942 441
407028 631214 509
694930 256681 509
550790 449538 470
894301 872584 445
520695 27429 470
337470 543836 470
672138 321348 509
282666 522408 470
893542 256306 525
856835 504161 525
695798 166888 509
91989 557447 470
3605 201794 383
756288 436501 509
245103 718919 509
320107 936073 525
230407 71320 386
56932 105364 351
775012 501242 509
186267 600126 470
604200 942467 525
898421 724384 525
8731 614769 470
42108 425053 449
829322 302819 509
506574 169110 449
97572 562861 470
27271 38292 324
822082 406144 509
513862 439060 470
148950 911253 525
26675 497961 449
703041 641986 442
220365 77880 386
731897 815232 468
933245 712273 525
166536 161272 352
747119 311662 509
394992 448354 449
396173 921767 525
664954 262255 509
258427 515289 470
544211 597161 452
853008 113886 525
836809 430160 509
211343 963275 525
778799 719431 468
994036 647600 525
113467 453526 449
312480 811414 509
509037 196905 449
927682 53000 525
636631 201027 509
217869 590121 470
780673 171527 509
336804 468390 449
953386 914009 507
606684 5782 470
620477 245690 470
65277 116386 354
889346 205151 525
194494 600937 470
584098 745827 509
2858 916933 525
170158 401121 443
964720 985383 458
295048 41443 443
456927 684040 509
430953 616936 470
24880 198143 383
338421 659016 509
804371 684751 504
465884 679916 509
759160 32291 509
137230 523940 470
534456 266439 470
742098 90510 509
199677 30762 383
105280 239714 443
279362 14712 443
947194 683427 525
176609 537696 470
56603 855217 525
635067 51584 509
729398 596830 509
89585 326484 443
933799 915768 476
300919 571037 470
804698 701697 504
22196 324308 443
954829 415448 525
912643 49374 525
68928 398282 443
305329 378490 441
775171 201205 509
610876 13965 470
867751 26281 525
837025 864742 525
502298 547323 470
793736 508699 509
651386 115757 509
354759 307642 441
21650 110964 354
128653 441241 449
946948 237054 525
526888 56318 470
459252 846107 525
380858 897182 525
764866 423178 509
646527 676412 442
871412 94900 525
488285 613301 470
563407 289953 470
83956 940769 525
207916 213171 355
539862 598143 452
50310 236322 443
656908 408693 509
515694 566433 452
987812 440881 525
751604 354503 509
294683 16970 443
234593 343832 407
725709 426633 509
395296 198504 443
438730 453881 387
849190 116281 525
430019 807232 509
118725 8632 354
722394 918928 525
279987 934256 525
86781 360565 443
293263 146319 443
52788 693137 509
356436 534722 470
623973 402714 470
204993 542339 470
245051 234223 381
140200 769352 509
907661 974701 507
732037 809193 468
430719 422695 418
813588 731688 468
883516 488010 525
634823 232346 509
366360 476928 449
321591 991905 525
171139 68806 383
229671 730560 509
263924 859503 525
951387 875184 507
262809 81400 443
397810 626712 509
395105 576409 470
120542 395102 443
499667 986511 525
582232 606698 434
251556 536270 470
754010 877749 525
261407 70907 443
113373 712516 509
612009 375814 470
72878 191152 383
469770 998917 525
315338 895920 525
444687 366940 449
333114 333513 322
330403 779474 509
792975 129902 509
476631 465556 413
294435 945998 525
156521 529282 470
95671 355313 443
5673 282340 443
612306 660072 509
295891 852680 525
228613 649752 509
156270 343851 443
218222 727290 509
131663 286739 443
74272 327349 443
153282 502749 449
404746 97126 443
47885 821927 509
238038 558940 470
796271 567737 509
749219 778040 468
382652 759735 509
313334 893620 525
574692 145347 470
645640 778948 504
655778 633070 416
565445 872418 525
251099 335421 407
898611 237522 525
284361 886635 525
385974 209150 443
80025 365732 443
334156 23428 443
731597 847889 525
95732 131346 354
345380 554746 470
747093 437377 509
529024 132384 470
666459 503992 509
845460 263775 525
533460 892026 525
573899 242638 470
75133 742441 509
339924 208825 443
735127 29473 509
10220 50493 324
539691 300883 470
322530 927805 525
537392 754662 509
962322 184685 525
984657 582740 525
110628 599140 470
924558 105870 525
977796 657415 525
324798 350909 441
513691 98887 470
960288 730868 525
