353919 439173 449
121101 721144 509
994523 910485 507
355137 676433 509
269545 948229 525
794391 18069 509
199251 843599 525
520328 46804 470
678366 893393 525
697471 498810 509
139231 599437 470
431049 517210 470
31283 536230 470
281526 918582 525
656827 382220 509
931805 710801 525
677938 815333 504
180393 768300 509
428905 561823 470
78843 111594 354
897148 485490 525
840866 352570 525
137664 933277 525
359435 346588 379
642419 708612 504
183392 893361 525
694709 861964 525
100983 557827 470
666010 823439 504
939417 950097 507
583688 651890 509
631276 533742 509
283322 175429 443
866328 169843 525
224864 803326 509
349612 63833 443
697920 233463 509
507911 389347 449
562751 870521 525
931897 931649 277
896602 473393 525
811600 580348 509
689998 200113 509
416331 913098 525
435577 267283 449
968456 858228 507
684228 233015 509
181539 291237 443
719722 190888 509
124945 172079 383
703319 338179 509
48965 257074 443
147221 890714 525
497786 578809 470
664021 702263 442
276112 453692 449
927245 96979 525
73377 187160 383
802376 19783 509
906725 966776 507
362525 418558 449
96700 32780 351
36339 549716 470
530572 206629 470
152899 422695 449
895864 892003 370
75504 91432 351
343734 843725 525
777177 136427 509
403074 618682 470
998563 261722 525
450996 8552 449
148652 156983 383
575740 438419 470
596655 458814 470
915295 777655 525
560189 870142 525
720367 815786 468
283885 212892 443
483081 32303 449
442266 842147 525
842871 224069 525
80332 254919 443
515385 901216 525
752083 618106 509
14504 93443 351
772944 215483 509
623703 791579 509
291473 996256 525
161681 954585 525
668072 539231 509
749262 556760 509
229150 408325 443
701577 87169 509
76165 869313 525
941435 169844 525
984630 814273 525
525693 347386 470
106583 731673 509
323171 847703 525
849564 327811 525
813432 903309 525
795676 109227 509
169215 639711 509
963632 178617 525
718403 213403 509
856864 45532 525
181490 656656 509
65413 520528 470
796322 711551 468
124442 789846 509
656936 125524 509
859517 328486 525
231499 524009 470
656417 676454 442
667523 905472 525
767 103067 351
534780 801457 509
127460 822546 509
843980 378302 525
433516 194276 449
815335 399030 509
61773 211248 383
7143 33367 308
946485 349734 525
568339 72796 470
52419 892252 525
146387 179171 383
14549 463826 449
741799 588015 509
463941 284814 449
599089 484146 470
950263 169033 525
261767 62349 443
633841 63044 509
464217 632493 509
951463 587186 525
619181 518524 452
670111 278933 509
837944 77736 525
595346 262315 470
655262 247730 509
535315 946968 525
800346 424848 509
537592 513241 439
424223 405795 449
886051 224436 525
846201 879573 432
764164 585666 509
281838 551562 470
483879 134476 449
742497 419251 509
415114 856648 525
854665 21139 525
21409 641134 509
818530 750711 468
543136 456392 470
822144 40441 509
692285 379364 509
279858 446657 449
20322 174747 383
749825 288525 509
787949 527694 509
667658 823628 504
859888 153334 525
404845 232802 441
42010 516678 470
649850 865334 525
428882 397126 449
419361 769396 509
343501 838238 525
971711 814008 525
200397 985346 525
552310 509532 470
446209 718160 509
945799 863846 507
773790 6470 509
499811 610382 470
225978 873674 525
426694 898970 525
333982 775535 509
68541 954525 525
214351 220410 386
387895 186105 443
679233 433349 509
704289 749310 504
116595 910893 525
27391 866584 525
645494 144775 509
660128 651248 429
766090 312617 509
417315 261300 449
808110 884158 525
121455 449442 449
796060 236650 509
143065 567738 470
137612 646804 509
290374 845798 525
295749 95295 443
497629 326472 449
270681 688990 509
105425 252609 443
820545 630605 504
592078 88207 470
163854 981593 525
500085 240304 449
917135 420686 525
659053 752535 504
903619 894270 401
449072 93170 449
261962 695083 509
887066 530019 525
285016 81555 443
768491 649082 504
35568 811384 509
517475 660478 509
745847 712059 424
498275 159726 449
237388 764288 509
915528 333147 525
910692 371396 525
398012 733897 509
966954 368098 525
205792 725942 509
856354 318761 525
927390 642998 525
58849 175898 383
966879 425272 525
541663 811978 509
667414 461927 509
748392 808957 468
864593 878482 432
114034 469706 449
345953 787729 509
104734 689162 509
735565 418990 509
944930 137408 525
414261 926898 525
