736594 331064 509
678271 534360 509
276358 995812 525
210754 340846 443
88271 350104 443
946799 956742 414
119881 248152 443
114235 70382 354
841559 782317 525
885547 235289 525
421760 891949 525
79911 678575 509
177922 788840 509
171320 958023 525
246797 866687 525
960333 41112 525
806867 959714 525
419318 376402 449
89524 970275 525
852862 42417 525
319617 583134 470
448281 636482 509
999549 475330 525
80445 942698 525
241095 571450 470
913137 748707 525
696940 509477 509
582973 679487 509
879778 25910 525
124654 539374 470
411457 455943 418
93327 121918 354
651171 115247 509
714073 406564 509
59377 533933 470
147112 943924 525
793154 935592 525
599371 374805 470
97008 273642 443
365657 403365 436
612514 641483 509
6908 418281 449
63822 760456 509
411610 683049 509
209952 622656 470
801083 966228 525
651976 688700 442
131858 512072 470
35975 275975 443
513993 351516 470
176164 636 383
768752 549233 509
761366 584248 509
977171 508635 525
93647 798629 509
576961 317312 470
416558 586127 470
807763 216759 509
193559 500235 449
511085 764664 509
817541 683978 504
605057 111045 470
611181 496628 470
574543 926504 525
898184 420133 525
182001 938902 525
783250 204060 509
12686 657106 509
40496 75853 340
391900 860755 525
487987 50091 449
672364 321887 509
689885 317948 509
477686 662248 509
311049 242286 407
562751 915133 525
765963 733537 424
344102 363815 441
832022 287456 509
909009 114309 525
917596 940855 507
322745 109602 443
516013 705942 509
67378 241036 443
912477 669063 525
969381 641238 525
139544 931417 525
878337 140197 525
576268 532813 452
669118 741046 504
422351 491178 444
713251 717221 380
206208 332195 443
3363 2090 217
204645 271661 443
57338 567555 470
63372 264533 443
6609 736670 509
893134 279237 525
922411 883777 476
847512 410135 525
326225 331353 353
224353 392629 443
263326 658667 509
318262 773339 509
167160 311771 443
520075 958918 525
405364 613120 470
904954 823646 525
402476 846076 525
311188 503546 449
409676 693395 509
866384 723542 525
668600 835007 504
201510 894153 525
921175 790032 525
61001 771222 509
49367 826082 509
336563 123103 443
593431 236543 470
799248 977660 525
297098 243728 407
234090 660684 509
175188 952750 525
360563 530260 470
836750 516013 509
139815 487480 449
746927 644690 504
994201 11381 525
537962 698598 509
547794 376355 470
271070 201189 443
434865 288562 449
33447 811719 509
610333 670482 509
517179 380841 470
855719 273728 525
576354 227417 470
67270 521681 470
3312 897524 525
389413 972313 525
76447 477214 449
947687 196588 525
448723 919794 525
515158 142321 470
225649 578673 470
996917 344930 525
720774 804392 468
132090 421106 449
956833 580367 525
862382 209901 525
619211 456482 470
864744 865024 326
294144 222572 443
808204 994053 525
448227 936067 525
637985 868303 525
395372 781501 509
825256 171052 509
694867 415037 509
915169 277673 525
978602 353046 525
60606 69370 335
403735 117170 443
407614 531854 470
365275 740124 509
656850 670559 442
428773 630430 509
831086 218914 509
408632 215320 443
12619 537312 470
612496 239097 470
598966 45777 470
910174 710851 525
92897 939204 525
784708 595 509
699097 778461 504
444138 962554 525
175624 732191 509
671500 961821 525
499082 341724 449
505594 12748 449
136867 116440 344
965049 129673 525
189985 470616 449
202357 127917 383
503286 153926 449
297183 97068 443
486768 71121 449
359217 552086 470
181204 227745 386
10869 100705 351
439330 646261 509
307300 578478 470
869769 808932 525
648936 324444 509
476706 128887 449
813621 530862 509
855866 983023 507
521929 51029 470
644832 340302 509
175669 152519 383
217346 510862 449
831659 352667 509
292676 917325 525
722862 47491 509
683431 371207 509
296761 515372 470
666013 569175 509
331270 68645 443
535139 74319 470
923875 314063 525
467323 900912 525
664642 477183 509
159613 950145 525
525737 29450 470
779997 592263 509
317997 263032 407
571170 912750 525
198196 942769 525
364686 409631 436
549700 62213 470
138474 570183 470
953694 72287 525
424965 615970 470
706087 678325 504
464545 171800 449
475612 147042 449
556950 56625 470
375246 743460 509
413916 515752 470
953714 609080 525
481041 828037 509
194633 756805 509
137249 119790 344
263489 863621 525
53823 598919 470
678244 612042 509
85764 659011 509
661740 109567 509
555397 871679 525
163997 916949 525
870534 43313 525
224320 73943 386
537138 714880 509
232662 967292 525
433971 239008 449
723386 822410 468
375990 809647 509
97342 621538 470
236634 468469 449
12490 702272 509
696345 667580 442
812890 167833 509
344745 382953 441
986607 777802 525
842081 624227 525
729462 152348 509
43196 565545 470
354282 738968 509
400493 839087 525
797431 10375 509
355498 209406 443
124873 659319 509
10221 625811 470
840121 502045 525
820626 616446 509
246346 733042 509
339903 540226 470
117374 204871 383
542598 554813 452
759146 836043 468
670768 250504 509
38063 958959 525
185953 766643 509
120647 771180 509
687003 62856 509
685382 538810 509
796585 696601 504
551944 636964 509
484102 389946 449
485630 745 449
828136 271798 509
766649 802792 468
628610 525833 509
700069 832398 504
771929 206567 509
576700 334334 470
704244 143367 509
132430 99364 354
940608 417888 525
691290 715801 504
293888 626992 509
720319 859963 525
993915 998364 440
664678 101956 509
444707 873390 525
596701 140702 470
653427 816393 504
469874 19710 449
