<?xml version="1.0" encoding="utf-8"?>
<svg xmlns="http://www.w3.org/2000/svg" xmlns:xlink="http://www.w3.org/1999/xlink" version="1.1" class="page" pageAlignment="none" x="0px" y="0px" width="320px" height="240px" viewBox="0 0 320 240" enable-background="new 0 0 320 240" xml:space="preserve" xmlns:xml="http://www.w3.org/XML/1998/namespace">
<image xlink:href="" include-url="//www.youtube.com/embed/y6Sxv-sUYtM" editing-url="../img/allSvg/youtube_video.svg" name="immagine" width="320" height="240" include-mode="iframe"/>
</svg>