<svg width="235" height="29" viewBox="0 0 235 29" fill="none" xmlns="http://www.w3.org/2000/svg">
<path d="M3.37529 1.30156C2.39588 1.79127 1.57972 2.60745 1.25325 3.42363C1.09001 3.91333 0.926758 8.32069 0.926758 16.3192V28.3986H6.63999V20.7266H14.1488L16.1077 24.481L18.0665 28.2354H21.3312C23.1268 28.2354 24.5959 28.2354 24.5959 28.0722C24.5959 27.9089 23.6165 25.9501 22.3106 23.6648L20.0253 19.4207L20.6782 19.0942C23.9429 16.9722 25.4121 12.5648 24.5959 7.66774C24.1062 4.72951 22.637 2.60745 20.3517 1.62804C19.0459 1.13833 18.8826 0.975098 11.5371 0.975098C5.82382 0.975098 4.02823 0.975093 3.37529 1.30156ZM17.5768 6.85157C17.9032 7.0148 18.393 7.50451 18.5562 7.99421C19.0459 9.13686 19.0459 11.9119 18.7194 12.728C17.74 14.6869 16.4341 15.1766 10.8841 15.1766H6.80324V6.52509H11.8635C14.6385 6.52509 17.2503 6.68833 17.5768 6.85157ZM32.9209 1.13833C30.4724 1.95451 28.6768 3.58686 28.0238 6.03539C27.3709 7.99421 26.718 12.4016 26.718 14.6869C26.718 16.8089 27.3709 21.053 27.8606 22.8486C28.84 25.7869 30.3091 27.4192 33.0841 28.0722C34.39 28.3986 35.5327 28.3986 39.7768 28.3986C44.5106 28.3986 45.0003 28.2354 46.3062 27.7457C49.7341 26.2766 51.2033 22.1957 51.2033 14.6869C51.2033 6.68833 49.5709 2.77068 45.9797 1.4648C44.6738 0.975096 44.1841 0.975098 38.9606 0.975098C36.1856 0.975098 33.4106 1.13833 32.9209 1.13833ZM44.3474 7.17804C45.9797 9.46333 45.9797 20.5633 44.3474 22.1957C43.8577 22.6854 34.39 22.6854 34.0636 22.1957C32.9209 20.7266 32.4312 12.728 33.4106 8.97363C33.737 7.50451 33.9003 7.0148 34.39 6.85157C34.7165 6.68833 37.0018 6.68833 39.6135 6.68833C43.5312 6.68833 44.1841 6.68833 44.3474 7.17804ZM56.7533 1.4648C56.2635 1.79127 55.6106 2.44421 55.2841 2.93392C54.7944 3.75009 54.7944 4.2398 54.6312 14.0339C54.6312 20.8898 54.6312 24.6442 54.7944 25.2972C55.2841 26.7663 56.2636 27.9089 57.7327 28.2354C59.2018 28.5619 70.1385 28.5619 72.0974 28.2354C75.8518 27.5824 77.8106 25.4604 78.1371 21.3795C78.3003 19.0942 77.9738 17.4619 76.9944 15.8295L76.3415 14.6869L77.3209 12.8913C78.1371 11.2589 78.3003 11.0957 78.3003 8.64715C78.3003 6.68833 78.1371 5.87215 77.8106 4.89274C77.1577 3.42362 76.1782 2.44421 74.7091 1.62804L73.4032 0.975098H65.7312C57.7327 0.975098 57.7327 0.975096 56.7533 1.4648ZM71.9341 6.85157C72.2606 7.17804 72.4238 8.81038 72.2606 9.62656C72.0974 10.1163 71.7709 10.606 71.4444 11.0957C70.7915 11.7486 70.7915 11.7486 65.7312 11.7486H60.6709V6.52509H66.2209C69.1591 6.68833 71.7709 6.85157 71.9341 6.85157ZM70.7915 17.7883C71.7709 18.1148 72.2606 19.2575 72.2606 20.5633C72.2606 21.3795 72.0973 21.8692 71.7709 22.0325C71.4444 22.3589 69.9753 22.3589 65.8944 22.3589H60.3444V17.1354L65.2415 17.2986C68.0165 17.4619 70.465 17.6251 70.7915 17.7883ZM86.2988 1.4648C83.8503 2.44421 82.7076 4.07657 81.7282 7.66774C81.2385 9.46333 81.2385 10.4427 81.2385 14.6869C81.2385 19.0942 81.2385 19.5839 81.8915 21.8692C82.7076 24.6442 83.3606 25.7869 84.8297 26.9295C86.6253 28.2354 87.115 28.2354 93.3179 28.2354C99.5209 28.2354 100.174 28.0722 101.806 26.9295C103.275 25.9501 103.928 24.6442 104.744 21.8692C105.397 19.5839 105.397 19.0942 105.397 14.6869C105.397 10.606 105.397 9.62656 104.908 7.66774C103.928 3.91333 102.786 2.28098 100.337 1.4648C99.0312 0.975096 98.5415 0.975098 93.3179 0.975098C88.0944 0.975098 87.4415 0.975096 86.2988 1.4648ZM98.0518 6.85157C98.7047 7.17804 99.0312 7.83098 99.5209 10.606C100.174 14.0339 99.5209 20.4001 98.5415 21.8692C98.215 22.5221 98.215 22.5222 93.3179 22.5222C87.6047 22.5222 87.9312 22.6854 87.2782 19.4207C86.2988 14.8501 87.115 7.34127 88.4209 6.85157C89.2371 6.52509 97.3988 6.52509 98.0518 6.85157Z" fill="#C4C4C4"/>
<path d="M110.132 1.628L109.315 2.44418V26.7662L109.968 27.4192C110.621 28.0721 110.948 28.0721 112.09 28.0721C113.233 28.0721 113.56 27.9089 114.049 27.5824C114.865 26.603 115.029 25.6236 115.029 21.3795V17.2986H118.62L120.415 18.9309C124.007 22.0324 125.313 23.6648 125.313 25.4604C125.313 26.4398 125.476 26.7662 126.129 27.4192C126.945 28.2354 127.108 28.2354 128.251 28.2354C129.23 28.2354 129.557 28.0721 130.21 27.5824C131.026 26.9295 131.026 26.7662 131.026 24.9706C131.026 23.5015 130.863 22.8486 130.21 21.5427C129.393 19.7471 126.782 16.8089 125.313 15.503L124.333 14.6868L125.965 13.2177C127.924 11.4221 129.72 9.13682 130.536 7.34124C131.026 6.36182 131.189 5.54565 131.189 4.23977C131.189 2.44418 131.189 2.44418 130.373 1.628C129.72 0.975059 129.393 0.975062 128.087 0.975062C126.618 0.975062 126.455 0.975059 125.965 1.628C125.639 2.11771 125.476 2.60742 125.476 3.42359C125.476 4.07653 125.313 4.89271 125.149 5.21918C124.66 6.19859 122.864 8.32065 120.579 10.2795L118.783 11.7486H115.192V7.66771C115.192 5.54565 115.029 3.26035 114.865 2.77065C114.539 1.46477 113.56 0.811823 112.09 0.811823C110.948 0.975059 110.785 0.975059 110.132 1.628ZM141.31 1.30153C138.045 2.28094 136.249 4.72947 134.943 9.46329C134.29 11.5854 134.29 12.4015 134.127 18.6045C133.964 25.9501 134.127 26.7662 135.27 27.5824C136.086 28.2353 138.208 28.2353 138.861 27.5824C139.677 26.9295 140.004 26.1133 140.004 23.6648V21.2162H152.736V23.9912C152.736 26.603 152.736 26.7662 153.389 27.4192C154.042 28.0721 154.368 28.0721 155.511 28.0721C156.817 28.0721 156.98 28.0721 157.633 27.2559L158.286 26.4398V18.6045C158.123 11.2589 158.123 10.6059 157.633 8.97359C156.49 5.05595 154.695 2.60741 152.41 1.628C151.104 0.975059 150.777 0.975062 146.696 0.975062C143.595 0.975062 141.962 0.975057 141.31 1.30153ZM149.798 6.85153C151.104 7.34124 152.246 10.2795 152.573 14.0339L152.736 15.6662H140.004L140.167 13.7074C140.493 10.2795 141.799 7.01477 143.105 6.6883C144.248 6.52506 148.982 6.6883 149.798 6.85153ZM166.121 1.30153C163.673 2.1177 162.367 3.26035 161.551 5.38241C161.061 6.52506 161.061 7.178 161.061 9.13683C161.061 13.0545 162.204 15.3398 164.979 16.6456C166.121 17.1354 166.448 17.2986 171.345 17.2986C176.405 17.4618 176.568 17.4618 177.058 17.9515C177.711 18.6045 177.874 20.7265 177.221 21.7059L176.732 22.3589H170.202C163.999 22.3589 163.51 22.3589 163.02 22.8486C161.714 23.9912 161.551 26.2765 162.857 27.4192L163.673 28.0721H170.855C174.773 28.0721 178.364 27.9089 178.854 27.7457C180.16 27.4192 181.629 25.9501 182.608 24.1545C183.424 22.6854 183.424 22.3589 183.424 19.7471C183.424 17.2986 183.424 16.9721 182.771 15.6662C181.955 13.8707 180.812 12.728 179.67 12.0751C178.854 11.7486 178.037 11.5854 173.14 11.4221C166.611 11.2589 166.774 11.4221 166.774 8.81035C166.774 6.19858 166.448 6.36182 174.283 6.19859L180.976 6.03535L181.629 5.38241C182.282 4.72947 182.282 4.56624 182.445 2.60742L182.608 0.485352H174.936C169.386 0.975057 166.774 1.13829 166.121 1.30153ZM190.443 1.30153C189.954 1.46476 189.137 1.79124 188.648 1.95447C185.546 3.58682 184.077 9.30006 186.036 13.2177C186.852 14.8501 187.668 15.8295 189.138 16.6456C190.28 17.2986 190.443 17.2986 195.34 17.4618C198.115 17.4618 200.564 17.6251 200.89 17.7883C201.707 18.1148 202.196 19.4206 201.87 20.8898C201.543 22.6854 201.87 22.6853 194.361 22.6853H187.668L187.015 23.3383C186.362 23.9912 186.363 24.3177 186.363 25.4604C186.363 26.603 186.526 26.9295 187.015 27.5824L187.668 28.2354H195.014C203.339 28.2354 203.502 28.2354 205.135 26.603C206.604 25.1339 207.257 23.5015 207.42 20.5633C207.583 17.2986 206.93 15.3398 205.135 13.5442C204.318 12.728 203.502 12.2383 202.849 12.0751C202.36 11.9118 199.911 11.7486 197.299 11.7486C194.688 11.7486 192.402 11.7486 191.912 11.5854C191.096 11.4221 190.607 10.6059 190.607 9.13683C190.607 7.66771 190.933 6.85153 191.912 6.6883C192.402 6.6883 195.34 6.52506 198.605 6.52506C206.277 6.52506 206.44 6.36182 206.44 2.77065V0.975062H198.768C193.708 0.975062 191.096 1.13829 190.443 1.30153ZM217.377 1.46477C216.724 1.79124 215.745 2.28094 215.255 2.60742C213.296 4.07653 211.501 7.99417 211.011 12.0751C210.685 14.8501 210.685 25.7868 211.011 26.7662C211.338 27.7456 212.317 28.2354 213.786 28.2354C214.602 28.2354 215.092 28.0721 215.745 27.5824L216.561 26.9295V24.1545L216.724 21.3795H229.13L229.293 24.1545V26.9295L230.11 27.5824C230.762 28.2353 231.089 28.2354 232.068 28.2354C233.048 28.2354 233.374 28.0721 234.027 27.5824L234.843 26.9295V19.2574C234.843 12.2383 234.843 11.4221 234.354 9.62653C233.211 5.54564 231.579 3.09712 229.293 1.95447C227.824 1.30153 227.824 1.30153 223.254 1.1383C219.173 0.97506 218.52 0.975061 217.377 1.46477ZM227.171 7.50447C228.151 8.64712 228.967 11.0956 228.967 13.5442L229.13 15.503H216.561V14.0339C216.561 10.9324 217.867 7.34124 219.336 6.6883C219.663 6.52506 221.295 6.52506 223.254 6.52506H226.518L227.171 7.50447Z" fill="#C4C4C4"/>
</svg>
