<svg width="31" height="29" viewBox="0 0 31 29" fill="none" xmlns="http://www.w3.org/2000/svg">
<path fill-rule="evenodd" clip-rule="evenodd" d="M6.88889 13.8556V15.95H13.95V29H0.00034365L0 13.8556C0 8.86582 1.54402 4.73486 4.58875 2.41665C6.69498 0.813059 9.24804 0 12.4 0V6.86842C10.689 6.86842 6.88889 7.50912 6.88889 13.8556ZM23.9389 13.8556V15.95H31V29H17.05V13.8556C17.05 8.86582 18.4218 4.73486 21.4665 2.41665C23.5728 0.813059 26.298 0 29.45 0V6.86842C27.739 6.86842 23.9389 7.50912 23.9389 13.8556Z" fill="#1E6EEB"/>
</svg>
