%YAML 1.1
%TAG !u! tag:unity3d.com,2011:
--- !u!1045 &1
EditorBuildSettings:
  m_ObjectHideFlags: 0
  serializedVersion: 2
  m_Scenes:
  - enabled: 1
    path: Assets/OwnAssets/Scenes/MAINSCENE.unity
    guid: 4f0ef85d2f52eef4282e7a1a994d80a1
  m_configObjects: {}
