0	-0.0	0.0	0.0	0.0	0.0	0.0	-0.0	3.4767296	3.4767296
1	8.769498	100.18112	0.0	0.0	0.0	0.0	-91.41163	2.3068474e-15	3.2813647
2	-40.24959	52.14411	0.0	0.0	0.0	0.0	-92.3937	2.203958	3.4423022
3	-67.83668	25.384705	0.0	0.0	0.0	0.0	-93.22138	3.1461556	3.4216647
4	-74.19077	19.605846	0.0	0.0	0.0	0.0	-93.796616	3.2647846	3.4767296
5	-78.435844	15.887264	905.59	0.0	0.0	0.0	-94.323105	3.4767296	1.4962963
6	-51.7153	43.257385	0.0	0.0	0.0	0.0	-94.97269	2.6453557	3.46779
7	-57.907322	38.11998	0.0	0.0	0.0	281.47	-96.0273	1.4962963	3.4767296
8	-92.217705	4.370902	0.0	0.0	0.0	0.0	-96.58861	3.4218318	3.4767296
9	-98.84429	-2.291663	0.0	0.0	0.0	0.0	-96.55263	3.4767296	3.4473445
10	-95.46095	1.1099162	0.0	0.0	0.0	0.0	-96.57087	3.4623287	3.4767296
11	-95.69041	0.95532477	0.0	0.0	0.0	0.0	-96.64573	3.4643152	3.4767296
12	-94.80615	1.910669	0.0	0.0	0.0	0.0	-96.71683	3.4521368	3.4767296
13	-96.54209	0.22746615	0.0	0.0	0.0	0.0	-96.769554	3.473752	3.4767296
14	-96.60307	0.15146582	0.0	0.0	0.0	0.0	-96.75454	3.4747453	3.4767296
15	-98.94406	-2.2380483	0.0	0.0	0.0	0.0	-96.70602	3.4767296	3.448017
16	-98.49172	-1.9094583	0.0	0.0	0.0	0.0	-96.58226	3.4767296	3.452152
17	-98.38333	-1.9244664	0.0	0.0	0.0	0.0	-96.45886	3.4767296	3.4519625
18	-97.952065	-1.6560949	0.0	0.0	0.0	0.0	-96.29597	3.4767296	3.455359
19	-96.78885	-0.6062436	0.0	0.0	0.0	0.0	-96.18261	3.4767296	3.468824
20	-96.754616	-0.6645056	0.0	0.0	0.0	0.0	-96.09011	3.4767296	3.4680693
21	-96.43388	-0.44866017	0.0	0.0	0.0	0.0	-95.98522	3.4767296	3.4708695
22	-95.580475	0.35136822	0.0	0.0	0.0	0.0	-95.93184	3.472136	3.4767296
23	-95.72355	0.22454491	0.0	0.0	0.0	0.0	-95.94809	3.4737902	3.4767296
24	-95.55404	0.4588262	0.0	0.0	0.0	0.0	-96.01287	3.4707375	3.4767296
25	-97.0055	-0.9945105	0.0	489.98	608.3	0.0	-96.01099	3.123164	3.123164
26	-93.977196	2.0050876	1300.07	1777.28	1820.67	0.0	-95.982285	3.123164	-0.054395605
27	-74.29293	21.460953	1675.35	1835.67	0.0	0.0	-95.75388	3.4767296	-1.0050148
28	-35.33987	60.569805	1826.4	1564.0	0.0	0.0	-95.909676	3.4767296	-1.0050148
29	24.955706	122.15098	0.0	0.0	0.0	0.0	-97.19527	5.788487e-15	3.1974275
30	-10.04763	89.20471	0.0	0.0	0.0	0.0	-99.25234	1.2030109e-15	3.32113
31	-73.3151	28.121836	1284.0	0.0	0.0	0.0	-101.436935	3.4767296	1.4962963
32	-54.685375	48.85273	0.0	0.0	0.0	0.0	-103.5381	2.4174037	3.451924
33	-64.99906	42.436	0.0	0.0	0.0	0.0	-107.43506	2.6711884	3.470065
34	-79.057816	31.838531	0.0	0.0	0.0	6.34	-110.89635	1.4962963	3.4767296
35	-113.65114	-1.1768441	0.0	0.0	0.0	0.0	-112.4743	3.4767296	3.4614706
36	-119.08982	-7.3532815	0.0	0.0	0.0	0.0	-111.73654	3.4767296	3.387064
37	-118.7521	-8.188184	0.0	0.0	0.0	0.0	-110.56391	3.4767296	3.3777037
38	-115.330795	-6.2696652	0.0	0.0	0.0	0.0	-109.061134	3.4767296	3.3994532
39	-113.556145	-5.999269	0.0	0.0	0.0	0.0	-107.55688	3.4767296	3.4025874
40	-112.06262	-5.891384	0.0	946.8	1412.4	1444.36	-106.171234	-0.054395605	3.123164
