0	-0.0	0.0	695.08	886.27	23.52	0.0	-0.0	3.123164	0.96045977
1	30.321396	62.392075	1742.79	1553.42	0.0	0.0	-32.07068	3.4767296	-1.0050148
2	95.802284	128.36201	0.0	0.0	0.0	0.0	-32.559727	7.304201e-15	3.1727536
3	59.811024	93.01336	1137.28	304.04	0.0	0.0	-33.20233	3.4767296	5.292004e-16
4	100.084885	133.97713	0.0	0.0	0.0	0.0	-33.892235	9.034582e-15	3.1501193
5	64.0988	98.57065	460.24	0.0	0.0	0.0	-34.471855	3.4767296	1.4962963
6	85.096756	120.5586	0.0	0.0	0.0	0.0	-35.46185	5.454091e-15	3.20369
7	46.060417	82.21296	598.28	72.79	0.0	0.0	-36.152542	3.4767296	5.292004e-16
8	87.53558	124.39079	0.0	0.0	0.0	0.0	-36.85521	6.292631e-15	3.1885746
9	52.650642	90.071144	343.89	0.0	0.0	0.0	-37.420498	3.4767296	1.4962963
10	76.46525	114.930916	0.0	0.0	0.0	0.0	-38.46566	4.386768e-15	3.2256074
11	35.21427	74.45383	687.26	437.92	0.0	0.0	-39.23956	3.4767296	5.292004e-16
12	72.40319	112.43321	286.0	0.0	0.0	0.0	-40.030025	3.4767296	1.4962963
13	111.39059	152.13939	0.0	0.0	0.0	0.0	-40.7488	1.919463e-14	3.0749342
14	70.29977	111.49468	0.0	0.0	0.0	0.0	-41.19491	3.827599e-15	3.2388208
15	11.082291	52.962498	177.63	0.0	0.0	0.0	-41.880207	3.4767296	1.4962963
16	31.987156	74.75888	0.0	0.0	0.0	0.0	-42.77172	1.0424528e-16	3.370947
17	-11.424352	32.096424	0.0	0.0	0.0	0.0	-43.52078	2.9819326	3.3936284
18	-27.766031	16.217796	0.0	0.0	0.0	0.0	-43.98383	3.2954907	3.4767296
19	-29.662344	14.711777	0.0	0.0	0.0	0.0	-44.37412	3.3098738	3.4767296
20	-35.470825	9.259032	0.0	0.0	0.0	0.0	-44.72986	3.3659306	3.4767296
21	-37.852737	7.1154165	0.0	0.0	0.0	0.0	-44.968155	3.38976	3.4767296
22	-38.255337	6.9445662	0.0	0.0	0.0	0.0	-45.1999	3.3917046	3.4767296
23	-39.80545	5.581896	0.0	0.0	0.0	0.0	-45.38735	3.4074597	3.4767296
24	-37.766563	7.840438	0.0	0.0	0.0	0.0	-45.607002	3.381583	3.4767296
25	-44.45116	1.2758636	0.0	0.0	0.0	0.0	-45.727024	3.460203	3.4767296
26	-45.04802	0.69142866	0.0	0.0	0.0	0.0	-45.73945	3.4677207	3.4767296
27	-46.307106	-0.61195856	0.0	0.0	0.0	0.0	-45.695145	3.4767296	3.46875
28	-45.14261	0.49250466	1292.05	1225.78	0.0	0.0	-45.635113	3.4767296	-1.0050148
29	11.007489	56.900723	905.0	0.0	0.0	0.0	-45.893234	3.4767296	1.4962963
30	51.204002	98.51032	0.0	0.0	0.0	0.0	-47.306324	2.1225276e-15	3.287517
31	6.0734386	54.328094	0.0	0.0	0.0	0.0	-48.254654	1.9878937	3.4358037
32	-24.965849	24.328766	637.14	197.91	0.0	0.0	-49.294617	3.4767296	5.292004e-16
33	24.849277	74.910286	0.0	0.0	0.0	0.0	-50.06101	1.04359535e-16	3.3704407
34	-17.391272	33.586857	491.51	0.0	0.0	0.0	-50.97813	3.4767296	1.4962963
35	2.1801949	54.06756	254.48	0.0	0.0	0.0	-51.887363	3.4767296	1.4962963
36	32.48652	85.89633	0.0	0.0	0.0	0.0	-53.409817	9.296058e-16	3.332802
37	-13.277131	41.297527	0.0	0.0	0.0	0.0	-54.57466	2.7048395	3.4731953
38	-33.40725	22.15914	957.96	730.41	0.0	0.0	-55.56639	3.4767296	5.292004e-16
39	19.950455	76.36979	0.0	0.0	0.0	0.0	-56.419334	2.1669849e-16	3.3655436
40	-12.499988	45.19311	763.78	81.67	0.0	0.0	-57.6931	3.4767296	5.292004e-16
41	24.085945	82.61842	0.0	0.0	0.0	0.0	-58.53248	6.621561e-16	3.344216
42	-18.359306	41.449383	545.89	0.0	0.0	0.0	-59.80869	3.4767296	1.4962963
43	-1.5020299	59.39293	507.99	0.0	0.0	0.0	-60.89496	3.4767296	1.4962963
44	33.340084	96.05685	0.0	0.0	0.0	0.0	-62.716766	1.8535395e-15	3.2964883
45	-10.647215	53.444653	0.0	0.0	0.0	0.0	-64.091866	2.0859714	3.4384432
46	-35.89132	29.406258	897.0	714.43	0.0	0.0	-65.29758	3.4767296	5.292004e-16
47	13.003334	79.386986	154.66	0.0	0.0	0.0	-66.38365	3.4767296	1.4962963
48	52.230873	120.25902	0.0	0.0	0.0	0.0	-68.028145	5.3909336e-15	3.2048652
49	11.01844	80.324745	0.0	0.0	0.0	0.0	-69.306305	4.913096e-16	3.3521116
50	-45.05714	25.20115	0.0	0.0	0.0	0.0	-70.25829	3.1502943	3.4236543
51	-54.7082	16.28146	1496.13	1563.41	0.0	0.0	-70.98966	3.4767296	-1.0050148
52	-5.708826	65.69638	0.0	0.0	0.0	0.0	-71.405205	-4.2863136e-16	3.4005837
53	-42.962418	29.825874	508.9	0.0	0.0	0.0	-72.78829	3.4767296	1.4962963
54	-27.457567	46.5467	0.0	0.0	0.0	0.0	-74.004265	2.5249767	3.4585392
55	-36.27605	39.463165	0.0	0.0	0.0	0.0	-75.73921	2.7594151	3.4715633
56	-49.958157	27.425867	0.0	0.0	0.0	0.0	-77.38402	3.098991	3.399048
57	-55.398365	23.208794	0.0	0.0	0.0	0.0	-78.60716	3.1942077	3.4447575
58	-64.01972	15.601027	0.0	0.0	0.0	0.0	-79.62075	3.3013256	3.4767296
59	-67.39003	13.158267	0.0	0.0	0.0	0.0	-80.548294	3.3251991	3.4767296
60	-69.924545	11.416448	0.0	0.0	0.0	0.0	-81.340996	3.3429868	3.4767296
61	-72.83567	9.137733	0.0	342.25	0.0	0.0	-81.973404	3.4767296	3.567748e-16
62	-21.169907	61.92387	1310.69	0.0	0.0	0.0	-83.09377	3.4767296	1.4962963
63	-5.2040195	80.187164	0.0	0.0	0.0	0.0	-85.39119	4.741668e-16	3.3525827
64	-50.46739	37.093056	0.0	0.0	0.0	0.0	-87.56044	2.8376832	3.4478738
65	-67.698875	21.65423	0.0	0.0	0.0	0.0	-89.3531	3.2272625	3.4605703
66	-71.796684	19.309824	0.0	0.0	0.0	0.0	-91.10651	3.2673783	3.4767296
67	-74.40244	18.442362	0.0	0.0	0.0	0.0	-92.84481	3.2750762	3.4767296
68	-77.18935	17.541922	0.0	0.0	0.0	0.0	-94.73127	3.2832217	3.4767296
69	-80.091545	16.639662	0.0	0.0	0.0	0.0	-96.7312	3.291544	3.4767296
70	-82.75405	16.000786	0.0	0.0	0.0	0.0	-98.75484	3.297535	3.4767296
71	-85.11068	16.072866	0.0	0.0	0.0	0.0	-101.18355	3.296855	3.4767296
72	-87.65707	16.43084	0.0	0.0	0.0	0.0	-104.08791	3.293493	3.4767296
73	-90.60166	16.76579	0.0	0.0	0.0	0.0	-107.367455	3.2903707	3.4767296
74	-91.90362	19.896284	0.0	550.95	666.44	0.0	-111.799904	3.123164	3.123164
