0	-0.0	0.0	0.0	0.0	0.0	0.0	-0.0	3.4767296	3.4767296
1	10.434672	42.660484	0.0	0.0	0.0	0.0	-32.22581	2.6642656	3.4694448
2	-0.8646323	32.720284	0.0	0.0	0.0	0.0	-33.584915	2.9651544	3.4006968
3	-7.2937446	27.362879	0.0	0.0	0.0	0.0	-34.656624	3.1004791	3.3997593
4	-13.819563	21.751549	0.0	0.0	0.0	0.0	-35.571114	3.2252226	3.4595978
5	-17.280352	19.18062	0.0	0.0	0.0	0.0	-36.46097	3.2685156	3.4767296
6	-21.253147	16.00843	0.0	0.0	0.0	0.0	-37.261578	3.2974627	3.4767296
7	-24.795046	13.118069	0.0	0.0	0.0	0.0	-37.913113	3.3256023	3.4767296
8	-28.244352	10.227521	0.0	0.0	0.0	0.0	-38.471874	3.355504	3.4767296
9	-31.208677	7.6975646	0.0	62.73	1289.16	1278.07	-38.906242	-0.054395605	3.123164
10	-79.91923	-41.21943	0.0	0.0	617.15	1423.09	-38.699802	5.292004e-16	3.4767296
11	-143.90025	-106.67401	0.0	0.0	0.0	0.0	-37.226242	3.2571325	3.117099e-15
12	-107.301125	-71.742256	0.0	0.0	0.0	0.0	-35.558872	3.3809578	-8.537998e-17
13	-45.95996	-11.416759	0.0	0.0	868.99	931.9	-34.5432	5.292004e-16	3.4767296
14	-87.3095	-53.437843	0.0	0.0	0.0	771.58	-33.87166	1.4962963	3.4767296
15	-121.97274	-90.174934	0.0	0.0	0.0	0.0	-31.797806	3.3176787	1.2916118e-15
16	-75.655266	-45.511135	0.0	0.0	0.0	655.13	-30.14413	1.4962963	3.4767296
17	-98.260445	-69.99615	0.0	0.0	0.0	0.0	-28.264297	3.3866868	-2.0095718e-16
18	-58.37013	-31.797993	0.0	0.0	780.65	1008.78	-26.572134	5.292004e-16	3.4767296
19	-100.66967	-75.41161	0.0	0.0	0.0	0.0	-25.258055	3.3687623	1.5817931e-16
20	-66.99773	-43.30073	0.0	0.0	946.47	1324.26	-23.696997	-0.38234603	3.4767296
21	-112.7578	-90.20264	0.0	0.0	0.0	0.0	-22.555162	3.31758	1.2959437e-15
22	-80.59322	-59.706062	0.0	0.0	0.0	0.0	-20.88716	3.4194264	0.2828255
23	-28.524605	-8.722573	0.0	0.0	0.0	1177.84	-19.802032	1.4962963	3.4767296
24	-48.34016	-29.187485	0.0	0.0	0.0	0.0	-19.152678	3.3788338	3.0564616
25	-50.765118	-33.99954	0.0	0.0	0.0	0.0	-16.765581	3.414936	2.9297519
26	-45.13617	-30.344942	0.0	0.0	0.0	0.0	-14.791225	3.3733652	3.0274937
27	-38.44104	-25.838175	488.95	182.79	0.0	0.0	-12.602863	3.4767296	5.292004e-16
28	9.990502	21.9314	0.0	0.0	0.0	0.0	-11.940898	3.221443	3.4577944
29	22.786093	37.481483	0.0	0.0	0.0	0.0	-14.69539	2.825372	3.4518516
30	12.609105	29.931509	0.0	0.0	0.0	0.0	-17.322405	3.0379395	3.370112
31	5.8007507	25.57668	0.0	0.0	0.0	0.0	-19.775928	3.1418097	3.419576
32	0.4305638	22.646885	0.0	0.0	0.0	0.0	-22.216322	3.2062733	3.450541
33	-3.8735723	21.315077	0.0	0.0	0.0	0.0	-25.18865	3.234341	3.4639406
34	-7.6017084	20.539015	0.0	0.0	0.0	0.0	-28.140724	3.2503657	3.4715421
35	-10.613049	20.83665	0.0	0.0	0.0	0.0	-31.4497	3.244248	3.468645
36	-14.365981	21.355083	0.0	0.0	0.0	0.0	-35.721066	3.2335086	3.4635446
37	-17.934008	22.72878	0.0	750.08	0.0	0.0	-40.66279	3.4767296	3.567748e-16
