0	-0.0	0.0	0.0	0.0	0.0	0.0	-0.0	3.4767296	3.4767296
1	10.1034775	42.44663	0.0	0.0	0.0	0.0	-32.34315	2.670863	3.4700358
2	-2.5910785	30.985062	0.0	0.0	0.0	0.0	-33.57614	3.0110943	3.380841
3	-10.774521	23.819754	0.0	0.0	0.0	0.0	-34.594273	3.180933	3.4383836
4	-14.530877	20.853945	0.0	0.0	0.0	0.0	-35.384823	3.2438915	3.468476
5	-18.919287	17.30881	0.0	0.0	0.0	0.0	-36.228096	3.2853565	3.4767296
6	-27.117138	9.651082	0.0	0.0	0.0	0.0	-36.76822	3.3616846	3.4767296
7	-26.92614	10.348579	0.0	0.0	0.0	0.0	-37.27472	3.3542154	3.4767296
8	-29.49081	8.16597	0.0	0.0	0.0	0.0	-37.65678	3.3779507	3.4767296
9	-31.649511	6.349465	0.0	0.0	906.43	886.72	-37.998978	-0.04234476	2.4568648
10	-74.8733	-37.09478	0.0	0.0	488.92	1210.21	-37.77852	5.292004e-16	3.4767296
11	-138.62509	-102.26944	0.0	0.0	0.0	0.0	-36.35565	3.2736263	2.5541823e-15
12	-102.75419	-67.8899	0.0	0.0	0.0	0.0	-34.864292	3.393532	-3.0971487e-16
13	-43.544003	-9.762328	0.0	0.0	826.92	861.41	-33.781673	5.292004e-16	3.4767296
14	-88.064575	-54.904068	0.0	0.0	0.0	750.11	-33.160507	1.4962963	3.4767296
15	-125.18197	-94.45804	0.0	0.0	0.0	0.0	-30.72393	3.3022928	1.6960171e-15
16	-78.49996	-49.629772	0.0	0.0	0.0	352.93	-28.870186	1.4962963	3.4767296
17	-107.48999	-80.673996	0.0	0.0	0.0	0.0	-26.81599	3.3509142	5.1489005e-16
18	-61.60907	-36.430466	0.0	0.0	300.53	613.66	-25.178604	5.292004e-16	3.4767296
19	-97.02934	-72.91903	0.0	0.0	0.0	0.0	-24.11031	3.3770695	-9.098606e-18
20	-61.33471	-38.698578	0.0	0.0	0.0	884.96	-22.636133	1.4962963	3.4767296
21	-81.38653	-60.503258	0.0	0.0	0.0	0.0	-20.88327	3.4169548	-7.1827626e-16
22	-33.767494	-14.358722	0.0	0.0	0.0	366.06	-19.408773	1.4962963	3.4767296
23	-58.455257	-39.989616	0.0	0.0	0.0	0.0	-18.465641	3.4766304	2.7409072
24	-51.831074	-35.777145	0.0	0.0	0.0	0.0	-16.05393	3.4341304	2.8780735
25	-43.072605	-28.9887	1020.93	851.24	0.0	0.0	-14.083903	3.4767296	5.292004e-16
26	6.8370047	20.47005	327.49	0.0	0.0	0.0	-13.633046	3.4767296	1.4962963
27	42.598255	58.331036	0.0	0.0	0.0	0.0	-15.732782	1.1037936	3.4236634
28	17.211458	35.808205	0.0	0.0	0.0	0.0	-18.596745	2.8771422	3.4344594
29	3.1329055	23.716671	0.0	0.0	0.0	0.0	-20.583765	3.1831844	3.439465
30	-3.168312	19.503407	0.0	0.0	0.0	0.0	-22.671719	3.26568	3.4767296
31	-6.9070563	17.679163	0.0	0.0	0.0	0.0	-24.58622	3.28197	3.4767296
32	-10.708069	16.168926	0.0	0.0	0.0	0.0	-26.876995	3.2959502	3.4767296
33	-14.351806	14.577504	0.0	0.0	0.0	0.0	-28.92931	3.3111787	3.4767296
34	-17.746607	13.507876	0.0	0.0	0.0	0.0	-31.254484	3.3217063	3.4767296
35	-20.145424	13.443215	0.0	0.0	0.0	0.0	-33.58864	3.3223505	3.4767296
36	-22.482964	13.844366	0.0	0.0	0.0	0.0	-36.32733	3.318369	3.4767296
37	-19.172565	21.328125	335.0	1481.87	0.0	0.0	-40.50069	3.4767296	-1.0050148
