0	-0.0	0.0	0.0	932.13	222.94	0.0	-0.0	3.123164	3.123164
1	1.3883718	33.431393	1732.43	1836.07	1241.26	0.0	-32.043022	3.123164	-0.054395605
2	18.54373	50.78888	1830.09	1760.47	0.0	0.0	-32.24515	3.4767296	-1.0050148
3	59.779522	92.22211	1561.24	636.81	0.0	0.0	-32.44259	3.4767296	5.292004e-16
4	120.985916	154.05402	0.0	0.0	0.0	0.0	-33.068104	2.1049719e-14	3.0668435
5	83.82619	117.32952	0.0	0.0	0.0	0.0	-33.50333	4.8170975e-15	3.2163074
6	30.101402	64.3236	886.37	720.65	0.0	0.0	-34.222195	3.4767296	5.292004e-16
7	74.88189	109.874306	367.85	0.0	0.0	0.0	-34.992416	3.4767296	1.4962963
8	111.27644	147.09503	0.0	0.0	0.0	0.0	-35.818592	1.5266258e-14	3.0961046
9	66.32731	102.67705	0.0	0.0	0.0	0.0	-36.349735	2.6061186e-15	3.2721097
10	7.0572	44.057602	386.27	530.16	0.0	0.0	-37.0004	3.4767296	5.292004e-16
11	49.507015	87.13816	1016.74	180.08	0.0	0.0	-37.631145	3.4767296	5.292004e-16
12	113.14221	151.42758	0.0	0.0	0.0	0.0	-38.285374	1.8549583e-14	3.0779345
13	75.92142	114.616165	0.0	0.0	0.0	0.0	-38.694748	4.3308845e-15	3.226823
14	17.459913	56.79801	637.56	645.57	0.0	0.0	-39.3381	3.4767296	5.292004e-16
15	54.796368	94.79332	964.42	0.0	0.0	0.0	-39.996952	3.4767296	1.4962963
16	95.072075	135.96678	0.0	0.0	0.0	0.0	-40.89471	9.743446e-15	3.1420271
17	50.148285	91.69801	0.0	0.0	0.0	0.0	-41.549732	1.4375618e-15	3.3122354
18	-7.9859257	34.20376	1015.45	0.0	0.0	0.0	-42.189686	3.4767296	1.4962963
19	10.601443	53.434242	0.0	0.0	0.0	0.0	-42.8328	2.0870283	3.4384742
20	-3.4201975	40.385494	0.0	0.0	0.0	0.0	-43.80569	2.730203	3.4756832
21	-17.50169	27.0837	0.0	0.0	0.0	0.0	-44.585392	3.1070487	3.4029012
22	-23.848978	21.33185	0.0	0.0	0.0	0.0	-45.18083	3.233992	3.4637747
23	-26.777735	18.964603	0.0	0.0	0.0	0.0	-45.74234	3.2704244	3.4767296
24	-30.21201	15.997145	0.0	0.0	0.0	0.0	-46.209156	3.2975693	3.4767296
25	-32.937706	13.685321	0.0	0.0	0.0	0.0	-46.623028	3.3199434	3.4767296
26	-37.135635	9.813057	0.0	0.0	0.0	0.0	-46.948692	3.3599405	3.4767296
27	-40.049416	7.148573	0.0	0.0	0.0	0.0	-47.197987	3.3893833	3.4767296
28	-42.78422	4.6114163	0.0	0.0	0.0	0.0	-47.395638	3.4189491	3.4767296
29	-44.783775	2.7533386	0.0	0.0	0.0	0.0	-47.537113	3.441587	3.4767296
30	-46.28965	1.3550717	0.0	0.0	0.0	0.0	-47.644722	3.4591908	3.4767296
31	-47.062027	0.6519085	771.88	741.9	0.0	0.0	-47.713932	3.4767296	5.292004e-16
32	2.607936	50.746468	722.47	0.0	0.0	0.0	-48.13853	3.4767296	1.4962963
33	38.984566	88.564674	0.0	0.0	0.0	0.0	-49.580112	1.1428963e-15	3.3233998
34	-4.1443725	46.485817	0.0	0.0	0.0	0.0	-50.630188	2.5275085	3.4587123
35	-36.076042	15.442325	1078.76	908.92	0.0	0.0	-51.518368	3.4767296	-0.05975498
36	17.505354	69.72718	61.34	0.0	0.0	0.0	-52.221825	3.4767296	1.4962963
37	53.465736	107.161674	0.0	0.0	0.0	0.0	-53.695934	3.1822092e-15	3.2552924
38	10.326022	65.28941	0.0	0.0	0.0	0.0	-54.963394	-4.607551e-16	3.4018831
39	-48.581795	7.061536	165.91	163.7	0.0	0.0	-55.64333	3.4767296	5.292004e-16
40	-8.6491	47.35791	385.84	0.0	0.0	0.0	-56.00701	3.4767296	1.4962963
41	25.029947	82.42889	0.0	0.0	0.0	0.0	-57.398937	6.4987597e-16	3.3448715
42	-21.654459	36.93777	296.06	0.0	0.0	0.0	-58.592228	3.4767296	1.4962963
43	3.437425	63.294044	0.0	0.0	0.0	0.0	-59.856617	-5.6329544e-16	3.4082143
44	-46.478725	14.302632	962.52	944.76	0.0	0.0	-60.78136	3.4767296	-0.36604404
45	-0.22537462	61.11858	902.77	0.0	0.0	0.0	-61.343956	3.4767296	1.4962963
46	39.167816	102.25819	0.0	0.0	0.0	0.0	-63.09037	2.5629025e-15	3.2736683
47	-6.763552	57.675934	50.67	0.0	0.0	0.0	-64.43948	3.4767296	1.4962963
48	17.690708	83.71248	0.0	0.0	0.0	0.0	-66.021774	7.4588763e-16	3.3404236
49	-27.917595	39.290176	299.01	0.0	0.0	0.0	-67.20777	3.4767296	1.4962963
50	-4.704859	63.910763	432.63	0.0	0.0	0.0	-68.61562	3.4767296	1.4962963
51	30.633005	101.20299	0.0	0.0	0.0	0.0	-70.569984	2.4341063e-15	3.2775848
52	-13.853901	58.14708	0.0	0.0	0.0	0.0	-72.000984	1.1766162	3.4242277
53	-54.95178	18.175047	1018.35	0.0	0.0	0.0	-73.12682	3.4767296	1.4962963
54	-30.276026	43.76177	0.0	0.0	0.0	0.0	-74.037796	2.6287704	3.4663856
55	-34.03454	41.896442	0.0	0.0	0.0	0.0	-75.930984	2.6874301	3.471552
56	-45.892414	31.70665	0.0	0.0	0.0	0.0	-77.59906	2.9922636	3.3891718
57	-54.17359	24.807032	0.0	0.0	0.0	0.0	-78.98062	3.1591263	3.4279008
58	-59.33187	20.87622	0.0	0.0	0.0	0.0	-80.20809	3.243432	3.4682584
59	-61.825253	19.574747	0.0	0.0	0.0	0.0	-81.4	3.2650561	3.4767296
60	-64.113525	18.480309	0.0	0.0	0.0	0.0	-82.593834	3.2747364	3.4767296
61	-69.54161	14.178696	0.0	88.11	0.0	0.0	-83.72031	3.4767296	3.567748e-16
62	-18.483032	66.53716	0.0	0.0	0.0	0.0	-85.020195	-3.874059e-16	3.39789
63	-63.953915	22.660627	970.93	116.67	0.0	0.0	-86.61454	3.4767296	5.292004e-16
64	-19.605438	68.24114	0.0	0.0	0.0	0.0	-87.84658	-2.9349252e-16	3.3923955
65	-54.982	34.539074	0.0	0.0	0.0	0.0	-89.52107	2.914389	3.4208362
66	-74.67218	16.261852	0.0	0.0	0.0	0.0	-90.93404	3.2950768	3.4767296
67	-78.71823	13.289368	0.0	0.0	0.0	0.0	-92.0076	3.3238864	3.4767296
68	-81.46394	11.64169	0.0	0.0	0.0	0.0	-93.10564	3.3406498	3.4767296
69	-80.714035	13.773996	0.0	0.0	0.0	0.0	-94.48803	3.3190649	3.4767296
70	-84.39007	11.523383	0.0	0.0	0.0	0.0	-95.91345	3.341876	3.4767296
71	-88.82931	8.201623	0.0	0.0	0.0	0.0	-97.03093	3.3775542	3.4767296
72	-91.174194	6.740665	0.0	0.0	0.0	0.0	-97.91486	3.3940344	3.4767296
73	-91.68074	7.7997055	0.0	0.0	0.0	0.0	-99.480446	3.382039	3.4767296
74	-93.65961	7.4689484	0.0	0.0	0.0	0.0	-101.128555	3.3857577	3.4767296
75	-95.12709	8.126595	0.0	866.54	1081.92	627.25	-103.253685	-0.054395605	3.123164
76	-138.5721	-36.344486	0.0	0.0	1409.44	1457.1	-102.227615	-1.0050148	3.4767296
