vhdl xil_defaultlib  \
"../../../bd/design_1/ip/design_1_axi_dma_0_0/sim/design_1_axi_dma_0_0.vhd" \
"../../../bd/design_1/ip/design_1_rst_ps7_0_100M_0/sim/design_1_rst_ps7_0_100M_0.vhd" \
"../../../bd/design_1/ip/design_1_system_ila_0_1/bd_0/ip/ip_0/sim/bd_36cd_ila_lib_0.vhd" \
"../../../bd/design_1/ip/design_1_system_ila_0_1/bd_0/sim/bd_36cd.vhd" \
"../../../bd/design_1/ip/design_1_system_ila_0_1/sim/design_1_system_ila_0_1.vhd" \
"../../../bd/design_1/ipshared/33bc/hdl/brams_core.vhd" \
"../../../bd/design_1/ipshared/33bc/src/true_dual_bram.vhd" \
"../../../bd/design_1/ipshared/33bc/hdl/dual_bram_axis_v1_0.vhd" \
"../../../bd/design_1/ip/design_1_dual_bram_axis_0_0/sim/design_1_dual_bram_axis_0_0.vhd" \
"../../../bd/design_1/ip/design_1_axi_gpio_0_0/sim/design_1_axi_gpio_0_0.vhd" \
"../../../bd/design_1/ipshared/23a6/hdl/timer2_v1_0.vhd" \
"../../../bd/design_1/ip/design_1_timer2_0_0/sim/design_1_timer2_0_0.vhd" \
"../../../bd/design_1/ip/design_1_axi_gpio_1_0/sim/design_1_axi_gpio_1_0.vhd" \
"../../../bd/design_1/ip/design_1_axi_gpio_2_0/sim/design_1_axi_gpio_2_0.vhd" \
"../../../bd/design_1/ipshared/53ad/hdl/poly_tomont_v1_0.vhd" \
"../../../bd/design_1/ip/design_1_poly_tomont_0_0/sim/design_1_poly_tomont_0_0.vhd" \
"../../../bd/design_1/ipshared/ab6a/hdl/bram_port_selector_v1_0.vhd" \
"../../../bd/design_1/ip/design_1_bram_port_selector_0_0/sim/design_1_bram_port_selector_0_0.vhd" \
"../../../bd/design_1/ip/design_1_bram_port_selector_1_0/sim/design_1_bram_port_selector_1_0.vhd" \
"../../../bd/design_1/ipshared/9555/hdl/signal_multiplexer_v1_0.vhd" \
"../../../bd/design_1/ip/design_1_signal_multiplexer_0_0/sim/design_1_signal_multiplexer_0_0.vhd" \
"../../../bd/design_1/ip/design_1_signal_multiplexer_0_1/sim/design_1_signal_multiplexer_0_1.vhd" \
"../../../bd/design_1/ipshared/6b7a/hdl/montgomery_reduction_v1_0.vhd" \
"../../../bd/design_1/ip/design_1_montgomery_reduction_0_0/sim/design_1_montgomery_reduction_0_0.vhd" \
"../../../bd/design_1/ip/design_1_montgomery_reduction_0_1/sim/design_1_montgomery_reduction_0_1.vhd" \
"../../../bd/design_1/ipshared/b618/src/polyvec_basemul_acc_montgomery_v1_0.vhd" \
"../../../bd/design_1/ip/design_1_polyvec_basemul_acc_0_0/sim/design_1_polyvec_basemul_acc_0_0.vhd" \
"../../../bd/design_1/ip/design_1_signal_multiplexer_2_0/sim/design_1_signal_multiplexer_2_0.vhd" \
"../../../bd/design_1/ip/design_1_signal_multiplexer_2_1/sim/design_1_signal_multiplexer_2_1.vhd" \
"../../../bd/design_1/ip/design_1_signal_multiplexer_3_0/sim/design_1_signal_multiplexer_3_0.vhd" \
"../../../bd/design_1/ip/design_1_signal_multiplexer_3_1/sim/design_1_signal_multiplexer_3_1.vhd" \
"../../../bd/design_1/ip/design_1_signal_multiplexer_3_2/sim/design_1_signal_multiplexer_3_2.vhd" \
"../../../bd/design_1/ip/design_1_signal_multiplexer_3_3/sim/design_1_signal_multiplexer_3_3.vhd" \
"../../../bd/design_1/ip/design_1_bram_port_selector_2_0/sim/design_1_bram_port_selector_2_0.vhd" \
"../../../bd/design_1/ip/design_1_bram_port_selector_3_0/sim/design_1_bram_port_selector_3_0.vhd" \
"../../../bd/design_1/ipshared/71a8/hdl/fqmul_v1_0.vhd" \
"../../../bd/design_1/ip/design_1_fqmul_0_0/sim/design_1_fqmul_0_0.vhd" \
"../../../bd/design_1/ip/design_1_fqmul_0_1/sim/design_1_fqmul_0_1.vhd" \
"../../../bd/design_1/ip/design_1_fqmul_0_2/sim/design_1_fqmul_0_2.vhd" \
"../../../bd/design_1/ip/design_1_fqmul_0_3/sim/design_1_fqmul_0_3.vhd" \
"../../../bd/design_1/ip/design_1_fqmul_0_4/sim/design_1_fqmul_0_4.vhd" \
"../../../bd/design_1/ip/design_1_fqmul_0_5/sim/design_1_fqmul_0_5.vhd" \
"../../../bd/design_1/ip/design_1_signal_multiplexer_1_0/sim/design_1_signal_multiplexer_1_0.vhd" \
"../../../bd/design_1/ip/design_1_signal_multiplexer_1_1/sim/design_1_signal_multiplexer_1_1.vhd" \
"../../../bd/design_1/ip/design_1_signal_multiplexer_1_2/sim/design_1_signal_multiplexer_1_2.vhd" \
"../../../bd/design_1/ip/design_1_signal_multiplexer_1_3/sim/design_1_signal_multiplexer_1_3.vhd" \
"../../../bd/design_1/ip/design_1_signal_multiplexer_1_4/sim/design_1_signal_multiplexer_1_4.vhd" \
"../../../bd/design_1/ip/design_1_signal_multiplexer_1_5/sim/design_1_signal_multiplexer_1_5.vhd" \
"../../../bd/design_1/ip/design_1_montgomery_reduction_1_0/sim/design_1_montgomery_reduction_1_0.vhd" \
"../../../bd/design_1/ip/design_1_montgomery_reduction_1_1/sim/design_1_montgomery_reduction_1_1.vhd" \
"../../../bd/design_1/ip/design_1_montgomery_reduction_1_2/sim/design_1_montgomery_reduction_1_2.vhd" \
"../../../bd/design_1/ip/design_1_montgomery_reduction_1_3/sim/design_1_montgomery_reduction_1_3.vhd" \
"../../../bd/design_1/ipshared/56a9/hdl/barrett_reduce_v1_0.vhd" \
"../../../bd/design_1/ip/design_1_barrett_reduce_0_0/sim/design_1_barrett_reduce_0_0.vhd" \
"../../../bd/design_1/ip/design_1_barrett_reduce_1_0/sim/design_1_barrett_reduce_1_0.vhd" \
"../../../bd/design_1/ip/design_1_axi_gpio_3_0/sim/design_1_axi_gpio_3_0.vhd" \
"../../../bd/design_1/ip/design_1_axi_gpio_4_0/sim/design_1_axi_gpio_4_0.vhd" \
"../../../bd/design_1/sim/design_1.vhd" \

nosort
