$date
        2021-Apr-18 14:28:17
$end
$version
        Vivado v2019.1 (64-bit)
$end
$timescale
        1ps
$end
$scope module dut $end
$var reg 32 " design_1_i/system_ila_0/U0/net_slot_0_axis_tdata [31:0] $end
$var reg 4 B design_1_i/system_ila_0/U0/net_slot_0_axis_tkeep [3:0] $end
$var reg 1 F design_1_i/system_ila_0/U0/net_slot_0_axis_tvalid $end
$var reg 1 G design_1_i/system_ila_0/U0/net_slot_0_axis_tready $end
$var reg 1 H design_1_i/system_ila_0/U0/net_slot_0_axis_tlast $end
$var reg 32 I design_1_i/system_ila_0/U0/net_slot_1_axis_tdata [31:0] $end
$var reg 4 i design_1_i/system_ila_0/U0/net_slot_1_axis_tkeep [3:0] $end
$var reg 1 m design_1_i/system_ila_0/U0/net_slot_1_axis_tvalid $end
$var reg 1 n design_1_i/system_ila_0/U0/net_slot_1_axis_tready $end
$var reg 1 o design_1_i/system_ila_0/U0/net_slot_1_axis_tlast $end
$var reg 3 p Interface__i1_s0___axis_data_fifo_0_M_AXIS_ [2:0] $end
$var reg 3 s Interface__i1_s1___axi_dma_0_M_AXIS_MM2S_ [2:0] $end
$var reg 3 v T_Channel__i1_s0___axis_data_fifo_0_M_AXIS_ [2:0] $end
$var reg 3 y T_Channel__i1_s1___axi_dma_0_M_AXIS_MM2S_ [2:0] $end
$var reg 1 | _TRIGGER $end
$var reg 1 } _WINDOW $end
$var reg 1 ~ _GAP $end
$upscope $end
$enddefinitions $end
#0
$dumpvars
b1111111 "
b1111 B
0F
1G
1H
b1111111 I
b1111 i
0m
1n
0o
b0 p
b0 s
b0 v
b0 y
0|
1}
0~
$end
#512
b0 I
1m
b1 s
b1 y
1|
#513
b1 I
#514
b10 I
#515
b0 "
1F
0H
b11 I
b1 p
b1 v
#516
b1 "
b100 I
#517
b10 "
b101 I
#518
b11 "
b110 I
#519
b100 "
b111 I
#520
b101 "
b1000 I
#521
b110 "
b1001 I
#522
b111 "
b1010 I
#523
b1000 "
b1011 I
#524
b1001 "
b1100 I
#525
b1010 "
b1101 I
#526
b1011 "
b1110 I
#527
b1100 "
b1111 I
#528
b1101 "
b10000 I
#529
b1110 "
b10001 I
#530
b1111 "
b10010 I
#531
b10000 "
b10011 I
#532
b10001 "
b10100 I
#533
b10010 "
b10101 I
#534
b10011 "
b10110 I
#535
b10100 "
b10111 I
#536
b10101 "
b11000 I
#537
b10110 "
b11001 I
#538
b10111 "
b11010 I
#539
b11000 "
b11011 I
#540
b11001 "
b11100 I
#541
b11010 "
b11101 I
#542
b11011 "
b11110 I
#543
b11100 "
b11111 I
#544
b11101 "
b100000 I
#545
b11110 "
b100001 I
#546
b11111 "
b100010 I
#547
b100000 "
b100011 I
#548
b100001 "
b100100 I
#549
b100010 "
b100101 I
#550
b100011 "
b100110 I
#551
b100100 "
b100111 I
#552
b100101 "
b101000 I
#553
b100110 "
b101001 I
#554
b100111 "
b101010 I
#555
b101000 "
b101011 I
#556
b101001 "
b101100 I
#557
b101010 "
b101101 I
#558
b101011 "
b101110 I
#559
b101100 "
b101111 I
#560
b101101 "
b110000 I
#561
b101110 "
b110001 I
#562
b101111 "
b110010 I
#563
b110000 "
b110011 I
#564
b110001 "
b110100 I
#565
b110010 "
b110101 I
#566
b110011 "
b110110 I
#567
b110100 "
b110111 I
#568
b110101 "
b111000 I
#569
b110110 "
b111001 I
#570
b110111 "
b111010 I
#571
b111000 "
b111011 I
#572
b111001 "
b111100 I
#573
b111010 "
b111101 I
#574
b111011 "
b111110 I
#575
b111100 "
b111111 I
#576
b111101 "
b1000000 I
#577
b111110 "
b1000001 I
#578
b111111 "
b1000010 I
#579
b1000000 "
b1000011 I
#580
b1000001 "
b1000100 I
#581
b1000010 "
b1000101 I
#582
b1000011 "
b1000110 I
#583
b1000100 "
b1000111 I
#584
b1000101 "
b1001000 I
#585
b1000110 "
b1001001 I
#586
b1000111 "
b1001010 I
#587
b1001000 "
b1001011 I
#588
b1001001 "
b1001100 I
#589
b1001010 "
b1001101 I
#590
b1001011 "
b1001110 I
#591
b1001100 "
b1001111 I
#592
b1001101 "
b1010000 I
#593
b1001110 "
b1010001 I
#594
b1001111 "
b1010010 I
#595
b1010000 "
b1010011 I
#596
b1010001 "
b1010100 I
#597
b1010010 "
b1010101 I
#598
b1010011 "
b1010110 I
#599
b1010100 "
b1010111 I
#600
b1010101 "
b1011000 I
#601
b1010110 "
b1011001 I
#602
b1010111 "
b1011010 I
#603
b1011000 "
b1011011 I
#604
b1011001 "
b1011100 I
#605
b1011010 "
b1011101 I
#606
b1011011 "
b1011110 I
#607
b1011100 "
b1011111 I
#608
b1011101 "
b1100000 I
#609
b1011110 "
b1100001 I
#610
b1011111 "
b1100010 I
#611
b1100000 "
b1100011 I
#612
b1100001 "
b1100100 I
#613
b1100010 "
b1100101 I
#614
b1100011 "
b1100110 I
#615
b1100100 "
b1100111 I
#616
b1100101 "
b1101000 I
#617
b1100110 "
b1101001 I
#618
b1100111 "
b1101010 I
#619
b1101000 "
b1101011 I
#620
b1101001 "
b1101100 I
#621
b1101010 "
b1101101 I
#622
b1101011 "
b1101110 I
#623
b1101100 "
b1101111 I
#624
b1101101 "
b1110000 I
#625
b1101110 "
b1110001 I
#626
b1101111 "
b1110010 I
#627
b1110000 "
b1110011 I
#628
b1110001 "
b1110100 I
#629
b1110010 "
b1110101 I
#630
b1110011 "
b1110110 I
#631
b1110100 "
b1110111 I
#632
b1110101 "
b1111000 I
#633
b1110110 "
b1111001 I
#634
b1110111 "
b1111010 I
#635
b1111000 "
b1111011 I
#636
b1111001 "
b1111100 I
#637
b1111010 "
b1111101 I
#638
b1111011 "
b1111110 I
#639
b1111100 "
b1111111 I
1o
b10 y
#640
b1111101 "
0m
0o
b0 s
b0 y
#641
b1111110 "
#642
b1111111 "
1H
b10 v
#643
0F
b0 p
b0 v
