[
  [
    "Bintou",
    "si110",
    1
  ],
  [
    "Denzel",
    "si110",
    0
  ],
  [
    "Prithvi",
    "si110",
    0
  ],
  [
    "Torran",
    "si110",
    0
  ],
  [
    "Baylie",
    "si110",
    0
  ],
  [
    "Creag",
    "si110",
    0
  ],
  [
    "Marcous",
    "si110",
    0
  ],
  [
    "Alieshah",
    "si110",
    0
  ],
  [
    "Kamryn",
    "si110",
    0
  ],
  [
    "Aled",
    "si110",
    0
  ],
  [
    "Aara",
    "si110",
    0
  ],
  [
    "Elisha",
    "si110",
    0
  ],
  [
    "Reaiah",
    "si110",
    0
  ],
  [
    "Guerin",
    "si110",
    0
  ],
  [
    "Imogem",
    "si110",
    0
  ],
  [
    "Etiene",
    "si110",
    0
  ],
  [
    "Fawaz",
    "si110",
    0
  ],
  [
    "Charlotte",
    "si110",
    0
  ],
  [
    "Delilah",
    "si110",
    0
  ],
  [
    "Yaseen",
    "si110",
    0
  ],
  [
    "Isaa",
    "si110",
    0
  ],
  [
    "Courtneylee",
    "si110",
    0
  ],
  [
    "Jane",
    "si110",
    0
  ],
  [
    "Amina",
    "si110",
    0
  ],
  [
    "Murray",
    "si110",
    0
  ],
  [
    "Violet",
    "si110",
    0
  ],
  [
    "Cameryn",
    "si110",
    0
  ],
  [
    "Lorne",
    "si110",
    0
  ],
  [
    "Neha",
    "si110",
    0
  ],
  [
    "Maciej",
    "si110",
    0
  ],
  [
    "Yana",
    "si110",
    0
  ],
  [
    "Joude",
    "si110",
    0
  ],
  [
    "Ausra",
    "si110",
    0
  ],
  [
    "Oshun",
    "si110",
    0
  ],
  [
    "Caelan",
    "si110",
    0
  ],
  [
    "Divine",
    "si110",
    0
  ],
  [
    "Kaydin",
    "si110",
    0
  ],
  [
    "Derryn",
    "si110",
    0
  ],
  [
    "Jaying",
    "si106",
    1
  ],
  [
    "Marissa",
    "si106",
    0
  ],
  [
    "Kadyleigh",
    "si106",
    0
  ],
  [
    "Exodi",
    "si106",
    0
  ],
  [
    "Cameryn",
    "si106",
    0
  ],
  [
    "Darryl",
    "si106",
    0
  ],
  [
    "Braydon",
    "si106",
    0
  ],
  [
    "Joel",
    "si106",
    0
  ],
  [
    "Atlanta",
    "si106",
    0
  ],
  [
    "Alaska",
    "si106",
    0
  ],
  [
    "Alasdair",
    "si106",
    0
  ],
  [
    "Leea",
    "si106",
    0
  ],
  [
    "Abbie",
    "si106",
    0
  ],
  [
    "Abrar",
    "si106",
    0
  ],
  [
    "Shantelle",
    "si106",
    0
  ],
  [
    "Saniyah",
    "si106",
    0
  ],
  [
    "Rohin",
    "si106",
    0
  ],
  [
    "Dre",
    "si106",
    0
  ],
  [
    "Hayleigh",
    "si106",
    0
  ],
  [
    "Christianna",
    "si106",
    0
  ],
  [
    "Shazil",
    "si106",
    0
  ],
  [
    "Anndra",
    "si106",
    0
  ],
  [
    "Sharland",
    "si106",
    0
  ],
  [
    "Emon",
    "si106",
    0
  ],
  [
    "Dawid",
    "si106",
    0
  ],
  [
    "Mack",
    "si106",
    0
  ],
  [
    "Laila",
    "si106",
    0
  ],
  [
    "Yelena",
    "si206",
    1
  ],
  [
    "Reace",
    "si206",
    0
  ],
  [
    "Erann",
    "si206",
    0
  ],
  [
    "Fawkes",
    "si206",
    0
  ],
  [
    "Abigail",
    "si206",
    0
  ],
  [
    "James",
    "si206",
    0
  ],
  [
    "Micaylah",
    "si206",
    0
  ],
  [
    "Cathleen",
    "si206",
    0
  ],
  [
    "Aakriti",
    "si206",
    0
  ],
  [
    "Rhian",
    "si206",
    0
  ],
  [
    "Ingrid",
    "si206",
    0
  ],
  [
    "Craig",
    "si206",
    0
  ],
  [
    "Kaylen",
    "si206",
    0
  ],
  [
    "Kimberly",
    "si206",
    0
  ],
  [
    "Levi",
    "si206",
    0
  ],
  [
    "Rhiona",
    "si206",
    0
  ],
  [
    "Subhaan",
    "si206",
    0
  ],
  [
    "Shonagh",
    "si206",
    0
  ],
  [
    "Calvin",
    "si206",
    0
  ],
  [
    "Barbara",
    "si206",
    0
  ],
  [
    "Archibald",
    "si206",
    0
  ],
  [
    "Kyral",
    "si206",
    0
  ],
  [
    "Ailie",
    "si206",
    0
  ],
  [
    "Arann",
    "si206",
    0
  ],
  [
    "Dale",
    "si206",
    0
  ],
  [
    "Amyleigh",
    "si206",
    0
  ],
  [
    "Kalen",
    "si206",
    0
  ],
  [
    "Isabela",
    "si206",
    0
  ],
  [
    "Uzair",
    "si206",
    0
  ],
  [
    "Korbyn",
    "si206",
    0
  ],
  [
    "Jeremy",
    "si206",
    0
  ],
  [
    "Davina",
    "si206",
    0
  ],
  [
    "Karli",
    "si206",
    0
  ],
  [
    "Jeyun",
    "si206",
    0
  ],
  [
    "Yusra",
    "si206",
    0
  ],
  [
    "Aaryn",
    "si206",
    0
  ],
  [
    "Marina",
    "si206",
    0
  ],
  [
    "Marin",
    "si206",
    0
  ],
  [
    "Jordi",
    "si206",
    0
  ],
  [
    "Isira",
    "si206",
    0
  ],
  [
    "Violet",
    "si206",
    0
  ],
  [
    "Isak",
    "si206",
    0
  ],
  [
    "Franklin",
    "si206",
    0
  ],
  [
    "Heyden",
    "si206",
    0
  ],
  [
    "Darragh",
    "si206",
    0
  ],
  [
    "Baye",
    "si206",
    0
  ],
  [
    "Avi",
    "si206",
    0
  ],
  [
    "Tammi",
    "si206",
    0
  ],
  [
    "Eris",
    "si206",
    0
  ],
  [
    "Momooreoluwa",
    "si206",
    0
  ],
  [
    "Saharra",
    "si206",
    0
  ],
  [
    "Abrare",
    "si301",
    1
  ],
  [
    "Kai",
    "si301",
    0
  ],
  [
    "Amie",
    "si301",
    0
  ],
  [
    "Kyesha",
    "si301",
    0
  ],
  [
    "Nassir",
    "si301",
    0
  ],
  [
    "Nicolae",
    "si301",
    0
  ],
  [
    "Khadijah",
    "si301",
    0
  ],
  [
    "Bradley",
    "si301",
    0
  ],
  [
    "Jordan",
    "si301",
    0
  ],
  [
    "Broghan",
    "si301",
    0
  ],
  [
    "Anais",
    "si301",
    0
  ],
  [
    "Neo",
    "si301",
    0
  ],
  [
    "Zaine",
    "si301",
    0
  ],
  [
    "Keirra",
    "si301",
    0
  ],
  [
    "Parmin",
    "si301",
    0
  ],
  [
    "Maximilian",
    "si301",
    0
  ],
  [
    "Joss",
    "si301",
    0
  ],
  [
    "Shane",
    "si301",
    0
  ],
  [
    "Reggie",
    "si301",
    0
  ],
  [
    "Rimal",
    "si301",
    0
  ],
  [
    "Louella",
    "si301",
    0
  ],
  [
    "Parwana",
    "si301",
    0
  ],
  [
    "Robi",
    "si301",
    0
  ],
  [
    "Joe",
    "si301",
    0
  ],
  [
    "Amyleigh",
    "si301",
    0
  ],
  [
    "Brehme",
    "si301",
    0
  ],
  [
    "Bret",
    "si301",
    0
  ],
  [
    "Ahmed",
    "si301",
    0
  ],
  [
    "Marie",
    "si310",
    1
  ],
  [
    "Kaelah",
    "si310",
    0
  ],
  [
    "Ragid",
    "si310",
    0
  ],
  [
    "Tabbitha",
    "si310",
    0
  ],
  [
    "Kaylee",
    "si310",
    0
  ],
  [
    "Fizzah",
    "si310",
    0
  ],
  [
    "Phoevos",
    "si310",
    0
  ],
  [
    "Bryson",
    "si310",
    0
  ],
  [
    "Aizah",
    "si310",
    0
  ],
  [
    "Renas",
    "si310",
    0
  ],
  [
    "Zayne",
    "si310",
    0
  ],
  [
    "Erik",
    "si310",
    0
  ],
  [
    "Mehik",
    "si310",
    0
  ],
  [
    "Raheem",
    "si310",
    0
  ],
  [
    "Caoilfhinn",
    "si310",
    0
  ],
  [
    "Elias",
    "si310",
    0
  ],
  [
    "Prithvi",
    "si310",
    0
  ],
  [
    "Kaila",
    "si310",
    0
  ],
  [
    "Aled",
    "si310",
    0
  ],
  [
    "Serafina",
    "si310",
    0
  ],
  [
    "Jazeb",
    "si310",
    0
  ],
  [
    "Muneeb",
    "si310",
    0
  ],
  [
    "Fenella",
    "si310",
    0
  ],
  [
    "Giacomo",
    "si310",
    0
  ],
  [
    "Lila",
    "si310",
    0
  ],
  [
    "Anubhav",
    "si310",
    0
  ],
  [
    "Prabhjoit",
    "si310",
    0
  ],
  [
    "Danni",
    "si310",
    0
  ],
  [
    "Emilia",
    "si310",
    0
  ],
  [
    "Saim",
    "si310",
    0
  ],
  [
    "Jiao",
    "si310",
    0
  ],
  [
    "Jael",
    "si310",
    0
  ],
  [
    "Siriol",
    "si310",
    0
  ],
  [
    "Manisha",
    "si334",
    1
  ],
  [
    "Hiro",
    "si334",
    0
  ],
  [
    "Kadie",
    "si334",
    0
  ],
  [
    "Kahlen",
    "si334",
    0
  ],
  [
    "Alissa",
    "si334",
    0
  ],
  [
    "Raul",
    "si334",
    0
  ],
  [
    "Macy",
    "si334",
    0
  ],
  [
    "Amey",
    "si334",
    0
  ],
  [
    "Oluwatimilehin",
    "si334",
    0
  ],
  [
    "Rafferty",
    "si334",
    0
  ],
  [
    "Ezekiel",
    "si334",
    0
  ],
  [
    "Jaida",
    "si334",
    0
  ],
  [
    "Aneeka",
    "si334",
    0
  ],
  [
    "Zeid",
    "si334",
    0
  ],
  [
    "Douglas",
    "si334",
    0
  ],
  [
    "Zen",
    "si334",
    0
  ],
  [
    "Tylar",
    "si334",
    0
  ],
  [
    "Michat",
    "si334",
    0
  ],
  [
    "Shahd",
    "si334",
    0
  ],
  [
    "Orin",
    "si334",
    0
  ],
  [
    "Rahimah",
    "si334",
    0
  ],
  [
    "Safiya",
    "si334",
    0
  ],
  [
    "Kenneth",
    "si334",
    0
  ],
  [
    "Declan",
    "si334",
    0
  ],
  [
    "Rubyn",
    "si334",
    0
  ],
  [
    "Jadon",
    "si334",
    0
  ],
  [
    "Jayme",
    "si334",
    0
  ],
  [
    "Shyam",
    "si334",
    0
  ],
  [
    "Wing",
    "si334",
    0
  ],
  [
    "Diona",
    "si334",
    0
  ],
  [
    "Tristan",
    "si334",
    0
  ],
  [
    "Tasneem",
    "si334",
    0
  ],
  [
    "Sameer",
    "si334",
    0
  ],
  [
    "Maariyah",
    "si334",
    0
  ],
  [
    "Cael",
    "si334",
    0
  ],
  [
    "Bekim",
    "si334",
    0
  ],
  [
    "Jacques",
    "si334",
    0
  ],
  [
    "Jonothan",
    "si334",
    0
  ],
  [
    "Camilla",
    "si334",
    0
  ],
  [
    "Imani",
    "si334",
    0
  ],
  [
    "Titi",
    "si334",
    0
  ],
  [
    "Harvey",
    "si334",
    0
  ],
  [
    "Arya",
    "si334",
    0
  ],
  [
    "Sylvain",
    "si334",
    0
  ],
  [
    "Oz",
    "si334",
    0
  ],
  [
    "Dakotah",
    "si334",
    0
  ],
  [
    "Aryankhan",
    "si334",
    0
  ],
  [
    "Aleesha",
    "si334",
    0
  ],
  [
    "Valeria",
    "si334",
    0
  ],
  [
    "Dharam",
    "si363",
    1
  ],
  [
    "Lyndsey",
    "si363",
    0
  ],
  [
    "Mili",
    "si363",
    0
  ],
  [
    "Yutong",
    "si363",
    0
  ],
  [
    "Rui",
    "si363",
    0
  ],
  [
    "Zakk",
    "si363",
    0
  ],
  [
    "Keris",
    "si363",
    0
  ],
  [
    "Philippos",
    "si363",
    0
  ],
  [
    "Kienan",
    "si363",
    0
  ],
  [
    "Nima",
    "si363",
    0
  ],
  [
    "Nur",
    "si363",
    0
  ],
  [
    "Saicu",
    "si363",
    0
  ],
  [
    "Jasmin",
    "si363",
    0
  ],
  [
    "Mikhail",
    "si363",
    0
  ],
  [
    "Cecily",
    "si363",
    0
  ],
  [
    "Rebeca",
    "si363",
    0
  ],
  [
    "Prince",
    "si363",
    0
  ],
  [
    "Logyn",
    "si363",
    0
  ],
  [
    "Ata",
    "si363",
    0
  ],
  [
    "Murron",
    "si363",
    0
  ],
  [
    "Safara",
    "si363",
    0
  ],
  [
    "Jae",
    "si363",
    0
  ],
  [
    "Hassan",
    "si363",
    0
  ],
  [
    "Nakeisha",
    "si363",
    0
  ],
  [
    "Kiran",
    "si363",
    0
  ],
  [
    "Momina",
    "si363",
    0
  ],
  [
    "Paris",
    "si363",
    0
  ],
  [
    "Aleshia",
    "si363",
    0
  ],
  [
    "Alex",
    "si363",
    0
  ],
  [
    "Dior",
    "si363",
    0
  ],
  [
    "Cailean",
    "si364",
    1
  ],
  [
    "Liall",
    "si364",
    0
  ],
  [
    "Kasandra",
    "si364",
    0
  ],
  [
    "Hollye",
    "si364",
    0
  ],
  [
    "Codey",
    "si364",
    0
  ],
  [
    "Caitlyn",
    "si364",
    0
  ],
  [
    "Maggie",
    "si364",
    0
  ],
  [
    "Jaksyn",
    "si364",
    0
  ],
  [
    "Madisen",
    "si364",
    0
  ],
  [
    "Marissa",
    "si364",
    0
  ],
  [
    "Rzan",
    "si364",
    0
  ],
  [
    "Raya",
    "si364",
    0
  ],
  [
    "Aya",
    "si364",
    0
  ],
  [
    "Ausra",
    "si364",
    0
  ],
  [
    "Sarra",
    "si364",
    0
  ],
  [
    "Rosalind",
    "si364",
    0
  ],
  [
    "Sharoz",
    "si364",
    0
  ],
  [
    "Adain",
    "si364",
    0
  ],
  [
    "Cruiz",
    "si364",
    0
  ],
  [
    "Tira",
    "si364",
    0
  ],
  [
    "Rachel",
    "si364",
    0
  ],
  [
    "Keeva",
    "si364",
    0
  ],
  [
    "Alba",
    "si364",
    0
  ],
  [
    "Zeph",
    "si364",
    0
  ],
  [
    "Ramsay",
    "si364",
    0
  ],
  [
    "Lachlan",
    "si364",
    0
  ],
  [
    "Maisie",
    "si364",
    0
  ],
  [
    "Roxy",
    "si364",
    0
  ],
  [
    "Keanna",
    "si364",
    0
  ],
  [
    "Walid",
    "si364",
    0
  ],
  [
    "Yves",
    "si364",
    0
  ],
  [
    "Girijan",
    "si364",
    0
  ],
  [
    "Kellyanne",
    "si364",
    0
  ],
  [
    "Mara",
    "si364",
    0
  ],
  [
    "Jaya",
    "si364",
    0
  ],
  [
    "Ravin",
    "si364",
    0
  ],
  [
    "Reegan",
    "si364",
    0
  ],
  [
    "Kerrin",
    "si364",
    0
  ],
  [
    "Ker",
    "si364",
    0
  ],
  [
    "Merran",
    "si364",
    0
  ],
  [
    "Serafina",
    "si364",
    0
  ],
  [
    "Ailsa",
    "si364",
    0
  ],
  [
    "Tjay",
    "si364",
    0
  ],
  [
    "Kirsteen",
    "si364",
    0
  ],
  [
    "Iqra",
    "si364",
    0
  ],
  [
    "Qin",
    "si364",
    0
  ],
  [
    "Leyton",
    "si364",
    0
  ],
  [
    "Parmin",
    "si422",
    1
  ],
  [
    "Somaya",
    "si422",
    0
  ],
  [
    "Kelice",
    "si422",
    0
  ],
  [
    "Ricky",
    "si422",
    0
  ],
  [
    "Kirsty",
    "si422",
    0
  ],
  [
    "Campbel",
    "si422",
    0
  ],
  [
    "Griffyn",
    "si422",
    0
  ],
  [
    "Nima",
    "si422",
    0
  ],
  [
    "Reno",
    "si422",
    0
  ],
  [
    "Jeemie",
    "si422",
    0
  ],
  [
    "Vincenzo",
    "si422",
    0
  ],
  [
    "Lene",
    "si422",
    0
  ],
  [
    "Jeevan",
    "si422",
    0
  ],
  [
    "Lavinia",
    "si422",
    0
  ],
  [
    "Malcolm",
    "si422",
    0
  ],
  [
    "Kaylah",
    "si422",
    0
  ],
  [
    "Lorenzo",
    "si422",
    0
  ],
  [
    "Calley",
    "si422",
    0
  ],
  [
    "Amberlouise",
    "si422",
    0
  ],
  [
    "Qirui",
    "si422",
    0
  ],
  [
    "Mornach",
    "si422",
    0
  ],
  [
    "Keziah",
    "si422",
    0
  ],
  [
    "Codi",
    "si422",
    0
  ],
  [
    "Seighin",
    "si430",
    1
  ],
  [
    "Beatrice",
    "si430",
    0
  ],
  [
    "Cale",
    "si430",
    0
  ],
  [
    "Reagan",
    "si430",
    0
  ],
  [
    "Charly",
    "si430",
    0
  ],
  [
    "Niven",
    "si430",
    0
  ],
  [
    "Morven",
    "si430",
    0
  ],
  [
    "Zendel",
    "si430",
    0
  ],
  [
    "Isadora",
    "si430",
    0
  ],
  [
    "Zahira",
    "si430",
    0
  ],
  [
    "Zion",
    "si430",
    0
  ],
  [
    "Prasheeta",
    "si430",
    0
  ],
  [
    "Janelle",
    "si430",
    0
  ],
  [
    "Calvin",
    "si430",
    0
  ],
  [
    "Karthikeya",
    "si430",
    0
  ],
  [
    "Corran",
    "si430",
    0
  ],
  [
    "Lauchlan",
    "si430",
    0
  ],
  [
    "Ayaan",
    "si430",
    0
  ],
  [
    "Oriane",
    "si430",
    0
  ],
  [
    "Mack",
    "si430",
    0
  ],
  [
    "Darroch",
    "si430",
    0
  ],
  [
    "Kylie",
    "si430",
    0
  ],
  [
    "Khaela",
    "si430",
    0
  ],
  [
    "Hamani",
    "si430",
    0
  ],
  [
    "Coco",
    "si430",
    0
  ],
  [
    "Linton",
    "si430",
    0
  ],
  [
    "Lovell",
    "si430",
    0
  ],
  [
    "Sophie",
    "si430",
    0
  ],
  [
    "Caedan",
    "si430",
    0
  ],
  [
    "Ailsa",
    "si430",
    0
  ],
  [
    "Bob",
    "si430",
    0
  ],
  [
    "Aiyanna",
    "si430",
    0
  ],
  [
    "Rianna",
    "si430",
    0
  ]
]