2022-Jun-20-14:36:26,ETL Job Started
2022-Jun-20-14:36:26,Extract phase Started
2022-Jun-20-14:36:26,Extract phase Ended
2022-Jun-20-14:36:26,Transform phase Started
2022-Jun-20-14:36:26,Transform phase Ended
2022-Jun-20-14:36:26,Load phase Started
2022-Jun-20-14:36:26,Load phase Ended
2022-Jun-20-14:36:26,ETL Job Ended
2022-Jun-20-14:45:12,ETL Job Started
2022-Jun-20-14:45:12,Extract phase Started
2022-Jun-20-14:45:26,ETL Job Started
2022-Jun-20-14:45:26,Extract phase Started
2022-Jun-20-14:46:13,ETL Job Started
2022-Jun-20-14:46:13,Extract phase Started
2022-Jun-20-14:47:02,ETL Job Started
2022-Jun-20-14:47:02,Extract phase Started
2022-Jun-20-14:47:02,Extract phase Ended
2022-Jun-20-14:47:02,ETL Job Ended
2022-Jun-20-14:49:19,ETL Job Started
2022-Jun-20-14:49:19,Extract phase Started
2022-Jun-20-14:49:20,Extract phase Ended
2022-Jun-20-14:49:20,ETL Job Ended
2022-Jun-20-14:49:31,ETL Job Started
2022-Jun-20-14:49:31,Extract phase Started
2022-Jun-20-14:49:31,Extract phase Ended
2022-Jun-20-14:49:31,Transform phase Started
2022-Jun-20-14:49:31,Transform phase Ended
2022-Jun-20-14:49:31,ETL Job Ended
2022-Jun-20-14:50:11,ETL Job Started
2022-Jun-20-14:50:11,Extract phase Started
2022-Jun-20-14:50:11,Extract phase Ended
2022-Jun-20-14:50:11,Transform phase Started
2022-Jun-20-14:50:11,Transform phase Ended
2022-Jun-20-14:50:11,Load phase Started
2022-Jun-20-14:50:11,Load phase Ended
2022-Jun-20-14:50:11,ETL Job Ended
2022-Jun-20-14:51:36,ETL Job Started
2022-Jun-20-14:51:36,Extract phase Started
2022-Jun-20-14:51:36,Extract phase Ended
2022-Jun-20-14:51:36,Transform phase Started
2022-Jun-20-14:51:37,Transform phase Ended
2022-Jun-20-14:51:37,Load phase Started
2022-Jun-20-14:51:37,Load phase Ended
2022-Jun-20-14:51:37,ETL Job Ended
2022-Jun-20-14:51:45,ETL Job Started
2022-Jun-20-14:51:45,Extract phase Started
2022-Jun-20-14:51:45,Extract phase Ended
2022-Jun-20-14:51:45,Transform phase Started
2022-Jun-20-14:51:45,Transform phase Ended
2022-Jun-20-14:51:45,Load phase Started
2022-Jun-20-14:51:45,Load phase Ended
2022-Jun-20-14:51:45,ETL Job Ended
2022-Jun-20-14:52:05,ETL Job Started
2022-Jun-20-14:52:05,Extract phase Started
2022-Jun-20-14:52:05,Extract phase Ended
2022-Jun-20-14:52:05,Transform phase Started
2022-Jun-20-14:52:05,Transform phase Ended
2022-Jun-20-14:52:05,Load phase Started
2022-Jun-20-14:52:05,Load phase Ended
2022-Jun-20-14:52:05,ETL Job Ended
2022-Jun-20-14:52:33,ETL Job Started
2022-Jun-20-14:52:33,Extract phase Started
2022-Jun-20-14:52:33,Extract phase Ended
2022-Jun-20-14:52:33,Transform phase Started
2022-Jun-20-14:52:33,Transform phase Ended
2022-Jun-20-14:52:33,Load phase Started
2022-Jun-20-14:52:33,Load phase Ended
2022-Jun-20-14:52:33,ETL Job Ended
2022-Jun-20-15:10:26,ETL Job Started
2022-Jun-20-15:10:26,Extract phase Started
2022-Jun-20-15:10:26,Extract phase Ended
2022-Jun-20-15:10:26,Transform phase Started
2022-Jun-20-15:10:26,Transform phase Ended
2022-Jun-20-15:10:26,Load phase Started
2022-Jun-20-15:10:26,Load phase Ended
2022-Jun-20-15:10:26,ETL Job Ended
2022-Jun-20-15:10:27,ETL Job Started
2022-Jun-20-15:10:27,Extract phase Started
2022-Jun-20-15:10:27,Extract phase Ended
2022-Jun-20-15:10:27,Transform phase Started
2022-Jun-20-15:10:27,Transform phase Ended
2022-Jun-20-15:10:27,Load phase Started
2022-Jun-20-15:10:27,Load phase Ended
2022-Jun-20-15:10:27,ETL Job Ended
2022-Jun-20-15:10:29,ETL Job Started
2022-Jun-20-15:10:29,Extract phase Started
2022-Jun-20-15:10:29,Extract phase Ended
2022-Jun-20-15:10:29,Transform phase Started
2022-Jun-20-15:10:29,Transform phase Ended
2022-Jun-20-15:10:29,Load phase Started
2022-Jun-20-15:10:29,Load phase Ended
2022-Jun-20-15:10:29,ETL Job Ended
2022-Jun-20-15:10:39,ETL Job Started
2022-Jun-20-15:10:39,Extract phase Started
2022-Jun-20-15:10:39,Extract phase Ended
2022-Jun-20-15:10:39,Transform phase Started
2022-Jun-20-15:10:39,Transform phase Ended
2022-Jun-20-15:10:39,Load phase Started
2022-Jun-20-15:10:39,Load phase Ended
2022-Jun-20-15:10:39,ETL Job Ended
2022-Jun-20-17:27:20,ETL Job Started
2022-Jun-20-17:27:20,Extract phase Started
2022-Jun-20-17:27:20,Extract phase Ended
2022-Jun-20-17:27:20,Transform phase Started
2022-Jun-20-17:27:20,Transform phase Ended
2022-Jun-20-17:27:20,Load phase Started
2022-Jun-20-17:27:20,Load phase Ended
2022-Jun-20-17:27:20,ETL Job Ended
2022-Jun-20-17:27:21,ETL Job Started
2022-Jun-20-17:27:21,Extract phase Started
2022-Jun-20-17:27:22,Extract phase Ended
2022-Jun-20-17:27:22,Transform phase Started
2022-Jun-20-17:27:22,Transform phase Ended
2022-Jun-20-17:27:22,Load phase Started
2022-Jun-20-17:27:22,Load phase Ended
2022-Jun-20-17:27:22,ETL Job Ended
2022-Jun-20-17:27:27,ETL Job Started
2022-Jun-20-17:27:27,Extract phase Started
2022-Jun-20-17:27:27,Extract phase Ended
2022-Jun-20-17:27:27,Transform phase Started
2022-Jun-20-17:27:27,Transform phase Ended
2022-Jun-20-17:27:27,Load phase Started
2022-Jun-20-17:27:27,Load phase Ended
2022-Jun-20-17:27:27,ETL Job Ended
