{
  "format_version": "1.1",
  "terraform_version": "1.3.7",
  "variables": {
    "admin_password": {
      "value": "h4ck3rSA@191016ROOT!@#2023"
    },
    "admin_user": {
      "value": "xcodeit.suporte"
    },
    "fqdn_domain": {
      "value": "infra-devops"
    },
    "infra_devops_name": {
      "value": "infra-devops"
    },
    "internal_nic": {
      "value": "internal-nic"
    },
    "public_ip": {
      "value": "public-ip-vmlinux"
    },
    "ubuntu_server": {
      "value": "ubuntu-server"
    }
  },
  "planned_values": {
    "root_module": {
      "resources": [
        {
          "address": "azurerm_linux_virtual_machine.ubuntu-server",
          "mode": "managed",
          "type": "azurerm_linux_virtual_machine",
          "name": "ubuntu-server",
          "provider_name": "registry.terraform.io/hashicorp/azurerm",
          "schema_version": 0,
          "values": {
            "additional_capabilities": [],
            "admin_password": "h4ck3rSA@191016ROOT!@#2023",
            "admin_ssh_key": [],
            "admin_username": "xcodeit.suporte",
            "allow_extension_operations": true,
            "availability_set_id": null,
            "boot_diagnostics": [],
            "custom_data": null,
            "dedicated_host_group_id": null,
            "dedicated_host_id": null,
            "disable_password_authentication": false,
            "encryption_at_host_enabled": null,
            "eviction_policy": null,
            "extensions_time_budget": "PT1H30M",
            "identity": [],
            "license_type": null,
            "location": "eastus2",
            "max_bid_price": -1,
            "name": "ubuntu-server",
            "os_disk": [
              {
                "caching": "ReadWrite",
                "diff_disk_settings": [],
                "disk_encryption_set_id": null,
                "storage_account_type": "Standard_LRS",
                "write_accelerator_enabled": false
              }
            ],
            "patch_mode": "ImageDefault",
            "plan": [],
            "platform_fault_domain": -1,
            "priority": "Regular",
            "provision_vm_agent": true,
            "proximity_placement_group_id": null,
            "resource_group_name": "infra-devops",
            "secret": [],
            "secure_boot_enabled": null,
            "size": "Standard_B2s",
            "source_image_id": null,
            "source_image_reference": [
              {
                "offer": "0001-com-ubuntu-server-jammy",
                "publisher": "Canonical",
                "sku": "22_04-lts",
                "version": "latest"
              }
            ],
            "tags": null,
            "timeouts": null,
            "user_data": null,
            "virtual_machine_scale_set_id": null,
            "vtpm_enabled": null
          },
          "sensitive_values": {
            "additional_capabilities": [],
            "admin_ssh_key": [],
            "boot_diagnostics": [],
            "identity": [],
            "network_interface_ids": [],
            "os_disk": [
              {
                "diff_disk_settings": []
              }
            ],
            "plan": [],
            "private_ip_addresses": [],
            "public_ip_addresses": [],
            "secret": [],
            "source_image_reference": [
              {}
            ]
          }
        },
        {
          "address": "azurerm_managed_disk.data-disk-managed",
          "mode": "managed",
          "type": "azurerm_managed_disk",
          "name": "data-disk-managed",
          "provider_name": "registry.terraform.io/hashicorp/azurerm",
          "schema_version": 0,
          "values": {
            "create_option": "Empty",
            "disk_access_id": null,
            "disk_encryption_set_id": null,
            "disk_size_gb": 10,
            "encryption_settings": [],
            "gallery_image_reference_id": null,
            "hyper_v_generation": null,
            "image_reference_id": null,
            "location": "eastus2",
            "name": "ubuntu-server-data-disk1",
            "network_access_policy": null,
            "on_demand_bursting_enabled": null,
            "os_type": null,
            "public_network_access_enabled": true,
            "resource_group_name": "infra-devops",
            "source_resource_id": null,
            "storage_account_id": null,
            "storage_account_type": "Standard_LRS",
            "tags": null,
            "timeouts": null,
            "trusted_launch_enabled": null,
            "zones": null
          },
          "sensitive_values": {
            "encryption_settings": []
          }
        },
        {
          "address": "azurerm_network_interface.internal-nic",
          "mode": "managed",
          "type": "azurerm_network_interface",
          "name": "internal-nic",
          "provider_name": "registry.terraform.io/hashicorp/azurerm",
          "schema_version": 0,
          "values": {
            "enable_accelerated_networking": false,
            "enable_ip_forwarding": false,
            "ip_configuration": [
              {
                "name": "internal",
                "private_ip_address_allocation": "Dynamic",
                "private_ip_address_version": "IPv4",
                "subnet_id": "/subscriptions/7ac7282e-c136-4f17-9ed8-96b5ec70822e/resourceGroups/infra-devops/providers/Microsoft.Network/virtualNetworks/infra-devops/subnets/infra-devops"
              }
            ],
            "location": "eastus2",
            "name": "internal-nic",
            "resource_group_name": "infra-devops",
            "tags": null,
            "timeouts": null
          },
          "sensitive_values": {
            "applied_dns_servers": [],
            "dns_servers": [],
            "ip_configuration": [
              {}
            ],
            "private_ip_addresses": []
          }
        },
        {
          "address": "azurerm_public_ip.public-ip",
          "mode": "managed",
          "type": "azurerm_public_ip",
          "name": "public-ip",
          "provider_name": "registry.terraform.io/hashicorp/azurerm",
          "schema_version": 0,
          "values": {
            "allocation_method": "Static",
            "domain_name_label": "infra-devops",
            "idle_timeout_in_minutes": 4,
            "ip_tags": null,
            "ip_version": "IPv4",
            "location": "eastus2",
            "name": "public-ip-vmlinux",
            "public_ip_prefix_id": null,
            "resource_group_name": "infra-devops",
            "reverse_fqdn": null,
            "sku": "Basic",
            "sku_tier": "Regional",
            "tags": null,
            "timeouts": null
          },
          "sensitive_values": {
            "zones": []
          }
        },
        {
          "address": "azurerm_virtual_machine_data_disk_attachment.disk-attachment",
          "mode": "managed",
          "type": "azurerm_virtual_machine_data_disk_attachment",
          "name": "disk-attachment",
          "provider_name": "registry.terraform.io/hashicorp/azurerm",
          "schema_version": 0,
          "values": {
            "caching": "ReadWrite",
            "create_option": "Attach",
            "lun": 1,
            "timeouts": null,
            "write_accelerator_enabled": false
          },
          "sensitive_values": {}
        }
      ]
    }
  },
  "resource_changes": [
    {
      "address": "azurerm_linux_virtual_machine.ubuntu-server",
      "mode": "managed",
      "type": "azurerm_linux_virtual_machine",
      "name": "ubuntu-server",
      "provider_name": "registry.terraform.io/hashicorp/azurerm",
      "change": {
        "actions": [
          "create"
        ],
        "before": null,
        "after": {
          "additional_capabilities": [],
          "admin_password": "h4ck3rSA@191016ROOT!@#2023",
          "admin_ssh_key": [],
          "admin_username": "xcodeit.suporte",
          "allow_extension_operations": true,
          "availability_set_id": null,
          "boot_diagnostics": [],
          "custom_data": null,
          "dedicated_host_group_id": null,
          "dedicated_host_id": null,
          "disable_password_authentication": false,
          "encryption_at_host_enabled": null,
          "eviction_policy": null,
          "extensions_time_budget": "PT1H30M",
          "identity": [],
          "license_type": null,
          "location": "eastus2",
          "max_bid_price": -1,
          "name": "ubuntu-server",
          "os_disk": [
            {
              "caching": "ReadWrite",
              "diff_disk_settings": [],
              "disk_encryption_set_id": null,
              "storage_account_type": "Standard_LRS",
              "write_accelerator_enabled": false
            }
          ],
          "patch_mode": "ImageDefault",
          "plan": [],
          "platform_fault_domain": -1,
          "priority": "Regular",
          "provision_vm_agent": true,
          "proximity_placement_group_id": null,
          "resource_group_name": "infra-devops",
          "secret": [],
          "secure_boot_enabled": null,
          "size": "Standard_B2s",
          "source_image_id": null,
          "source_image_reference": [
            {
              "offer": "0001-com-ubuntu-server-jammy",
              "publisher": "Canonical",
              "sku": "22_04-lts",
              "version": "latest"
            }
          ],
          "tags": null,
          "timeouts": null,
          "user_data": null,
          "virtual_machine_scale_set_id": null,
          "vtpm_enabled": null
        },
        "after_unknown": {
          "additional_capabilities": [],
          "admin_ssh_key": [],
          "boot_diagnostics": [],
          "computer_name": true,
          "id": true,
          "identity": [],
          "network_interface_ids": true,
          "os_disk": [
            {
              "diff_disk_settings": [],
              "disk_size_gb": true,
              "name": true
            }
          ],
          "plan": [],
          "private_ip_address": true,
          "private_ip_addresses": true,
          "public_ip_address": true,
          "public_ip_addresses": true,
          "secret": [],
          "source_image_reference": [
            {}
          ],
          "virtual_machine_id": true,
          "zone": true
        },
        "before_sensitive": false,
        "after_sensitive": {
          "additional_capabilities": [],
          "admin_password": true,
          "admin_ssh_key": [],
          "boot_diagnostics": [],
          "custom_data": true,
          "identity": [],
          "network_interface_ids": [],
          "os_disk": [
            {
              "diff_disk_settings": []
            }
          ],
          "plan": [],
          "private_ip_addresses": [],
          "public_ip_addresses": [],
          "secret": [],
          "source_image_reference": [
            {}
          ]
        }
      }
    },
    {
      "address": "azurerm_managed_disk.data-disk-managed",
      "mode": "managed",
      "type": "azurerm_managed_disk",
      "name": "data-disk-managed",
      "provider_name": "registry.terraform.io/hashicorp/azurerm",
      "change": {
        "actions": [
          "create"
        ],
        "before": null,
        "after": {
          "create_option": "Empty",
          "disk_access_id": null,
          "disk_encryption_set_id": null,
          "disk_size_gb": 10,
          "encryption_settings": [],
          "gallery_image_reference_id": null,
          "hyper_v_generation": null,
          "image_reference_id": null,
          "location": "eastus2",
          "name": "ubuntu-server-data-disk1",
          "network_access_policy": null,
          "on_demand_bursting_enabled": null,
          "os_type": null,
          "public_network_access_enabled": true,
          "resource_group_name": "infra-devops",
          "source_resource_id": null,
          "storage_account_id": null,
          "storage_account_type": "Standard_LRS",
          "tags": null,
          "timeouts": null,
          "trusted_launch_enabled": null,
          "zones": null
        },
        "after_unknown": {
          "disk_iops_read_only": true,
          "disk_iops_read_write": true,
          "disk_mbps_read_only": true,
          "disk_mbps_read_write": true,
          "encryption_settings": [],
          "id": true,
          "logical_sector_size": true,
          "max_shares": true,
          "source_uri": true,
          "tier": true
        },
        "before_sensitive": false,
        "after_sensitive": {
          "encryption_settings": []
        }
      }
    },
    {
      "address": "azurerm_network_interface.internal-nic",
      "mode": "managed",
      "type": "azurerm_network_interface",
      "name": "internal-nic",
      "provider_name": "registry.terraform.io/hashicorp/azurerm",
      "change": {
        "actions": [
          "create"
        ],
        "before": null,
        "after": {
          "enable_accelerated_networking": false,
          "enable_ip_forwarding": false,
          "ip_configuration": [
            {
              "name": "internal",
              "private_ip_address_allocation": "Dynamic",
              "private_ip_address_version": "IPv4",
              "subnet_id": "/subscriptions/7ac7282e-c136-4f17-9ed8-96b5ec70822e/resourceGroups/infra-devops/providers/Microsoft.Network/virtualNetworks/infra-devops/subnets/infra-devops"
            }
          ],
          "location": "eastus2",
          "name": "internal-nic",
          "resource_group_name": "infra-devops",
          "tags": null,
          "timeouts": null
        },
        "after_unknown": {
          "applied_dns_servers": true,
          "dns_servers": true,
          "id": true,
          "internal_dns_name_label": true,
          "internal_domain_name_suffix": true,
          "ip_configuration": [
            {
              "gateway_load_balancer_frontend_ip_configuration_id": true,
              "primary": true,
              "private_ip_address": true,
              "public_ip_address_id": true
            }
          ],
          "mac_address": true,
          "private_ip_address": true,
          "private_ip_addresses": true,
          "virtual_machine_id": true
        },
        "before_sensitive": false,
        "after_sensitive": {
          "applied_dns_servers": [],
          "dns_servers": [],
          "ip_configuration": [
            {}
          ],
          "private_ip_addresses": []
        }
      }
    },
    {
      "address": "azurerm_public_ip.public-ip",
      "mode": "managed",
      "type": "azurerm_public_ip",
      "name": "public-ip",
      "provider_name": "registry.terraform.io/hashicorp/azurerm",
      "change": {
        "actions": [
          "create"
        ],
        "before": null,
        "after": {
          "allocation_method": "Static",
          "domain_name_label": "infra-devops",
          "idle_timeout_in_minutes": 4,
          "ip_tags": null,
          "ip_version": "IPv4",
          "location": "eastus2",
          "name": "public-ip-vmlinux",
          "public_ip_prefix_id": null,
          "resource_group_name": "infra-devops",
          "reverse_fqdn": null,
          "sku": "Basic",
          "sku_tier": "Regional",
          "tags": null,
          "timeouts": null
        },
        "after_unknown": {
          "availability_zone": true,
          "fqdn": true,
          "id": true,
          "ip_address": true,
          "zones": true
        },
        "before_sensitive": false,
        "after_sensitive": {
          "zones": []
        }
      }
    },
    {
      "address": "azurerm_virtual_machine_data_disk_attachment.disk-attachment",
      "mode": "managed",
      "type": "azurerm_virtual_machine_data_disk_attachment",
      "name": "disk-attachment",
      "provider_name": "registry.terraform.io/hashicorp/azurerm",
      "change": {
        "actions": [
          "create"
        ],
        "before": null,
        "after": {
          "caching": "ReadWrite",
          "create_option": "Attach",
          "lun": 1,
          "timeouts": null,
          "write_accelerator_enabled": false
        },
        "after_unknown": {
          "id": true,
          "managed_disk_id": true,
          "virtual_machine_id": true
        },
        "before_sensitive": false,
        "after_sensitive": {}
      }
    }
  ],
  "prior_state": {
    "format_version": "1.0",
    "terraform_version": "1.3.7",
    "values": {
      "root_module": {
        "resources": [
          {
            "address": "data.azurerm_resource_group.infra-devops",
            "mode": "data",
            "type": "azurerm_resource_group",
            "name": "infra-devops",
            "provider_name": "registry.terraform.io/hashicorp/azurerm",
            "schema_version": 0,
            "values": {
              "id": "/subscriptions/7ac7282e-c136-4f17-9ed8-96b5ec70822e/resourceGroups/infra-devops",
              "location": "eastus2",
              "name": "infra-devops",
              "tags": {},
              "timeouts": null
            },
            "sensitive_values": {
              "tags": {}
            }
          },
          {
            "address": "data.azurerm_subnet.infra-devops",
            "mode": "data",
            "type": "azurerm_subnet",
            "name": "infra-devops",
            "provider_name": "registry.terraform.io/hashicorp/azurerm",
            "schema_version": 0,
            "values": {
              "address_prefix": "192.168.0.0/24",
              "address_prefixes": [
                "192.168.0.0/24"
              ],
              "enforce_private_link_endpoint_network_policies": false,
              "enforce_private_link_service_network_policies": false,
              "id": "/subscriptions/7ac7282e-c136-4f17-9ed8-96b5ec70822e/resourceGroups/infra-devops/providers/Microsoft.Network/virtualNetworks/infra-devops/subnets/infra-devops",
              "name": "infra-devops",
              "network_security_group_id": "/subscriptions/7ac7282e-c136-4f17-9ed8-96b5ec70822e/resourceGroups/infra-devops/providers/Microsoft.Network/networkSecurityGroups/infra-devops",
              "resource_group_name": "infra-devops",
              "route_table_id": "",
              "service_endpoints": [
                "Microsoft.AzureActiveDirectory",
                "Microsoft.AzureCosmosDB",
                "Microsoft.ContainerRegistry",
                "Microsoft.EventHub",
                "Microsoft.KeyVault",
                "Microsoft.ServiceBus",
                "Microsoft.Sql",
                "Microsoft.Storage",
                "Microsoft.Web"
              ],
              "timeouts": null,
              "virtual_network_name": "infra-devops"
            },
            "sensitive_values": {
              "address_prefixes": [
                false
              ],
              "service_endpoints": [
                false,
                false,
                false,
                false,
                false,
                false,
                false,
                false,
                false
              ]
            }
          }
        ]
      }
    }
  },
  "configuration": {
    "provider_config": {
      "azurerm": {
        "name": "azurerm",
        "full_name": "registry.terraform.io/hashicorp/azurerm",
        "version_constraint": "~> 2.0",
        "expressions": {
          "features": [
            {}
          ]
        }
      }
    },
    "root_module": {
      "resources": [
        {
          "address": "azurerm_linux_virtual_machine.ubuntu-server",
          "mode": "managed",
          "type": "azurerm_linux_virtual_machine",
          "name": "ubuntu-server",
          "provider_config_key": "azurerm",
          "expressions": {
            "admin_password": {
              "references": [
                "var.admin_password"
              ]
            },
            "admin_username": {
              "references": [
                "var.admin_user"
              ]
            },
            "disable_password_authentication": {
              "constant_value": false
            },
            "location": {
              "references": [
                "data.azurerm_resource_group.infra-devops.location",
                "data.azurerm_resource_group.infra-devops"
              ]
            },
            "name": {
              "references": [
                "var.ubuntu_server"
              ]
            },
            "network_interface_ids": {
              "references": [
                "azurerm_network_interface.internal-nic.id",
                "azurerm_network_interface.internal-nic"
              ]
            },
            "os_disk": [
              {
                "caching": {
                  "constant_value": "ReadWrite"
                },
                "storage_account_type": {
                  "constant_value": "Standard_LRS"
                }
              }
            ],
            "provision_vm_agent": {
              "constant_value": true
            },
            "resource_group_name": {
              "references": [
                "data.azurerm_resource_group.infra-devops.name",
                "data.azurerm_resource_group.infra-devops"
              ]
            },
            "size": {
              "constant_value": "Standard_B2s"
            },
            "source_image_reference": [
              {
                "offer": {
                  "constant_value": "0001-com-ubuntu-server-jammy"
                },
                "publisher": {
                  "constant_value": "Canonical"
                },
                "sku": {
                  "constant_value": "22_04-lts"
                },
                "version": {
                  "constant_value": "latest"
                }
              }
            ]
          },
          "schema_version": 0
        },
        {
          "address": "azurerm_managed_disk.data-disk-managed",
          "mode": "managed",
          "type": "azurerm_managed_disk",
          "name": "data-disk-managed",
          "provider_config_key": "azurerm",
          "expressions": {
            "create_option": {
              "constant_value": "Empty"
            },
            "disk_size_gb": {
              "constant_value": 10
            },
            "location": {
              "references": [
                "data.azurerm_resource_group.infra-devops.location",
                "data.azurerm_resource_group.infra-devops"
              ]
            },
            "name": {
              "references": [
                "var.ubuntu_server"
              ]
            },
            "resource_group_name": {
              "references": [
                "data.azurerm_resource_group.infra-devops.name",
                "data.azurerm_resource_group.infra-devops"
              ]
            },
            "storage_account_type": {
              "constant_value": "Standard_LRS"
            }
          },
          "schema_version": 0
        },
        {
          "address": "azurerm_network_interface.internal-nic",
          "mode": "managed",
          "type": "azurerm_network_interface",
          "name": "internal-nic",
          "provider_config_key": "azurerm",
          "expressions": {
            "ip_configuration": [
              {
                "name": {
                  "constant_value": "internal"
                },
                "private_ip_address_allocation": {
                  "constant_value": "Dynamic"
                },
                "public_ip_address_id": {
                  "references": [
                    "azurerm_public_ip.public-ip.id",
                    "azurerm_public_ip.public-ip"
                  ]
                },
                "subnet_id": {
                  "references": [
                    "data.azurerm_subnet.infra-devops.id",
                    "data.azurerm_subnet.infra-devops"
                  ]
                }
              }
            ],
            "location": {
              "references": [
                "data.azurerm_resource_group.infra-devops.location",
                "data.azurerm_resource_group.infra-devops"
              ]
            },
            "name": {
              "references": [
                "var.internal_nic"
              ]
            },
            "resource_group_name": {
              "references": [
                "data.azurerm_resource_group.infra-devops.name",
                "data.azurerm_resource_group.infra-devops"
              ]
            }
          },
          "schema_version": 0
        },
        {
          "address": "azurerm_public_ip.public-ip",
          "mode": "managed",
          "type": "azurerm_public_ip",
          "name": "public-ip",
          "provider_config_key": "azurerm",
          "expressions": {
            "allocation_method": {
              "constant_value": "Static"
            },
            "domain_name_label": {
              "references": [
                "var.fqdn_domain"
              ]
            },
            "location": {
              "references": [
                "data.azurerm_resource_group.infra-devops.location",
                "data.azurerm_resource_group.infra-devops"
              ]
            },
            "name": {
              "references": [
                "var.public_ip"
              ]
            },
            "resource_group_name": {
              "references": [
                "data.azurerm_resource_group.infra-devops.name",
                "data.azurerm_resource_group.infra-devops"
              ]
            }
          },
          "schema_version": 0
        },
        {
          "address": "azurerm_virtual_machine_data_disk_attachment.disk-attachment",
          "mode": "managed",
          "type": "azurerm_virtual_machine_data_disk_attachment",
          "name": "disk-attachment",
          "provider_config_key": "azurerm",
          "expressions": {
            "caching": {
              "constant_value": "ReadWrite"
            },
            "lun": {
              "constant_value": "1"
            },
            "managed_disk_id": {
              "references": [
                "azurerm_managed_disk.data-disk-managed.id",
                "azurerm_managed_disk.data-disk-managed"
              ]
            },
            "virtual_machine_id": {
              "references": [
                "azurerm_linux_virtual_machine.ubuntu-server.id",
                "azurerm_linux_virtual_machine.ubuntu-server"
              ]
            }
          },
          "schema_version": 0
        },
        {
          "address": "data.azurerm_resource_group.infra-devops",
          "mode": "data",
          "type": "azurerm_resource_group",
          "name": "infra-devops",
          "provider_config_key": "azurerm",
          "expressions": {
            "name": {
              "references": [
                "var.infra_devops_name"
              ]
            }
          },
          "schema_version": 0
        },
        {
          "address": "data.azurerm_subnet.infra-devops",
          "mode": "data",
          "type": "azurerm_subnet",
          "name": "infra-devops",
          "provider_config_key": "azurerm",
          "expressions": {
            "name": {
              "references": [
                "var.infra_devops_name"
              ]
            },
            "resource_group_name": {
              "references": [
                "data.azurerm_resource_group.infra-devops.name",
                "data.azurerm_resource_group.infra-devops"
              ]
            },
            "virtual_network_name": {
              "references": [
                "var.infra_devops_name"
              ]
            }
          },
          "schema_version": 0
        }
      ],
      "variables": {
        "admin_password": {
          "default": "h4ck3rSA@191016ROOT!@#2023",
          "description": "Define a senha do usuário xcode.suporte"
        },
        "admin_user": {
          "default": "xcodeit.suporte",
          "description": "Define a senha do usuário xcode.suporte"
        },
        "fqdn_domain": {
          "default": "infra-devops",
          "description": "Define o domain label"
        },
        "infra_devops_name": {
          "default": "infra-devops",
          "description": "Armazena o string infra-devops para usar nos data sources"
        },
        "internal_nic": {
          "default": "internal-nic",
          "description": "Define o nome da interface de rede"
        },
        "public_ip": {
          "default": "public-ip-vmlinux",
          "description": "Define o nome do ip público"
        },
        "ubuntu_server": {
          "default": "ubuntu-server",
          "description": "Define o display name da VM"
        }
      }
    }
  },
  "relevant_attributes": [
    {
      "resource": "data.azurerm_resource_group.infra-devops",
      "attribute": [
        "name"
      ]
    },
    {
      "resource": "azurerm_public_ip.public-ip",
      "attribute": [
        "id"
      ]
    },
    {
      "resource": "data.azurerm_subnet.infra-devops",
      "attribute": [
        "id"
      ]
    },
    {
      "resource": "azurerm_network_interface.internal-nic",
      "attribute": [
        "id"
      ]
    },
    {
      "resource": "azurerm_managed_disk.data-disk-managed",
      "attribute": [
        "id"
      ]
    },
    {
      "resource": "azurerm_linux_virtual_machine.ubuntu-server",
      "attribute": [
        "id"
      ]
    },
    {
      "resource": "data.azurerm_resource_group.infra-devops",
      "attribute": [
        "location"
      ]
    }
  ]
}
