
PLAY [mountDiskData] *********************************************************************************************************************************************

TASK [Gathering Facts] *******************************************************************************************************************************************
ok: [20.122.142.152]

TASK [mountDiskData : Mount Disk Data] ***************************************************************************************************************************
included: /mnt/c/Users/vinicius.alcantara/Documents/projetoTerraform-MBA/ubuntuServerProvisione/dockerLatest/ansible/mountDiskData/roles/mountDiskData/tasks/mountDiskData.yml for 20.122.142.152

TASK [mountDiskData : Copy Script template] **********************************************************************************************************************
changed: [20.122.142.152]

TASK [mountDiskData : Exec Mount Disk Script] ********************************************************************************************************************
changed: [20.122.142.152]

TASK [mountDiskData : Remove Scripts Directory in VM Linux] ******************************************************************************************************
changed: [20.122.142.152]

PLAY RECAP *******************************************************************************************************************************************************
20.122.142.152             : ok=5    changed=3    unreachable=0    failed=0    skipped=0    rescued=0    ignored=0   

