item_id,item_type,item_name,det_target,det_competitor,option1,option2,option3,option4,mentioned_element,mentioned_file,unmentioned_element,unmentioned_file,picture1,picture2,picture3,picture4,question,question_file,answer_file,target_position,list,complete_answer,incomplete_answer,chunked_answer,expected_response,target,competitor,condition,DP,picture_target,picture_competitor,MT_target,MT_pic_left,MT_pic_right,block,trial_nr_in_block,group_type
111,critical,flamingo-turkey,der,der,narwhal,puma,Flamingo,Truthahn,flamingo,flamingo.jpg,turkey,turkey.jpg,images/narwhal.jpg,images/puma.jpg,images/flamingo.jpg,images/turkey.jpg,Ist das ein Bild von einem Flamingo?,q_r_flamingo.wav,r_e_truthahn.wav,3,2,Das ist eigentlich ein Bild von einem Truthahn.,Das ist eigentlich ein Bild von einem ...,Das ist | eigentlich ein Bild von | einem Truthahn.,Truthahn,Flamingo,Truthahn,reliable,actually,flamingo.jpg,turkey.jpg,flamingo.jpg,flamingo.jpg,turkey.jpg,1,1,reliable
245,filler,call-bell,NA,NA,skippingrope,cakeplatter,callbell,powerline,NA,NA,NA,NA,images/skippingrope.jpg,images/cakeplatter.jpg,images/callbell.jpg,images/powerline.jpg,Ist das eine Türglocke?,q_f_klingel.wav,f_klingel.wav,NA,8,"Nein, das ist eine Klingel.","Nein, das ist eine ...","Nein, | das ist | eine Klingel.",callbell,NA,NA,filler,NA,callbell.jpg,skippingrope.jpg,callbell.jpg,callbell.jpg,skippingrope.jpg,1,2,reliable
250,filler,beach-umbrella,NA,NA,muffintray01,beachumbrella01,boxtrailer,whiteout,NA,NA,NA,NA,images/muffintray01.jpg,images/beachumbrella01.jpg,images/boxtrailer.jpg,images/whiteout.jpg,Benutzt man das hier am Strand?,q_f_sonnenschirm.wav,f_sonnenschirm.wav,NA,9,"Ja, das ist ein Sonnenschirm.","Ja, das ist ein ...","Ja, | das ist | ein Sonnenschirm.",beachumbrella01,NA,NA,filler,NA,beachumbrella01.jpg,muffintray01.jpg,beachumbrella01.jpg,beachumbrella01.jpg,muffintray01.jpg,1,3,reliable
204,filler,ladybug,NA,NA,zebra,ostrich,ladybug03,sturgeon,NA,NA,NA,NA,images/zebra.jpg,images/ostrich.jpg,images/ladybug03.jpg,images/sturgeon.jpg,Magst du auch das Tier mit den schwarzen Punkten?,q_f_marienkaefer.wav,f_marienkaefer.wav,NA,1,"Ja, das ist ein sehr schöner Marienkäfer.","Ja, das ist ein sehr schöner ...","Ja, | das ist | ein sehr schöner Marienkäfer.",ladybug03,NA,NA,filler,NA,ladybug03.jpg,zebra.jpg,ladybug03.jpg,ladybug03.jpg,zebra.jpg,1,4,reliable
208,filler,clownfish,NA,NA,bassethound,americanwhitepelican,honeybee,clownfish,NA,NA,NA,NA,images/bassethound.jpg,images/americanwhitepelican.jpg,images/honeybee.jpg,images/clownfish.jpg,Wie heißt das orangene Tier?,q_f_clownfisch.wav,f_clownfisch.wav,NA,2,Das ist ein Clownfisch.,Das ist ein ...,Das ist | ein Clownfisch.,clownfish,NA,NA,filler,NA,clownfish.jpg,bassethound.jpg,clownfish.jpg,clownfish.jpg,bassethound.jpg,1,5,reliable
25,critical,bus-truck,der,der,birdnest,poolnet,Lastwagen,Bus,bus,bus.jpg,truck,boxtruck.jpg,images/birdnest.jpg,images/poolnet.jpg,images/boxtruck.jpg,images/bus.jpg,Ist das ein Bild von einem Bus?,q_r_bus.wav,r_t_bus.wav,1,3,Das ist tatsächlich ein Bild von einem Bus.,Das ist tatsächlich ein Bild von einem ...,Das ist | tatsächlich ein Bild von | einem Bus.,Bus,Bus,Lastwagen,reliable,indeed,bus.jpg,boxtruck.jpg,bus.jpg,bus.jpg,boxtruck.jpg,1,6,reliable
59,critical,wreath-hula-hoop,der,der,Kranz,Hula-hoop Reifen,keyhole,wetfloorsign,wreath,christmaswreath.jpg,hula-hoop,hulahoop.jpg,images/christmaswreath.jpg,images/hulahoop.jpg,images/keyhole.jpg,images/wetfloorsign.jpg,Ist das ein Bild von einem Kranz?,q_r_kranz.wav,r_t_kranz.wav,3,6,Das ist tatsächlich ein Bild von einem Kranz.,Das ist tatsächlich ein Bild von einem ...,Das ist | tatsächlich ein Bild von | einem Kranz.,Kranz,Kranz,Hula-hoop Reifen,reliable,indeed,christmaswreath.jpg,hulahoop.jpg,christmaswreath.jpg,christmaswreath.jpg,hulahoop.jpg,1,7,reliable
254,filler,windsurf-board,NA,NA,desktopcomputer,windsurfboard,canoepaddle02,loppingshears,NA,NA,NA,NA,images/desktopcomputer.jpg,images/windsurfboard.jpg,images/canoepaddle02.jpg,images/loppingshears.jpg,Ist das ein kleines Boot?,q_f_windsurfbrett.wav,f_windsurfbrett.wav,NA,9,"Nein, das ist ein Windsurfbrett.","Nein, das ist ein ...","Nein, | das ist | ein Windsurfbrett.",windsurfboard,NA,NA,filler,NA,windsurfboard.jpg,desktopcomputer.jpg,windsurfboard.jpg,windsurfboard.jpg,desktopcomputer.jpg,1,8,reliable
14,critical,monkey-gorilla,der,der,hammerheadshark,Gorilla,Affen,riverotter,monkey,macaque.jpg,gorilla,gorilla.jpg,images/hammerheadshark.jpg,images/gorilla.jpg,images/macaque.jpg,images/riverotter.jpg,Ist das ein Bild von einem Affen?,q_r_affe.wav,r_t_affe.wav,2,2,Das ist tatsächlich ein Bild von einem Affen.,Das ist tatsächlich ein Bild von einem ...,Das ist | tatsächlich ein Bild von | einem Affen.,Affen,Affen,Gorilla,reliable,indeed,macaque.jpg,gorilla.jpg,macaque.jpg,macaque.jpg,gorilla.jpg,1,9,reliable
151,critical,boat-ship,das,das,Boot,Schiff,puzzle,fern,boat,sailboat.jpg,ship,cruiseship.jpg,images/sailboat.jpg,images/cruiseship.jpg,images/puzzle.jpg,images/fern.jpg,Ist das ein Bild von einem Boot?,q_r_boot.wav,r_e_schiff.wav,3,6,Das ist eigentlich ein Bild von einem Schiff.,Das ist eigentlich ein Bild von einem ...,Das ist | eigentlich ein Bild von | einem Schiff.,Schiff,Boot,Schiff,reliable,actually,sailboat.jpg,cruiseship.jpg,sailboat.jpg,sailboat.jpg,cruiseship.jpg,1,10,reliable
228,filler,cello,NA,NA,towelrack,coffeemachine,cello,football,NA,NA,NA,NA,images/towelrack.jpg,images/coffeemachine.jpg,images/cello.jpg,images/football.jpg,Ist das eine Geige?,q_f_cello.wav,f_cello.wav,NA,5,"Nein, das hier ist größer. Das ist ein Cello.","Nein, das hier ist größer. Das ist ein ...","Nein, | das hier ist größer. | Das ist | ein Cello.",cello,NA,NA,filler,NA,cello.jpg,towelrack.jpg,cello.jpg,cello.jpg,towelrack.jpg,1,11,reliable
116,critical,duck-seagull,die,die,Ente,jellyfish,cobra,Seemöwe,duck,duck01.jpg,seagull,seagull.jpg,images/duck01.jpg,images/jellyfish.jpg,images/cobra.jpg,images/seagull.jpg,Ist das ein Bild von einer Ente?,q_r_ente.wav,r_e_seemoewe.wav,4,2,Das ist eigentlich ein Bild von einer Seemöwe.,Das ist eigentlich ein Bild von einer ...,Das ist | eigentlich ein Bild von | einer Seemöwe.,Seemöwe,Ente,Seemöwe,reliable,actually,duck01.jpg,seagull.jpg,duck01.jpg,duck01.jpg,seagull.jpg,1,12,reliable
235,filler,marble,NA,NA,watervalve,marble,lintroller,powerchair,NA,NA,NA,NA,images/waterwalve.jpg,images/marble.jpg,images/lintroller.jpg,images/powerchair.jpg,Magst du auch das blau und gelb gefärbte Ding?,q_f_murmel.wav,f_murmel.wav,NA,6,"Ja, das ist eine schöne Murmel.","Ja, das ist eine schöne ...","Ja, | das ist | eine schöne Murmel.",marble,NA,NA,filler,NA,marble.jpg,watervalve.jpg,marble.jpg,marble.jpg,watervalve.jpg,2,1,reliable
40,critical,tractor-tank,der,der,patioumbrella,Panzer,Traktor,foosballtable,tractor,tractor.jpg,tank,tank.jpg,images/patioumbrella.jpg,images/tank.jpg,images/tractor.jpg,images/foosballtable.jpg,Ist das ein Bild von einem Traktor?,q_r_traktor.wav,r_t_traktor.wav,4,4,Das ist tatsächlich ein Bild von einem Traktor.,Das ist tatsächlich ein Bild von einem ...,Das ist | tatsächlich ein Bild von | einem Traktor.,Traktor,Traktor,Panzer,reliable,indeed,tractor.jpg,tank.jpg,tractor.jpg,tractor.jpg,tank.jpg,2,2,reliable
31,critical,pot-mug,der,der,Becher,Topf,missile,gastank,pot,cookingpot.jpg,mug,mug05.jpg,images/mug05.jpg,images/cookingpot.jpg,images/missile.jpg,images/gastank.jpg,Ist das ein Bild von einem Topf?,q_r_topf.wav,r_t_topf.wav,3,4,Das ist tatsächlich ein Bild von einem Topf.,Das ist tatsächlich ein Bild von einem ...,Das ist | tatsächlich ein Bild von | einem Topf.,Topf,Topf,Becher,reliable,indeed,cookingpot.jpg,mug05.jpg,cookingpot.jpg,cookingpot.jpg,mug05.jpg,2,3,reliable
137,critical,corn-cork,der,der,weedwacker,parachute,Maiskolben,Korken,corn,corn02.jpg,cork,cork02.jpg,images/weedwacker.jpg,images/parachute.jpg,images/corn02.jpg,images/cork02.jpg,Ist das ein Bild von einem Maiskolben?,q_r_maiskolben.wav,r_e_korken.wav,1,4,Das ist eigentlich ein Bild von einem Korken.,Das ist eigentlich ein Bild von einem ...,Das ist | eigentlich ein Bild von | einem Korken.,Korken,Maiskolben,Korken,reliable,actually,corn02.jpg,cork02.jpg,corn02.jpg,corn02.jpg,cork02.jpg,2,4,reliable
105,critical,chicken-rooster,das,der,Hahn,Huhn,rockbass,killerwhale,chicken,hen.jpg,rooster,rooster.jpg,images/rooster.jpg,images/hen.jpg,images/rockbass.jpg,images/killerwhale.jpg,Ist das ein Bild von einem Huhn?,q_r_huhn.wav,r_e_hahn.wav,1,1,Das ist eigentlich ein Bild von einem Hahn.,Das ist eigentlich ein Bild von einem ...,Das ist | eigentlich ein Bild von | einem Hahn.,Hahn,Huhn,Hahn,reliable,actually,hen.jpg,rooster.jpg,hen.jpg,hen.jpg,rooster.jpg,2,5,reliable
233,filler,Rubiks-cube,NA,NA,dishrack,securitycamera,rubikcube,apron,NA,NA,NA,NA,images/dishrack.jpg,images/securitycamera.jpg,images/rubikcube.jpg,images/apron.jpg,Wie heißt das bunte Ding?,q_f_zauberwuerfel.wav,f_zauberwuerfel.wav,NA,6,Das ist ein Zauberwürfel.,Das ist ein ...,Das ist | ein Zauberwürfel.,rubikcube,NA,NA,filler,NA,rubikcube.jpg,dishrack.jpg,rubikcube.jpg,rubikcube.jpg,dishrack.jpg,2,6,reliable
207,filler,penguin,NA,NA,grasshopper,whitetiger,cow,penguin,NA,NA,NA,NA,images/grasshopper.jpg,images/whitetiger.jpg,images/cow.jpg,images/penguin.jpg,Ist das ein Pinguin?,q_f_pinguin.wav,f_pinguin.wav,NA,2,"Ja, das ist ein Pinguin.","Ja, das ist ein ...","Ja, | das ist | ein Pinguin.",penguin,NA,NA,filler,NA,penguin.jpg,grasshopper.jpg,penguin.jpg,penguin.jpg,grasshopper.jpg,2,7,reliable
60,critical,saxophone-cornet,das,das,revolver,Saxophon,Kornett,shower,saxophone,saxophone.jpg,cornet,cornet.jpg,images/revolver.jpg,images/saxophone.jpg,images/cornet.jpg,images/shower.jpg,Ist das ein Bild von einem Saxophon?,q_r_saxophon.wav,r_t_saxophon.wav,4,6,Das ist tatsächlich ein Bild von einem Saxophon.,Das ist tatsächlich ein Bild von einem ...,Das ist | tatsächlich ein Bild von | einem Saxophon.,Saxophon,Saxophon,Kornett,reliable,indeed,saxophone.jpg,cornet.jpg,saxophone.jpg,saxophone.jpg,cornet.jpg,2,8,reliable
252,filler,snowboard,NA,NA,spinningtoy,christmaslights,acousticguitar02,snowboard,NA,NA,NA,NA,images/spinningtoy.jpg,images/christmaslights.jpg,images/acousticguitar02.jpg,images/snowboard.jpg,Kann man hiermit im Schnee spielen?,q_f_snowboard.wav,f_snowboard.wav,NA,9,"Ja, das ist ein Snowboard.","Ja, das ist ein ...","Ja, | das ist | ein Snowboard.",snowboard,NA,NA,filler,NA,snowboard.jpg,spinningtoy.jpg,snowboard.jpg,snowboard.jpg,spinningtoy.jpg,2,9,reliable
241,filler,painting,NA,NA,entrancegate,cashregister01,exitsign,painting,NA,NA,NA,NA,images/entrancegate.jpg,images/cashregister01.jpg,images/exitsign.jpg,images/painting.jpg,Magst du auch das Ding mit der Blume?,q_f_gemaelde.wav,f_gemaelde.wav,NA,7,"Ja, das ist ein schönes Gemälde.","Ja, das ist ein schönes ...","Ja, | das ist | ein schönes Gemälde.",painting,NA,NA,filler,NA,painting.jpg,entrancegate.jpg,painting.jpg,painting.jpg,entrancegate.jpg,2,10,reliable
103,critical,ant-cockroach,die,die,hyena,antelope,Ameise,Kakerlake,ant,ant.jpg,cockroach,cockroach02.jpg,images/hyena.jpg,images/antelope.jpg,images/ant.jpg,images/cockroach02.jpg,Ist das ein Bild von einer Ameise?,q_r_ameise.wav,r_e_kakerlake.wav,3,1,Das ist eigentlich ein Bild von einer Kakerlake.,Das ist eigentlich ein Bild von einer ...,Das ist | eigentlich ein Bild von | einer Kakerlake.,Kakerlake,Ameise,Kakerlake,reliable,actually,ant.jpg,cockroach02.jpg,ant.jpg,ant.jpg,cockroach02.jpg,2,11,reliable
229,filler,lighthouse,NA,NA,lighthouse,barbecuelighter,lunchbag,bowtie,NA,NA,NA,NA,images/lighthouse.jpg,images/barbecuelighter.jpg,images/lunchbag.jpg,images/bowtie.jpg,"Ist das das große Ding, was wir am Strand gesehen haben?",q_f_leuchtturm.wav,f_leuchtturm.wav,NA,5,"Ja, das ist ein Leuchtturm.","Ja, das ist ein ...","Ja, | das ist | ein Leuchtturm.",lighthouse,NA,NA,filler,NA,lighthouse.jpg,lunchbag.jpg,lighthouse.jpg,lighthouse.jpg,lunchbag.jpg,2,12,reliable
139,critical,shovel-pickaxe,die,die,Spitzhacke,Schaufel,tabascosauce,masquerademask01,shovel,shovel01.jpg,pickaxe,pickaxe02.jpg,images/pickaxe02.jpg,images/shovel01.jpg,images/tabascosauce.jpg,images/masquerademask01.jpg,Ist das ein Bild von einer Schaufel?,q_r_schaufel.wav,r_e_spitzhacke.wav,3,4,Das ist eigentlich ein Bild von einer Spitzhacke.,Das ist eigentlich ein Bild von einer ...,Das ist | eigentlich ein Bild von | einer Spitzhacke.,Spitzhacke,Schaufel,Spitzhacke,reliable,actually,shovel01.jpg,pickaxe02.jpg,shovel01.jpg,shovel01.jpg,pickaxe02.jpg,3,1,reliable
219,filler,frisbee,NA,NA,ferry,trailer,frisbee,shipinabottle,NA,NA,NA,NA,images/ferry.jpg,images/trailer.jpg,images/frisbee.jpg,images/shipinabottle.jpg,"Wie heißt das gelbe Ding, was man werfen kann?",q_f_frisbee.wav,f_frisbee.wav,NA,4,Das ist eine Frisbee.,Das ist eine ...,Das ist | eine Frisbee.,frisbee,NA,NA,filler,NA,frisbee.jpg,ferry.jpg,frisbee.jpg,frisbee.jpg,ferry.jpg,3,2,reliable
221,filler,toilet-brush,NA,NA,outdoorfireplace,toiletbrush,strap,grill,NA,NA,NA,NA,images/outdoorfireplace.jpg,images/toiletbrush.jpg,images/strap.jpg,images/grill.jpg,Ist das große weiße Ding für die Toilette?,q_f_klobuerste.wav,f_klobuerste.wav,NA,4,"Ja, das ist eine Klobürste.","Ja, das ist eine ...","Ja, | das ist | eine Klobürste.",toiletbrush,NA,NA,filler,NA,toiletbrush.jpg,outdoorfireplace.jpg,toiletbrush.jpg,toiletbrush.jpg,outdoorfireplace.jpg,3,3,reliable
244,filler,delivery-truck,NA,NA,projectorscreen,microphone01,mailtruck,pitchfork,NA,NA,NA,NA,images/projectorscreen.jpg,images/microphone01.jpg,images/mailtruck.jpg,images/pitchfork.jpg,Ist das ein Lieferwagen?,q_f_lieferwagen.wav,f_lieferwagen.wav,NA,8,"Ja, das ist ein Lieferwagen.","Ja, das ist ein ...","Ja, | das ist | ein Lieferwagen.",mailtruck,NA,NA,filler,NA,mailtruck.jpg,projectorscreen.jpg,mailtruck.jpg,mailtruck.jpg,projectorscreen.jpg,3,4,reliable
47,critical,pinboard-calendar,die,die,Kalender,Pinnwand,cannon,electrictoothbrush01c,pinboard,corkboard.jpg,calendar,calendar.jpg,images/calendar.jpg,images/corkboard.jpg,images/cannon.jpg,images/electrictoothbrush01c.jpg,Ist das ein Bild von einer Pinnwand?,q_r_pinnwand.wav,r_t_pinnwand.wav,3,5,Das ist tatsächlich ein Bild von einer Pinnwand.,Das ist tatsächlich ein Bild von einer ...,Das ist | tatsächlich ein Bild von | einer Pinnwand.,Pinnwand,Pinnwand,Kalender,reliable,indeed,corkboard.jpg,calendar.jpg,corkboard.jpg,corkboard.jpg,calendar.jpg,3,5,reliable
257,filler,faucet,NA,NA,pin,steamroller,faucet,flowerwreath,NA,NA,NA,NA,images/pin.jpg,images/steamroller.jpg,images/faucet.jpg,images/flowerwreath.jpg,Ist das ein Spülbecken?,q_f_wasserhahn.wav,f_wasserhahn.wav,NA,10,"Nein, das ist ein Wasserhahn.","Nein, das ist ein ...","Nein, | das ist | ein Wasserhahn.",faucet,NA,NA,filler,NA,faucet.jpg,pin.jpg,faucet.jpg,faucet.jpg,pin.jpg,3,6,reliable
210,filler,proboscis-monkey,NA,NA,proboscismonkey,giraffe,monarchbutterfly,saintbernard,NA,NA,NA,NA,images/proboscismonkey.jpg,images/giraffe.jpg,images/monarchbutterfly.jpg,images/saintbernard.jpg,Findest du das Tier mit der dicken Nase auch lustig?,q_f_affe.wav,f_affe.wav,NA,2,"Ja, das ist ein lustiger Affee.","Ja, das ist ein lustiger ...","Ja, | das ist | ein lustiger Affee.",proboscismonkey,NA,NA,filler,NA,proboscismonkey.jpg,saintbernard.jpg,proboscismonkey.jpg,proboscismonkey.jpg,saintbernard.jpg,3,7,reliable
248,filler,waffle-maker,NA,NA,flower01,wafflemaker,scooter,chandelier,NA,NA,NA,NA,images/flower01.jpg,images/wafflemaker.jpg,images/scooter.jpg,images/chandelier.jpg,Benutzt man das hier um Waffeln zu machen?,q_f_waffeleisen.wav,f_waffeleisen.wav,NA,8,"Ja, das ist ein Waffeleisen.","Ja, das ist ein ...","Ja, | das ist | ein Waffeleisen.",wafflemaker,NA,NA,filler,NA,wafflemaker.jpg,flower01.jpg,wafflemaker.jpg,wafflemaker.jpg,flower01.jpg,3,8,reliable
113,critical,eagle-vulture,der,der,Geier,Adler,lynx01,bull,eagle,eagle.jpg,vulture,vulture.jpg,images/vulture.jpg,images/eagle.jpg,images/lynx01.jpg,images/bull.jpg,Ist das ein Bild von einem Adler?,q_r_adler.wav,r_e_geier.wav,1,2,Das ist eigentlich ein Bild von einem Geier.,Das ist eigentlich ein Bild von einem ...,Das ist | eigentlich ein Bild von | einem Geier.,Geier,Adler,Geier,reliable,actually,eagle.jpg,vulture.jpg,eagle.jpg,eagle.jpg,vulture.jpg,3,9,reliable
41,critical,tower-wind-turbine,der,das,martiniglass01b,gasburner,Windrad,Turm,tower,tower.jpg,wind-turbine,windturbine.jpg,images/martiniglass01b.jpg,images/gasburner.jpg,images/windturbine.jpg,images/tower.jpg,Ist das ein Bild von einem Turm?,q_r_turm.wav,r_t_turm.wav,1,5,Das ist tatsächlich ein Bild von einem Turm.,Das ist tatsächlich ein Bild von einem ...,Das ist | tatsächlich ein Bild von | einem Turm.,Turm,Turm,Windrad,reliable,indeed,tower.jpg,windturbine.jpg,tower.jpg,tower.jpg,windturbine.jpg,3,10,reliable
128,critical,donut-cupcake,der,der,plantpot,Donut,Muffin,well,donut,donut.jpg,cupcake,cupcake.jpg,images/plantpot.jpg,images/donut.jpg,images/cupcake.jpg,images/well.jpg,Ist das ein Bild von einem Donut?,q_r_donut.wav,r_e_muffin.wav,4,3,Das ist eigentlich ein Bild von einem Muffin.,Das ist eigentlich ein Bild von einem ...,Das ist | eigentlich ein Bild von | einem Muffin.,Muffin,Donut,Muffin,reliable,actually,donut.jpg,cupcake.jpg,donut.jpg,donut.jpg,cupcake.jpg,3,11,reliable
43,critical,toilet-sink,das,das,Klo,Waschbecken,pouch01b,gardenutilityvehicle,toilet,toilet.jpg,sink,sink.jpg,images/toilet.jpg,images/sink.jpg,images/pouch01b.jpg,images/gardenutilityvehicle.jpg,Ist das ein Bild von einem Klo?,q_r_klo.wav,r_t_klo.wav,3,5,Das ist tatsächlich ein Bild von einem Klo.,Das ist tatsächlich ein Bild von einem ...,Das ist | tatsächlich ein Bild von | einem Klo.,Klo,Klo,Waschbecken,reliable,indeed,toilet.jpg,sink.jpg,toilet.jpg,toilet.jpg,sink.jpg,3,12,reliable
238,filler,artichoke,NA,NA,artichoke01b,waterfountain02,pumpkin,atm,NA,NA,NA,NA,images/artichoke01b.jpg,images/waterfountain02.jpg,images/pumpkin.jpg,images/atm.jpg,Ist das eine Blume?,q_f_artischoke.wav,f_artischoke.wav,NA,7,"Nein, das ist eine Artischocke, man kann sie kochen.","Nein, das ist eine ..., man kann sie kochen.","Nein, | das ist | eine Artischocke, | man kann sie kochen.",artichoke01b,NA,NA,filler,NA,artichoke01b.jpg,pumpkin.jpg,artichoke01b.jpg,artichoke01b.jpg,pumpkin.jpg,4,1,reliable
155,critical,coat-rack-lamp,die,die,Gardarobe,Lampe,espressomachine,microwave,coat-rack,coatrack.jpg,lamp,floorlamp.jpg,images/coatrack.jpg,images/floorlamp.jpg,images/espressomachine.jpg,images/microwave.jpg,Ist das ein Bild von einer Gardarobe?,q_r_gadrobe.wav,r_e_lampe.wav,3,6,Das ist eigentlich ein Bild von einer Lampe.,Das ist eigentlich ein Bild von einer ...,Das ist | eigentlich ein Bild von | einer Lampe.,Lampe,Gardarobe,Lampe,reliable,actually,coatrack.jpg,floorlamp.jpg,coatrack.jpg,coatrack.jpg,floorlamp.jpg,4,2,reliable
223,filler,school-bus,NA,NA,bucket02,schoolbus,worldmap,cleaver02,NA,NA,NA,NA,images/bucket02.jpg,images/schoolbus.jpg,images/worldmap.jpg,images/cleaver02.jpg,Magst du auch das gelbe Ding?,q_f_schulbus.wav,f_schulbus.wav,NA,4,"Ja, das ist ein schöner Schulbus.","Ja, das ist ein schöner ...","Ja, | das ist | ein schöner Schulbus.",schoolbus,NA,NA,filler,NA,schoolbus.jpg,bucket02.jpg,schoolbus.jpg,schoolbus.jpg,bucket02.jpg,4,3,reliable
214,filler,nyala,NA,NA,heron01,nyala,stuffedpuffin,dalmatian,NA,NA,NA,NA,images/heron01.jpg,images/nyala.jpg,images/stuffedpuffin.jpg,images/dalmatian.jpg,Was ist das für ein Tier mit den langen Hörnern?,q_f_nyala.wav,f_nyala.wav,NA,3,Ich glaube das ist ein Nyala.,Ich glaube das ist ein ...,"Ich glaube, | das ist | ein Nyala.",nyala,NA,NA,filler,NA,nyala.jpg,heron01.jpg,nyala.jpg,nyala.jpg,heron01.jpg,4,4,reliable
56,critical,salt-shaker-showerhead,der,der,servingspoon01,Duschkopf,Salzstreuer,doorhandle,salt-shaker,saltshaker03a.jpg,showerhead,showerhead01.jpg,images/servingspoon01.jpg,images/showerhead01.jpg,images/saltshaker03a.jpg,images/doorhandle.jpg,Ist das ein Bild von einem Salzstreuer?,q_r_salzstreuer.wav,r_t_salzstreuer.wav,4,6,Das ist tatsächlich ein Bild von einem Salzstreuer.,Das ist tatsächlich ein Bild von einem ...,Das ist | tatsächlich ein Bild von | einem Salzstreuer.,Salzstreuer,Salzstreuer,Duschkopf,reliable,indeed,saltshaker03a.jpg,showerhead01.jpg,saltshaker03a.jpg,saltshaker03a.jpg,showerhead01.jpg,4,5,reliable
101,critical,wolf-dog,der,der,Wolf,Hund,holdfast,americangoldfinch,wolf,greywolf.jpg,dog,greyhound.jpg,images/greywolf.jpg,images/greyhound.jpg,images/holdfast.jpg,images/americangoldfinch.jpg,Ist das ein Bild von einem Wolf?,q_r_wolf.wav,r_e_hund.wav,1,1,Das ist eigentlich ein Bild von einem Hund.,Das ist eigentlich ein Bild von einem ...,Das ist | eigentlich ein Bild von | einem Hund.,Hund,Wolf,Hund,reliable,actually,greywolf.jpg,greyhound.jpg,greywolf.jpg,greywolf.jpg,greyhound.jpg,4,6,reliable
50,critical,tire-life-preserver,der,der,Reifen,mortarandpestle,shelf,Rettungsring,tire,tire.jpg,life-preserver,lifesaver.jpg,images/tire.jpg,images/mortarandpestle.jpg,images/shelf.jpg,images/lifesaver.jpg,Ist das ein Bild von einem Reifen?,q_r_reifen.wav,r_t_reifen.wav,2,5,Das ist tatsächlich ein Bild von einem Reifen.,Das ist tatsächlich ein Bild von einem ...,Das ist | tatsächlich ein Bild von | einem Reifen.,Reifen,Reifen,Rettungsring,reliable,indeed,tire.jpg,lifesaver.jpg,tire.jpg,tire.jpg,lifesaver.jpg,4,7,reliable
205,filler,platypus,NA,NA,cougar,platypus,greathornowl,crocodile,NA,NA,NA,NA,images/cougar.jpg,images/platypus.jpg,images/greathornowl.jpg,images/crocodile.jpg,Was ist das mit dem Schabel für ein Tier?,q_f_schnabeltier.wav,f_schnabeltier.wav,NA,1,Das ist ein Schnabeltier.,Das ist ein ...,Das ist | ein Schnabeltier.,platypus,NA,NA,filler,NA,platypus.jpg,cougar.jpg,platypus.jpg,platypus.jpg,cougar.jpg,4,8,reliable
104,critical,hippopotamus-rhinoceros,das,das,Nashorn,sealion,cedarwaxwing,Nilpferd,hippopotamus,hippopotamus.jpg,rhinoceros,rhinoceros02.jpg,images/rhinoceros02.jpg,images/sealion.jpg,images/cedarwaxwing.jpg,images/hippopotamus.jpg,Ist das ein Bild von einem Nilpferd?,q_r_nilpferd.wav,r_e_nashorn.wav,4,1,Das ist eigentlich ein Bild von einem Nashorn.,Das ist eigentlich ein Bild von einem ...,Das ist | eigentlich ein Bild von | einem Nashorn.,Nashorn,Nilpferd,Nashorn,reliable,actually,hippopotamus.jpg,rhinoceros02.jpg,hippopotamus.jpg,hippopotamus.jpg,rhinoceros02.jpg,4,9,reliable
225,filler,boxing-glove,NA,NA,pedestriancrossingsign,stovetop,hedgeshears,boxingglove01,NA,NA,NA,NA,images/pedestriancrossingsign.jpg,images/stovetop.jpg,images/hedgeshears.jpg,images/boxingglove01.jpg,Ist das etwas was man zum Kämpfen benutzt?,q_f_boxhandschuh.wav,f_boxhandschuh.wav,NA,5,"Ja, das ist ein Boxhandschuh.","Ja, das ist ein ?","Ja, | das ist | ein Boxhandschuh.",boxingglove01,NA,NA,filler,NA,boxingglove01.jpg,pedestriancrossingsign.jpg,boxingglove01.jpg,boxingglove01.jpg,pedestriancrossingsign.jpg,4,10,reliable
19,critical,Shrimp-lobster,die,die,canadiangoose,toad,Garnele,Languste,shrimp,shrimp.jpg,lobster,rocklobster.jpg,images/canadiangoose.jpg,images/toad.jpg,images/shrimp.jpg,images/rocklobster.jpg,Ist das ein Bild von einer Garnele ?,q_r_garnelle.wav,r_t_garnele.wav,3,2,Das ist tatsächlich ein Bild von einer Garnele.,Das ist tatsächlich ein Bild von einer ...,Das ist | tatsächlich ein Bild von | einer Garnele.,Garnele,Garnele,Languste,reliable,indeed,shrimp.jpg,rocklobster.jpg,shrimp.jpg,shrimp.jpg,rocklobster.jpg,4,11,reliable
216,filler,pirate-flag,NA,NA,trumpet,rose,pirateflag,chefshat,NA,NA,NA,NA,images/trumpet.jpg,images/rose.jpg,images/pirateflag.jpg,images/chefshat.jpg,Findest du das Ding mit dem Totenkopf auch gruselig?,q_f_piratenflagge.wav,f_piratenflagge.wav,NA,3,"Ja, die Piratenflagge ist ein bisschen gruselig.","Ja, die ... ist ein bisschen gruselig.","Ja, | die Piratenflagge ist | ein bisschen gruselig.",pirateflag,NA,NA,filler,NA,pirateflag.jpg,trumpet.jpg,pirateflag.jpg,pirateflag.jpg,trumpet.jpg,4,12,reliable
124,critical,bicycle-motorbike,das,das,bookshelf,Motorrad,Fahrrad,totempole,bicycle,bicycle.jpg,motorbike,motorcycle.jpg,images/bookshelf.jpg,images/motorcycle.jpg,images/bicycle.jpg,images/totempole.jpg,Ist das ein Bild von einem Fahrrad?,q_r_fahrrad.wav,r_e_motorrad.wav,4,3,Das ist eigentlich ein Bild von einem Motorrad.,Das ist eigentlich ein Bild von einem ...,Das ist | eigentlich ein Bild von | einem Motorrad.,Motorrad,Fahrrad,Motorrad,reliable,actually,bicycle.jpg,motorcycle.jpg,bicycle.jpg,bicycle.jpg,motorcycle.jpg,5,2,reliable
135,critical,knife-sword,das,das,Messer,Schwert,candelabra,bikewheel,knife,knife03.jpg,sword,sword01.jpg,images/knife03.jpg,images/sword01.jpg,images/candelabra.jpg,images/bikewheel.jpg,Ist das ein Bild von einem Messer?,q_r_messer.wav,r_e_schwert.wav,3,4,Das ist eigentlich ein Bild von einem Schwert.,Das ist eigentlich ein Bild von einem ...,Das ist | eigentlich ein Bild von | einem Schwert.,Schwert,Messer,Schwert,reliable,actually,knife03.jpg,sword01.jpg,knife03.jpg,knife03.jpg,sword01.jpg,5,3,reliable
251,filler,locomotive,NA,NA,golfbag,bathtub,locomotive,fluorescentlightbulb,NA,NA,NA,NA,images/golfbag.jpg,images/bathtub.jpg,images/locomotive.jpg,images/fluorescentlightbulb.jpg,Magst du auch den Zug?,q_f_lokomotive.wav,f_lokomotive.wav,NA,9,"Ja, das ist eine schöne Lokomotive.","Ja, das ist eine schöne ...","Ja, | das ist | eine schöne Lokomotive.",locomotive,NA,NA,filler,NA,locomotive.jpg,golfbag.jpg,locomotive.jpg,locomotive.jpg,golfbag.jpg,5,4,reliable
158,critical,cable-hose,das,der,Kabel,diploma01,clover,Schlauch,cable,usbcable01a.jpg,hose,hose.jpg,images/usbcable01a.jpg,images/diploma01.jpg,images/clover.jpg,images/hose.jpg,Ist das ein Bild von einem Kabel?,q_r_kabel1.wav,r_e_schlauch.wav,2,6,Das ist eigentlich ein Bild von einem Schlauch.,Das ist eigentlich ein Bild von einem ...,Das ist | eigentlich ein Bild von | einem Schlauch.,Schlauch,Kabel,Schlauch,reliable,actually,usbcable01a.jpg,hose.jpg,usbcable01a.jpg,usbcable01a.jpg,hose.jpg,5,5,reliable
49,critical,wheel-steering-wheel,das,das,watercolorpaintset,scanner,Lenkrad,Rad,wheel,wheel04.jpg,steering-wheel,steeringwheel.jpg,images/watercolorpaintset.jpg,images/scanner.jpg,images/steeringwheel.jpg,images/wheel04.jpg,Ist das ein Bild von einem Rad?,q_r_rad.wav,r_t_rad.wav,1,5,Das ist tatsächlich ein Bild von einem Rad.,Das ist tatsächlich ein Bild von einem ...,Das ist | tatsächlich ein Bild von | einem Rad.,Rad,Rad,Lenkrad,reliable,indeed,wheel04.jpg,steeringwheel.jpg,wheel04.jpg,wheel04.jpg,steeringwheel.jpg,5,6,reliable
215,filler,horseshoe-crab,NA,NA,butterfly,horseshoecrab,porcupine,slug,NA,NA,NA,NA,images/butterfly.jpg,images/horseshoecrab.jpg,images/porcupine.jpg,images/slug.jpg,Ist das ein Stachelrochen?,q_f_pfeilschwanzkrebs.wav,f_pfeilschwanzkrebs.wav,NA,3,"Nein, das ist ein Pfeilschwanzkrebs, der hat eine harte Schale.","Nein, das ist ein ..., der hat eine harte Schale.","Nein, | das ist | ein Pfeilschwanzkrebs, | der hat | eine harte Schale.",horseshoecrab,NA,NA,filler,NA,horseshoecrab.jpg,butterfly.jpg,horseshoecrab.jpg,horseshoecrab.jpg,butterfly.jpg,5,7,reliable
226,filler,office-chair,NA,NA,diploma02,gravyboat,crosscountryski,officechair03,NA,NA,NA,NA,images/diploma02.jpg,images/gravyboat.jpg,images/crosscountryski.jpg,images/officechair03.jpg,"Findest du auch, dass das Schwarze gemütlich aussieht?",q_f_stuhl.wav,f_stuhl.wav,NA,5,"Ja, der Stuhl sieht sehr gemütlich aus.","Ja, der ... sieht sehr gemütlich aus.","Ja, | der Stuhl sieht | sehr gemütlich aus.",officechair03,NA,NA,filler,NA,officechair03.jpg,diploma02.jpg,officechair03.jpg,officechair03.jpg,diploma02.jpg,5,8,reliable
211,filler,peacock,NA,NA,seaturtle,pugdog,peacock,swallow,NA,NA,NA,NA,images/seaturtle.jpg,images/pugdog.jpg,images/peacock.jpg,images/swallow.jpg,Wie heißt das bunte Tier?,q_f_pfau.wav,f_pfau.wav,NA,2,Das ist ein Pfau.,Das ist ein ...,Das ist | ein Pfau.,peacock,NA,NA,filler,NA,peacock.jpg,seaturtle.jpg,peacock.jpg,peacock.jpg,seaturtle.jpg,5,9,reliable
253,filler,pipe-wrench,NA,NA,jeep,pipewrench,flugglehorn,portapotty,NA,NA,NA,NA,images/jeep.jpg,images/pipewrench.jpg,images/flugglehorn.jpg,images/portapotty.jpg,Wie heißt das rote Ding?,q_f_rohrzange.wav,f_rohrzange.wav,NA,9,Das nennt sich Rohrzange.,Das nennt sich ...,Das nennt sich | Rohrzange.,pipewrench,NA,NA,filler,NA,pipewrench.jpg,jeep.jpg,pipewrench.jpg,pipewrench.jpg,jeep.jpg,5,10,reliable
220,filler,cactus,NA,NA,safetyglasses,locker,cactus,soccercleat01,NA,NA,NA,NA,images/safetyglasses.jpg,images/locker.jpg,images/cactus.jpg,images/soccercleat01.jpg,"Findest du nicht, dass dieses hier stachelig ist?",q_f_kakteen.wav,f_kakteen.wav,NA,4,"Ja, Kakteen sind meistens sehr stachelig.","Ja, ... sind meistens sehr stachelig.","Ja, | Kakteen sind meistens | sehr stachelig.",cactus,NA,NA,filler,NA,cactus.jpg,safetyglasses.jpg,cactus.jpg,cactus.jpg,safetyglasses.jpg,5,11,reliable
57,critical,trombone-tuba,die,die,townsquarepostclock,electricoutlet,Tuba,Posaune,trombone,trombone.jpg,tuba,tuba.jpg,images/townsquarepostclock.jpg,images/electricoutlet.jpg,images/tuba.jpg,images/trombone.jpg,Ist das ein Bild von einer Posaune?,q_r_posaune.wav,r_t_posaune.wav,1,6,Das ist tatsächlich ein Bild von einer Posaune.,Das ist tatsächlich ein Bild von einer ...,Das ist | tatsächlich ein Bild von | einer Posaune.,Posaune,Posaune,Tuba,reliable,indeed,trombone.jpg,tuba.jpg,trombone.jpg,trombone.jpg,tuba.jpg,5,12,reliable
130,critical,bed-couch,das,das,Sofa,chair,toyfiretruck,Bett,bed,bed.jpg,couch,couch02.jpg,images/couch02.jpg,images/chair.jpg,images/toyfiretruck.jpg,images/bed.jpg,Ist das ein Bild von einem Bett?,q_r_bett.wav,r_e_sofa.wav,2,3,Das ist eigentlich ein Bild von einem Sofa.,Das ist eigentlich ein Bild von einem ...,Das ist | eigentlich ein Bild von | einem Sofa.,Sofa,Bett,Sofa,reliable,actually,bed.jpg,couch02.jpg,bed.jpg,bed.jpg,couch02.jpg,6,1,reliable
18,critical,squirrel-skunk,das,das,bison,Eichhörnchen,Stinktier,jaguar,squirrel,squirrel.jpg,skunk,skunk.jpg,images/bison.jpg,images/squirrel.jpg,images/skunk.jpg,images/jaguar.jpg,Ist das ein Bild von einem Eichhörnchen?,q_r_eichhoernchen.wav,r_t_eichhoernchen.wav,2,2,Das ist tatsächlich ein Bild von einem Eichhörnchen.,Das ist tatsächlich ein Bild von einem ...,Das ist | tatsächlich ein Bild von | einem Eichhörnchen.,Eichhörnchen,Eichhörnchen,Stinktier,reliable,indeed,squirrel.jpg,skunk.jpg,squirrel.jpg,squirrel.jpg,skunk.jpg,6,2,reliable
203,filler,moose,NA,NA,pigeon,swordfish,muskox,moose,NA,NA,NA,NA,images/pigeon.jpg,images/swordfish.jpg,images/muskox.jpg,images/moose.jpg,Ist das ein Pferd?,q_f_elch.wav,f_elch.wav,NA,1,"Nein, das ist eine Elch.","Nein, das ist eine ...","Nein, | das ist | eine Elch.",moose,NA,NA,filler,NA,moose.jpg,pigeon.jpg,moose.jpg,moose.jpg,pigeon.jpg,6,3,reliable
36,critical,hat-hard-hat,der,der,radiator,Hut,Schutzhelm,arrow02,hat,witchhat.jpg,hard-hat,hardhat02.jpg,images/radiator.jpg,images/witchhat.jpg,images/hardhat02.jpg,images/arrow02.jpg,Ist das ein Bild von einem Hut?,q_r_hut.wav,r_t_hut.wav,4,4,Das ist tatsächlich ein Bild von einem Hut.,Das ist tatsächlich ein Bild von einem ...,Das ist | tatsächlich ein Bild von | einem Hut.,Hut,Hut,Schutzhelm,reliable,indeed,witchhat.jpg,hardhat02.jpg,witchhat.jpg,witchhat.jpg,hardhat02.jpg,6,4,reliable
202,filler,cuttlefish,NA,NA,grizzly,cuttlefish,kingfisher,mouse,NA,NA,NA,NA,images/grizzly.jpg,images/cuttlefish.jpg,images/kingfisher.jpg,images/mouse.jpg,Was ist das für ein Tier mit dem seltsamen Kopf?,q_f_tintenfisch.wav,f_tintenfisch.wav,NA,1,Das ist ein Tintenfisch.,Das ist ein ...,Das ist | ein Tintenfisch.,cuttlefish,NA,NA,filler,NA,cuttlefish.jpg,grizzly.jpg,cuttlefish.jpg,cuttlefish.jpg,grizzly.jpg,6,5,reliable
217,filler,do-not-walk-sign,NA,NA,cartonofeggs,donotwalksign,key07,shoppingcart,NA,NA,NA,NA,images/cartonofeggs.jpg,images/donotwalksign.jpg,images/key07.jpg,images/shoppingcart.jpg,"Bedeutet dieses Zeichen, dass man nicht gehen darf?",q_f_zeichen.wav,f_zeichen.wav,NA,3,"Ja, dieses Zeichen bedeutet, dass man warten soll.","Ja, dieses ... bedeutet, dass man warten soll.","Ja, | dieses Zeichen bedeutet, | dass man warten soll.",donotwalksign,NA,NA,filler,NA,donotwalksign.jpg,cartonofeggs.jpg,donotwalksign.jpg,donotwalksign.jpg,cartonofeggs.jpg,6,6,reliable
258,filler,gift,NA,NA,ironingboard01,chest01,patiochair,gift01,NA,NA,NA,NA,images/ironingboard01.jpg,images/chest01.jpg,images/patiochair.jpg,images/gift01.jpg,Magst du auch das bunte Ding?,q_f_geschenk.wav,f_geschenk.wav,NA,10,"Ja, das ist ein schönes Geschenk.","Ja, das ist ein schönes ...","Ja, | das ist | ein schönes Geschenk.",gift01,NA,NA,filler,NA,gift01.jpg,ironingboard01.jpg,gift01.jpg,gift01.jpg,ironingboard01.jpg,6,7,reliable
145,critical,bolt-bullet,die,die,waterlily,lantern03,Schraube,Gewehrkugel,bolt,bolt01a.jpg,bullet,bullet.jpg,images/waterlily.jpg,images/lantern03.jpg,images/bolt01a.jpg,images/bullet.jpg,Ist das ein Bild von einer Schraube?,q_r_schraube.wav,r_e_gewehrkugel.wav,1,5,Das ist eigentlich ein Bild von einer Gewehrkugel.,Das ist eigentlich ein Bild von einer ...,Das ist | eigentlich ein Bild von | einer Gewehrkugel.,Gewehrkugel,Schraube,Gewehrkugel,reliable,actually,bolt01a.jpg,bullet.jpg,bolt01a.jpg,bolt01a.jpg,bullet.jpg,6,8,reliable
255,filler,trophy,NA,NA,picnictable,nametag01a,trophy01,linedpaper,NA,NA,NA,NA,images/picnictable.jpg,images/nametag01a.jpg,images/trophy01.jpg,images/linedpaper.jpg,Magst du auch das sehr glänzende Ding?,q_f_trophaee.wav,f_trophaee.wav,NA,10,"Ja, das ist eine sehr glänzende Trophäe.","Ja, das ist eine sehr glänzende ...","Ja, | das ist | eine sehr glänzende Trophäe.",trophy01,NA,NA,filler,NA,trophy01.jpg,picnictable.jpg,trophy01.jpg,trophy01.jpg,picnictable.jpg,6,9,reliable
38,critical,pants-shorts,die,die,Badehose,bikepump01,jellybean,Jeans,pants,jeans01.jpg,shorts,swimsuit.jpg,images/swimsuit.jpg,images/bikepump01.jpg,images/jellybean.jpg,images/jeans01.jpg,Ist das ein Bild von einer Jeans?,q_r_jeans.wav,r_t_jeans.wav,2,4,Das ist tatsächlich ein Bild von einer Jeans.,Das ist tatsächlich ein Bild von einer ...,Das ist | tatsächlich ein Bild von | einer Jeans.,Jeans,Jeans,Badehose,reliable,indeed,jeans01.jpg,swimsuit.jpg,jeans01.jpg,jeans01.jpg,swimsuit.jpg,6,10,reliable
213,filler,beluga-whale,NA,NA,barnowl,tarantula,siamesecat,belugawhale,NA,NA,NA,NA,images/barnowl.jpg,images/tarantula.jpg,images/siamesecat.jpg,images/belugawhale.jpg,Magst du auch das weiße Tier?,q_f_suesserwal.wav,f_suesserwal.wav,NA,3,"Ja, das ist ein süßer Waal.","Ja, das ist ein süßer ...","Ja, | das ist | ein süßer Waal.",belugawhale,NA,NA,filler,NA,belugawhale.jpg,barnowl.jpg,belugawhale.jpg,belugawhale.jpg,barnowl.jpg,6,11,reliable
126,critical,basketball-volleyball,der,der,Basketball,skipole,bowlingpin,Volleyball,basketball,basketball01.jpg,volleyball,volleyball.jpg,images/basketball01.jpg,images/skipole.jpg,images/bowlingpin.jpg,images/volleyball.jpg,Ist das ein Bild von einem Basketball?,q_r_basketball.wav,r_e_volleyball.wav,2,3,Das ist eigentlich ein Bild von einem Volleyball.,Das ist eigentlich ein Bild von einem ...,Das ist | eigentlich ein Bild von | einem Volleyball.,Volleyball,Basketball,Volleyball,reliable,actually,basketball01.jpg,volleyball.jpg,basketball01.jpg,basketball01.jpg,volleyball.jpg,6,12,reliable
218,filler,tricycle,NA,NA,rockinghorse,castletower,drinkshaker,tricycle,NA,NA,NA,NA,images/rockinghorse.jpg,images/castletower.jpg,images/drinkshaker.jpg,images/tricycle.jpg,Wie heißt das Ding mit den drei Rädern?,q_f_dreirad.wav,f_dreirad.wav,NA,3,Das ist ein Dreirad.,Das ist ein ...,Das ist | ein Dreirad.,tricycle,NA,NA,filler,NA,tricycle.jpg,rockinghorse.jpg,tricycle.jpg,tricycle.jpg,rockinghorse.jpg,7,1,reliable
249,filler,rake,NA,NA,dresser02,busshelter,bowrake,megaphone,NA,NA,NA,NA,images/dresser02.jpg,images/busshelter.jpg,images/bowrake.jpg,images/megaphone.jpg,Benutzt man das hier für Blätter?,q_f_harke.wav,f_harke.wav,NA,9,"Ja, das nennt sich Harke.","Ja, das nennt sich ...","Ja, | das nennt sich | Harke.",bowrake,NA,NA,filler,NA,bowrake.jpg,dresser02.jpg,bowrake.jpg,bowrake.jpg,dresser02.jpg,7,2,reliable
201,filler,redlion-fish,NA,NA,owl,badger,kangaroo,redlionfish,NA,NA,NA,NA,images/owl.jpg,images/badger.jpg,images/kangaroo.jpg,images/redlionfish.jpg,Magst du auch das rote Tier?,q_f_fisch.wav,f_fisch.wav,NA,1,"Ja, das ist ein sehr schöner Fisch.","Ja, das ist ein sehr schöner ...","Ja, | das ist | ein sehr schöner Fisch.",redlionfish,NA,NA,filler,NA,redlionfish.jpg,owl.jpg,redlionfish.jpg,redlionfish.jpg,owl.jpg,7,3,reliable
152,critical,snow-shovel-rake,die,die,tie02,Schneeschippe,Harke,amphora,snow-shovel,snowshovel.jpg,rake,leafrake.jpg,images/tie02.jpg,images/snowshovel.jpg,images/leafrake.jpg,images/amphora.jpg,Ist das ein Bild von einer Schneeschippe?,q_r_schneeschippe.wav,r_e_harke.wav,4,6,Das ist eigentlich ein Bild von einer Harke.,Das ist eigentlich ein Bild von einer ...,Das ist | eigentlich ein Bild von | einer Harke.,Harke,Schneeschippe,Harke,reliable,actually,snowshovel.jpg,leafrake.jpg,snowshovel.jpg,snowshovel.jpg,leafrake.jpg,7,4,reliable
234,filler,daffodil,NA,NA,lilypad,fighterjet,stubbywrench01a,daffodil,NA,NA,NA,NA,images/lilypad.jpg,images/fighterjet.jpg,images/stubbywrench01a.jpg,images/daffodil.jpg,Magst du auch das gelbe Ding?,q_f_narzisse.wav,f_narzisse.wav,NA,6,"Ja, das ist eine schöne Narzisse.","Ja, das ist eine schöne ...","Ja, | das ist | eine schöne Narzisse.",daffodil,NA,NA,filler,NA,daffodil.jpg,lilypad.jpg,daffodil.jpg,daffodil.jpg,lilypad.jpg,7,5,reliable
227,filler,cement-truck,NA,NA,cementtruck,angelstatue,airconditioner,woodencrate01,NA,NA,NA,NA,images/cementtruck.jpg,images/angelstatue.jpg,images/airconditioner.jpg,images/woodencrate01.jpg,Transportiert das hier Wasser?,q_f_zement.wav,f_zement.wav,NA,5,"Nein, das transportiert Zement.","Nein, das transportiert ...","Nein, | das transportiert | Zement.",cementtruck,NA,NA,filler,NA,cementtruck.jpg,woodencrate01.jpg,cementtruck.jpg,cementtruck.jpg,woodencrate01.jpg,7,6,reliable
209,filler,whale,NA,NA,whaleshark,caribou,asianelephant,scorpion,NA,NA,NA,NA,images/whaleshark.jpg,images/caribou02.jpg,images/asianelephant.jpg,images/scorpion.jpg,Ist das ein Fisch?,q_f_wal.wav,f_wal.wav,NA,2,"Nein, das ist ein Waal.","Nein, das ist ein ...","Nein, | das ist | ein Waal.",whaleshark,NA,NA,filler,NA,whaleshark.jpg,asianelephant.jpg,whaleshark.jpg,whaleshark.jpg,asianelephant.jpg,7,7,reliable
34,critical,boot-rollerblade,der,der,Gummistiefel,triangle,filingcabinet,Inlineskate,boot,rainboot.jpg,rollerblade,rollerblade.jpg,images/rainboot.jpg,images/triangle.jpg,images/filingcabinet.jpg,images/rollerblade.jpg,Ist das ein Bild von einem Gummistiefel?,q_r_gummistiefel.wav,r_t_gummistiefel.wav,2,4,Das ist tatsächlich ein Bild von einem Gummistiefel.,Das ist tatsächlich ein Bild von einem ...,Das ist | tatsächlich ein Bild von | einem Gummistiefel.,Gummistiefel,Gummistiefel,Inlineskate,reliable,indeed,rainboot.jpg,rollerblade.jpg,rainboot.jpg,rainboot.jpg,rollerblade.jpg,7,8,reliable
109,critical,fox-raccoon,der,der,Fuchs,Waschbär,seal,falcon,fox,redfox.jpg,raccoon,raccoon.jpg,images/redfox.jpg,images/raccoon.jpg,images/seal.jpg,images/falcon.jpg,Ist das ein Bild von einem Fuchs?,q_r_fuchs.wav,r_e_waschbaer.wav,1,1,Das ist eigentlich ein Bild von einem Waschbär.,Das ist eigentlich ein Bild von einem ...,Das ist | eigentlich ein Bild von | einem Waschbär.,Waschbär,Fuchs,Waschbär,reliable,actually,redfox.jpg,raccoon.jpg,redfox.jpg,redfox.jpg,raccoon.jpg,7,9,reliable
12,critical,shark-dolphin,der,der,Delphin,squid,cardinal,Hai,shark,sandbarshark.jpg,dolphin,dolphin01.jpg,images/dolphin01.jpg,images/squid.jpg,images/cardinal.jpg,images/sandbarshark.jpg,Ist das ein Bild von einem Hai?,q_r_hai.wav,r_t_hai.wav,4,2,Das ist tatsächlich ein Bild von einem Hai.,Das ist tatsächlich ein Bild von einem ...,Das ist | tatsächlich ein Bild von | einem Hai.,Hai,Hai,Delphin,reliable,indeed,sandbarshark.jpg,dolphin01.jpg,sandbarshark.jpg,sandbarshark.jpg,dolphin01.jpg,7,10,reliable
115,critical,parrot-toucan,der,der,chipmunk,greatwhiteshark,Tukan,Papagei,parrot,parrot01.jpg,toucan,toucan.jpg,images/chipmunk.jpg,images/greatwhiteshark.jpg,images/toucan.jpg,images/parrot01.jpg,Ist das ein Bild von einem Papagei?,q_r_papagei.wav,r_e_tucan.wav,3,2,Das ist eigentlich ein Bild von einem Tukan.,Das ist eigentlich ein Bild von einem ...,Das ist | eigentlich ein Bild von | einem Tukan.,Tukan,Papagei,Tukan,reliable,actually,parrot01.jpg,toucan.jpg,parrot01.jpg,parrot01.jpg,toucan.jpg,7,11,reliable
2,critical,crab-spider,die,die,tern,Krabbe,Spinne,lizard,crab,crab01.jpg,spider,daddylonglegs.jpg,images/tern.jpg,images/crab01.jpg,images/daddylonglegs.jpg,images/lizard.jpg,Ist das ein Bild von einer Krabbe?,q_r_krabbe.wav,r_t_krabbe.wav,2,1,Das ist tatsächlich ein Bild von einer Krabbe.,Das ist tatsächlich ein Bild von einer ...,Das ist | tatsächlich ein Bild von | einer Krabbe.,Krabbe,Krabbe,Spinne,reliable,indeed,crab01.jpg,daddylonglegs.jpg,crab01.jpg,crab01.jpg,daddylonglegs.jpg,7,12,reliable
231,filler,swiss-army-knife,NA,NA,litterbox,swissarmyknife01a,rockingchair,wheat,NA,NA,NA,NA,images/litterbox.jpg,images/swissarmyknife01a.jpg,images/rockingchair.jpg,images/wheat.jpg,Ist das ein Messer?,q_f_taschenmesser.wav,f_schweizertaschenmesser.wav,NA,6,"Ja, das ist ein schweizer Taschenmesser.","Ja, das ist ein schweizer ...","Ja, | das ist | ein schweizer Taschenmesser.",swissarmyknife01a,NA,NA,filler,NA,swissarmyknife01a.jpg,litterbox.jpg,swissarmyknife01a.jpg,swissarmyknife01a.jpg,litterbox.jpg,8,1,reliable
142,critical,chair-stool,der,der,Klappstuhl,accordion01,skihelmet01,Hocker,chair,foldingchair.jpg,stool,stool01.jpg,images/foldingchair.jpg,images/accordion01.jpg,images/skihelmet01.jpg,images/stool01.jpg,Ist das ein Bild von einem Klappstuhl?,q_r_klappstuhl.wav,r_e_hocker.wav,2,5,Das ist eigentlich ein Bild von einem Hocker.,Das ist eigentlich ein Bild von einem ...,Das ist | eigentlich ein Bild von | einem Hocker.,Hocker,Klappstuhl,Hocker,reliable,actually,foldingchair.jpg,stool01.jpg,foldingchair.jpg,foldingchair.jpg,stool01.jpg,8,2,reliable
240,filler,vacuum-cleaner,NA,NA,vacuumcleaner01,flipflop01b,curtain,drumset,NA,NA,NA,NA,images/vacuumcleaner01.jpg,images/flipflop01b.jpg,images/curtain.jpg,images/drumset.jpg,Macht man hiermit den Boden sauber?,q_f_staubsauger.wav,f_staubsauger.wav,NA,7,"Ja, das ist ein Staubsauger.","Ja, das ist ein ...","Ja, | das ist | ein Staubsauger.",vacuumcleaner01,NA,NA,filler,NA,vacuumcleaner01.jpg,drumset.jpg,vacuumcleaner01.jpg,vacuumcleaner01.jpg,drumset.jpg,8,3,reliable
107,critical,tiger-lion,der,der,bluejay,beaver,Löwe,Tiger,tiger,tiger02.jpg,lion,lion.jpg,images/bluejay.jpg,images/beaver.jpg,images/lion.jpg,images/tiger02.jpg,Ist das ein Bild von einem Tiger?,q_r_tiger.wav,r_e_loewe.wav,3,1,Das ist eigentlich ein Bild von einem Löwen.,Das ist eigentlich ein Bild von einem ...,Das ist | eigentlich ein Bild von | einem Löwen.,Löwe,Tiger,Löwe,reliable,actually,tiger02.jpg,lion.jpg,tiger02.jpg,tiger02.jpg,lion.jpg,8,4,reliable
242,filler,hubcap,NA,NA,exercisemachine,hubcap,crown,discoball,NA,NA,NA,NA,images/exercisemachine.jpg,images/hubcap.jpg,images/crown.jpg,images/discoball.jpg,Gehört das auf Autoräder?,q_f_radkappe.wav,f_radkappe.wav,NA,7,"Ja, das ist eine Radkappe.","Ja, das ist eine ...","Ja, | das ist | eine Radkappe.",hubcap,NA,NA,filler,NA,hubcap.jpg,exercisemachine.jpg,hubcap.jpg,hubcap.jpg,exercisemachine.jpg,8,5,reliable
256,filler,bulldozer,NA,NA,fireplace,bust,handbrush02,bulldozer,NA,NA,NA,NA,images/fireplace.jpg,images/bust.jpg,images/handbrush02.jpg,images/bulldozer.jpg,Wie heißt das große gelbe Ding?,q_f_bulldozer.wav,f_bulldozer.wav,NA,10,Das ist ein Bulldozer.,Das ist ein ...,Das ist | ein Bulldozer.,bulldozer,NA,NA,filler,NA,bulldozer.jpg,fireplace.jpg,bulldozer.jpg,bulldozer.jpg,fireplace.jpg,8,6,reliable
10,critical,dragonfly-moth,die,die,tortoise01,Libelle,Motte,cat,dragonfly,dragonfly01.jpg,moth,moth.jpg,images/tortoise01.jpg,images/dragonfly01.jpg,images/moth.jpg,images/cat.jpg,Ist das ein Bild von einer Libelle?,q_r_libelle.wav,r_t_libelle.wav,2,1,Das ist tatsächlich ein Bild von einer Libelle.,Das ist tatsächlich ein Bild von einer ...,Das ist | tatsächlich ein Bild von | einer Libelle.,Libelle,Libelle,Motte,reliable,indeed,dragonfly01.jpg,moth.jpg,dragonfly01.jpg,dragonfly01.jpg,moth.jpg,8,7,reliable
48,critical,tennis-racket-snowshoe,der,der,television,Schneeschuh,Tennisschläger,jokercard,tennis-racket,tennisracket.jpg,snowshoe,snowshoe.jpg,images/television.jpg,images/snowshoe.jpg,images/tennisracket.jpg,images/jokercard.jpg,Ist das ein Bild von einem Tennisschläger?,q_r_tennisschlaeger.wav,r_t_tennisschlaeger.wav,4,5,Das ist tatsächlich ein Bild von einem Tennisschläger.,Das ist tatsächlich ein Bild von einem ...,Das ist | tatsächlich ein Bild von | einem Tennisschläger.,Tennisschläger,Tennisschläger,Schneeschuh,reliable,indeed,tennisracket.jpg,snowshoe.jpg,tennisracket.jpg,tennisracket.jpg,snowshoe.jpg,8,8,reliable
46,critical,blender-coffee-maker,der,der,Kaffeekocher,kiddiepool,barrel01,Mixer,blender,blender.jpg,coffee-maker,coffeemaker.jpg,images/coffeemaker.jpg,images/kiddiepool.jpg,images/barrel01.jpg,images/blender.jpg,Ist das ein Bild von einem Mixer?,q_r_mixer.wav,r_t_mixer.wav,2,5,Das ist tatsächlich ein Bild von einem Mixer.,Das ist tatsächlich ein Bild von einem ...,Das ist | tatsächlich ein Bild von | einem Mixer.,Mixer,Mixer,Kaffeekocher,reliable,indeed,blender.jpg,coffeemaker.jpg,blender.jpg,blender.jpg,coffeemaker.jpg,8,9,reliable
239,filler,wedding-cake,NA,NA,weddingcake,toysoldier01b,womenwashroomsign,mirror02,NA,NA,NA,NA,images/weddingcake.jpg,images/toysoldier01b.jpg,images/womenwashroomsign.jpg,images/mirror02.jpg,Magst du auch das sehr schöne Ding mit den drei Lagen?,q_f_hochzeitskuchen.wav,f_hochzeitskuchen.wav,NA,7,"Ja, das ist ein schöner Hochzeitskuchen.","Ja, das ist ein schöner ...","Ja, | das ist | ein schöner Hochzeitskuchen.",weddingcake,NA,NA,filler,NA,weddingcake.jpg,toysoldier01b.jpg,weddingcake.jpg,weddingcake.jpg,toysoldier01b.jpg,8,10,reliable
237,filler,recycling-bin,NA,NA,skateboard,recyclingbin,lily,kiwi03,NA,NA,NA,NA,images/skateboard.jpg,images/recyclingbin.jpg,images/lily.jpg,images/kiwi03.jpg,Benutzt man das um Müll zu recyclen?,q_f_kiste.wav,f_kistewiederverwerten.wav,NA,7,"Ja, das ist eine Kiste zum Wiederverwerten.","Ja, das ist eine ... zum Wiederverwerten.","Ja, | das ist | eine Kiste zum Wiederverwerten.",recyclingbin,NA,NA,filler,NA,recyclingbin.jpg,skateboard.jpg,recyclingbin.jpg,recyclingbin.jpg,skateboard.jpg,8,11,reliable
106,critical,panda-polar-bear,der,der,warthog,Eisbär,Panda,alligator,panda,panda.jpg,polar-bear,polarbear.jpg,images/warthog.jpg,images/polarbear.jpg,images/panda.jpg,images/alligator.jpg,Ist das ein Bild von einem Panda?,q_r_panda.wav,r_e_eisbaer.wav,2,1,Das ist eigentlich ein Bild von einem Eisbär.,Das ist eigentlich ein Bild von einem ...,Das ist | eigentlich ein Bild von | einem Eisbär.,Eisbär,Panda,Eisbär,reliable,actually,panda.jpg,polarbear.jpg,panda.jpg,panda.jpg,polarbear.jpg,8,12,reliable
17,critical,sheep-ram,das,der,Schaaf,Bock,chimpanzee,armadillo,sheep,sheep.jpg,ram,ram.jpg,images/sheep.jpg,images/ram.jpg,images/chimpanzee.jpg,images/armadillo.jpg,Ist das ein Bild von einem Schaf?,q_r_schaf.wav,r_t_schaf.wav,1,2,Das ist tatsächlich ein Bild von einem Schaf.,Das ist tatsächlich ein Bild von einem ...,Das ist | tatsächlich ein Bild von | einem Schaf.,Schaf,Schaaf,Bock,reliable,indeed,sheep.jpg,ram.jpg,sheep.jpg,sheep.jpg,ram.jpg,9,1,reliable
260,filler,walkie-talkie,NA,NA,hibiscusflower02,handcuffs,birdhouse,walkietalkie,NA,NA,NA,NA,images/hibiscusflower02.jpg,images/handcuffs.jpg,images/birdhouse.jpg,images/walkietalkie.jpg,Ist das ein Telefon?,q_f_walkietalkie.wav,f_walkietalkie.wav,NA,10,"Nein, das ist ein Walkie-Talkie.","Nein, das ist ein ...","Nein, | das ist | ein Walkie-Talkie.",walkietalkie,NA,NA,filler,NA,walkietalkie.jpg,hibiscusflower02.jpg,walkietalkie.jpg,walkietalkie.jpg,hibiscusflower02.jpg,9,2,reliable
144,critical,oven-fridge,der,der,huntingknife,Ofen,Kühlschrank,grandpiano,oven,oven.jpg,fridge,fridge.jpg,images/huntingknife.jpg,images/oven.jpg,images/fridge.jpg,images/grandpiano.jpg,Ist das ein Bild von einem Ofen?,q_r_ofen.wav,r_e_kuehlschrank.wav,4,5,Das ist eigentlich ein Bild von einem Kühlschrank.,Das ist eigentlich ein Bild von einem ...,Das ist | eigentlich ein Bild von | einem Kühlschrank.,Kühlschrank,Ofen,Kühlschrank,reliable,actually,oven.jpg,fridge.jpg,oven.jpg,oven.jpg,fridge.jpg,9,3,reliable
153,critical,recorder-clarinet,die,die,flag,bench01,Flöte,Klarinette,recorder,recorder04.jpg,clarinet,clarinet.jpg,images/flag.jpg,images/bench01.jpg,images/recorder04.jpg,images/clarinet.jpg,Ist das ein Bild von einer Flöte?,q_r_floete.wav,r_e_klarinette.wav,1,6,Das ist eigentlich ein Bild von einer Klarinette.,Das ist eigentlich ein Bild von einer ...,Das ist | eigentlich ein Bild von | einer Klarinette.,Klarinette,Flöte,Klarinette,reliable,actually,recorder04.jpg,clarinet.jpg,recorder04.jpg,recorder04.jpg,clarinet.jpg,9,4,reliable
108,critical,horse-camel,das,das,Pferd,jackrabbit,stingray,Kamel,horse,horse.jpg,camel,dromedary.jpg,images/horse.jpg,images/jackrabbit.jpg,images/stingray.jpg,images/dromedary.jpg,Ist das ein Bild von einem Pferd?,q_r_pferd.wav,r_e_kamel.wav,4,1,Das ist eigentlich ein Bild von einem Kamel.,Das ist eigentlich ein Bild von einem ...,Das ist | eigentlich ein Bild von | einem Kamel.,Kamel,Pferd,Kamel,reliable,actually,horse.jpg,dromedary.jpg,horse.jpg,horse.jpg,dromedary.jpg,9,5,reliable
224,filler,weather-vane,NA,NA,weathervane,tree,pipe,coathook,NA,NA,NA,NA,images/weathervane.jpg,images/tree.jpg,images/pipe.jpg,images/coathook.jpg,Ist das etwas was man auf Hausdächern sieht?,q_f_wetterfahne.wav,f_wetterfahne.wav,NA,4,"Ja, das nennt sich Wetterfahne.","Ja, das nennt sich ...","Ja, | das nennt sich | Wetterfahne.",weathervane,NA,NA,filler,NA,weathervane.jpg,tree.jpg,weathervane.jpg,weathervane.jpg,tree.jpg,9,6,reliable
243,filler,chess-knight,NA,NA,visor,bassguitar,chessknight03a,aluminiumfoil,NA,NA,NA,NA,images/visor.jpg,images/bassguitar.jpg,images/chessknight03a.jpg,images/aluminiumfoil.jpg,"Magst du auch das Ding, was wie ein Pferd aussieht?",q_f_springerschach.wav,f_springerschach.wav,NA,8,"Ja, das ist ein Springer im Schach.","Ja, das ist ein ...","Ja, | das ist | ein Springer im Schach.",chessknight03a,NA,NA,filler,NA,chessknight03a.jpg,visor.jpg,chessknight03a.jpg,chessknight03a.jpg,visor.jpg,9,7,reliable
33,critical,mailbox-gargabe-can,der,der,dolly01,tambourine03,Mülleimer,Briefkasten,mailbox,postalmailbox01.jpg,gargabe-can,garbagebin.jpg,images/dolly01.jpg,images/tambourine03.jpg,images/garbagebin.jpg,images/postalmailbox01.jpg,Ist das ein Bild von einem Briefkasten?,q_r_briefkasten.wav,r_t_briefkasten.wav,1,4,Das ist tatsächlich ein Bild von einem Briefkasten.,Das ist tatsächlich ein Bild von einem ...,Das ist | tatsächlich ein Bild von | einem Briefkasten.,Briefkasten,Briefkasten,Mülleimer,reliable,indeed,postalmailbox01.jpg,garbagebin.jpg,postalmailbox01.jpg,postalmailbox01.jpg,garbagebin.jpg,9,8,reliable
259,filler,fish-knife,NA,NA,fanblades,butterknife,playground,boatmotor,NA,NA,NA,NA,images/fanblades.jpg,images/butterknife.jpg,images/playground.jpg,images/boatmotor.jpg,Benutzt man das hier für Butter?,q_f_messerfisch.wav,f_messerfisch.wav,NA,10,"Nein, das ist ein spezielles Messer für Fisch.","Nein, das ist ein spezielles ... für Fisch.","Nein, | das ist | ein spezielles Messer für Fisch.",butterknife,NA,NA,filler,NA,butterknife.jpg,fanblades.jpg,butterknife.jpg,butterknife.jpg,fanblades.jpg,9,9,reliable
21,critical,double-bass-banjo,der,das,treadmill,ceilingfan01,Kontrabass,Banjo,double-bass,doublebass.jpg,banjo,banjo.jpg,images/treadmill.jpg,images/ceilingfan01.jpg,images/doublebass.jpg,images/banjo.jpg,Ist das ein Bild von einem Kontrabass?,q_r_kontrabass.wav,r_t_kontrabass.wav,1,3,Das ist tatsächlich ein Bild von einem Kontrabass.,Das ist tatsächlich ein Bild von einem ...,Das ist | tatsächlich ein Bild von | einem Kontrabass.,Kontrabass,Kontrabass,Banjo,reliable,indeed,doublebass.jpg,banjo.jpg,doublebass.jpg,doublebass.jpg,banjo.jpg,9,10,reliable
246,filler,napkin,NA,NA,napkin,cymbal,outdoorchair,spotlight,NA,NA,NA,NA,images/napkin.jpg,images/cymbal.jpg,images/outdoorchair.jpg,images/spotlight.jpg,Magst du auch das bunte Ding?,q_f_serviette.wav,f_servierte.wav,NA,8,"Ja, das ist eine sehr schöne Serviette.","Ja, das ist eine sehr schöne ...","Ja, | das ist | eine sehr schöne Serviette.",napkin,NA,NA,filler,NA,napkin.jpg,spotlight.jpg,napkin.jpg,napkin.jpg,spotlight.jpg,9,11,reliable
222,filler,lawn-mower,NA,NA,firtree,lawnmower,washingmachine,watercooler,NA,NA,NA,NA,images/firtree.jpg,images/lawnmower.jpg,images/washingmachine.jpg,images/watercooler.jpg,Benutzt man das hier zum Gras schneiden?,q_f_rasenmaeher.wav,f_rasenmaeher.wav,NA,4,"Ja, das nennt sich Rasenmäher.","Ja, das nennt sich ...","Ja, | das nennt sich | Rasenmäher.",lawnmower,NA,NA,filler,NA,lawnmower.jpg,firtree.jpg,lawnmower.jpg,lawnmower.jpg,firtree.jpg,9,12,reliable
236,filler,boat,NA,NA,boat,aquarium,officecabinet,halogenlightbulb,NA,NA,NA,NA,images/boat.jpg,images/aquarium.jpg,images/officecabinet.jpg,images/halogenlightbulb.jpg,Ist das ein Boot?,q_f_boot.wav,f_boot.wav,NA,6,"Ja, das ist ein Boot.","Ja, das ist ein ...","Ja, | das ist | ein Boot.",boat,NA,NA,filler,NA,boat.jpg,officecabinet.jpg,boat.jpg,boat.jpg,officecabinet.jpg,10,1,reliable
247,filler,guitar,NA,NA,electricguitar01,smartboard,toyanimal05,alarmsystem,NA,NA,NA,NA,images/electricguitar01.jpg,images/smartboard.jpg,images/toyanimal05.jpg,images/alarmsystem.jpg,Ist das eine Gitarre?,q_f_gitarre.wav,f_gitarre.wav,NA,8,"Ja, das ist eine Gitarre.","Ja, das ist eine ...","Ja, | das ist | eine Gitarre.",electricguitar01,NA,NA,filler,NA,electricguitar01.jpg,toyanimal05.jpg,electricguitar01.jpg,electricguitar01.jpg,toyanimal05.jpg,10,2,reliable
232,filler,wagon-wheel,NA,NA,kidpicnictable,menwashroomsign,aloe01,wagonwheel,NA,NA,NA,NA,images/kidpicnictable.jpg,images/menwashroomsign.jpg,images/aloe01.jpg,images/wagonwheel.jpg,Magst du auch das große Rad?,q_f_wagenrad.wav,f_wagenrad.wav,NA,6,"Ja, das ist ein großes Wagenrad.","Ja, das ist ein großes ...","Ja, | das ist | ein großes Wagenrad.",wagonwheel,NA,NA,filler,NA,wagonwheel.jpg,kidpicnictable.jpg,wagonwheel.jpg,wagonwheel.jpg,kidpicnictable.jpg,10,3,reliable
206,filler,black-bear,NA,NA,bat,pig,salmon,blackbear,NA,NA,NA,NA,images/bat.jpg,images/pig.jpg,images/salmon.jpg,images/blackbear.jpg,Magst du auch das große schwarze Tier?,q_f_baer.wav,f_baer.wav,NA,1,"Ja, das ist ein sehr schöner schwarzer Bär.","Ja, das ist ein sehr schöner schwarzer ...","Ja, | das ist | ein sehr schöner schwarzer Bär.",blackbear,NA,NA,filler,NA,blackbear.jpg,bat.jpg,blackbear.jpg,blackbear.jpg,bat.jpg,10,4,reliable
230,filler,honeycomb,NA,NA,windshieldwiper,wallclock,machete,honeycomb,NA,NA,NA,NA,images/windshieldwiper02.jpg,images/wallclock.jpg,images/machete.jpg,images/honeycomb.jpg,"Ist das gelbe Ding, das, wovon wir Honig bekommen?",q_f_bienenwabe.wav,f_bienenwabe.wav,NA,5,"Ja, das ist eine Bienenwabe.","Ja, das ist eine ...","Ja, | das ist | eine Bienenwabe.",honeycomb,NA,NA,filler,NA,honeycomb.jpg,windshieldwiper02.jpg,honeycomb.jpg,honeycomb.jpg,windshieldwiper02.jpg,10,5,reliable
27,critical,soccerball-golf-ball,der,der,Fußball,Golfball,safe,stepladder,soccer-ball,soccerball.jpg,golf-ball,golfball.jpg,images/soccerball.jpg,images/golfball.jpg,images/safe.jpg,images/stepladder.jpg,Ist das ein Bild von einem Fußball?,q_r_fussball.wav,r_t_fussball.wav,3,3,Das ist tatsächlich ein Bild von einem Fußball.,Das ist tatsächlich ein Bild von einem ...,Das ist | tatsächlich ein Bild von | einem Fußball.,Fußball,Fußball,Golfball,reliable,indeed,soccerball.jpg,golfball.jpg,soccerball.jpg,soccerball.jpg,golfball.jpg,10,6,reliable
132,critical,airplane-helicopter,das,der,spicerack,Hubschrauber,Flugzeug,jarofapplesauce,airplane,cessna.jpg,helicopter,helicopter.jpg,images/spicerack.jpg,images/helicopter.jpg,images/cessna.jpg,images/jarofapplesauce.jpg,Ist das ein Bild von einem Flugzeug?,q_r_flugzeug.wav,r_e_hubschrauber.wav,4,4,Das ist eigentlich ein Bild von einem Hubschrauber.,Das ist eigentlich ein Bild von einem ...,Das ist | eigentlich ein Bild von | einem Hubschrauber.,Hubschrauber,Flugzeug,Hubschrauber,reliable,actually,cessna.jpg,helicopter.jpg,cessna.jpg,cessna.jpg,helicopter.jpg,10,7,reliable
120,critical,gecko-chameleon,der,das,Chamäleon,Gecko,sapsucker,fennec,gecko,gecko.jpg,chameleon,chameleon.jpg,images/chameleon.jpg,images/gecko.jpg,images/sapsucker.jpg,images/fennec.jpg,Ist das ein Bild von einem Gecko?,q_r_gecko.wav,r_e_chameleon.wav,4,2,Das ist eigentlich ein Bild von einem Chamäleon.,Das ist eigentlich ein Bild von einem ...,Das ist | eigentlich ein Bild von | einem Chamäleon.,Chamäleon,Gecko,Chamäleon,reliable,actually,gecko.jpg,chameleon.jpg,gecko.jpg,gecko.jpg,chameleon.jpg,10,8,reliable
123,critical,paper-plane-kite,das,der,Drache,Papierflieger,centurionhelmet,magneticcompass,paper-plane,paperairplane.jpg,kite,kite.jpg,images/kite.jpg,images/paperairplane.jpg,images/centurionhelmet.jpg,images/magneticcompass.jpg,Ist das ein Bild von einem Papierflieger?,q_r_papierflieger.wav,r_e_drachen.wav,3,3,Das ist eigentlich ein Bild von einem Drachen.,Das ist eigentlich ein Bild von einem ...,Das ist | eigentlich ein Bild von | einem Drachen.,Drachen,Papierflieger,Drachen,reliable,actually,paperairplane.jpg,kite.jpg,paperairplane.jpg,paperairplane.jpg,kite.jpg,10,9,reliable
22,critical,snowman-garden-gnome,der,der,Gartenzwerg,turnstile,guitarcase,Schneemann,snowman,snowman.jpg,garden-gnome,gardengnome02.jpg,images/gardengnome02.jpg,images/turnstile.jpg,images/guitarcase.jpg,images/snowman.jpg,Ist das ein Bild von einem Schneemann?,q_r_schneemann.wav,r_t_schneemann.wav,2,3,Das ist tatsächlich ein Bild von einem Schneemann.,Das ist tatsächlich ein Bild von einem ...,Das ist | tatsächlich ein Bild von | einem Schneemann.,Schneemann,Schneemann,Gartenzwerg,reliable,indeed,snowman.jpg,gardengnome02.jpg,snowman.jpg,snowman.jpg,gardengnome02.jpg,10,10,reliable
212,filler,cheetah,NA,NA,cheetah,cormorant,africanelephant,swan,NA,NA,NA,NA,images/cheetah.jpg,images/cormorant.jpg,images/africanelephant.jpg,images/swan.jpg,"Findest du nicht, dass dieses Tier schöne Punkte hat?",q_f_gepard.wav,f_gepard.wav,NA,2,"Ja, der Gepard hat schöne Flecken.","Ja, der ... hat schöne Flecken.","Ja, | der Gepard hat | schöne Flecken.",cheetah,NA,NA,filler,NA,cheetah.jpg,cormorant.jpg,cheetah.jpg,cheetah.jpg,cormorant.jpg,10,11,reliable
29,critical,wine-beer,der,das,basketballhoop01,badmintonracket,Flasche Wein,Flasche Bier,wine,bottleofwhitewine.jpg,beer,beerbottle.jpg,images/basketballhoop01.jpg,images/badmintonracket.jpg,images/bottleofwhitewine.jpg,images/beerbottle.jpg,Ist das ein Bild von einer Flasche Wein?,q_r_flaschewein.wav,r_t_flaschewein.wav,1,3,Das ist tatsächlich ein Bild von einer Flasche Wein.,Das ist tatsächlich ein Bild von einer ...,Das ist | tatsächlich ein Bild von | einer Flasche Wein.,Flasche Wein,Flasche Wein,Flasche Bier,reliable,indeed,bottleofwhitewine.jpg,beerbottle.jpg,bottleofwhitewine.jpg,bottleofwhitewine.jpg,beerbottle.jpg,10,12,reliable
