item_id,item_type,item_name,det_target,det_competitor,option1,option2,option3,option4,mentioned_element,mentioned_file,unmentioned_element,unmentioned_file,picture1,picture2,picture3,picture4,question,question_file,answer_file,target_position,list,complete_answer,incomplete_answer,chunked_answer,expected_response,target,competitor,condition,DP,picture_target,picture_competitor,MT_target,MT_pic_left,MT_pic_right,block,trial_nr_in_block,group_type
157,critical,trombone-tuba,die,die,townsquarepostclock,electricoutlet,Tuba,Posaune,trombone,trombone.jpg,tuba,tuba.jpg,images/townsquarepostclock.jpg,images/electricoutlet.jpg,images/tuba.jpg,images/trombone.jpg,Ist das ein Bild von einer Posaune?,q_r_posaune.wav,r_e_tuba.wav,1,6,Das ist eigentlich ein Bild von einer Tuba.,Das ist eigentlich ein Bild von einer ...,Das ist | eigentlich ein Bild von | einer Tuba.,Tuba,Posaune,Tuba,reliable,actually,trombone.jpg,tuba.jpg,trombone.jpg,trombone.jpg,tuba.jpg,1,1,unreliable
50,critical,tire-life-preserver,der,der,Reifen,mortarandpestle,shelf,Rettungsring,tire,tire.jpg,life-preserver,lifesaver.jpg,images/tire.jpg,images/mortarandpestle.jpg,images/shelf.jpg,images/lifesaver.jpg,Ist das ein Bild von einem Reifen?,q_r_reifen.wav,r_t_reifen.wav,2,5,Das ist tatsächlich ein Bild von einem Reifen.,Das ist tatsächlich ein Bild von einem ...,Das ist | tatsächlich ein Bild von | einem Reifen.,Reifen,Reifen,Rettungsring,reliable,indeed,tire.jpg,lifesaver.jpg,tire.jpg,tire.jpg,lifesaver.jpg,1,2,unreliable
116,critical,duck-seagull,die,die,Ente,jellyfish,cobra,Seemöwe,duck,duck01.jpg,seagull,seagull.jpg,images/duck01.jpg,images/jellyfish.jpg,images/cobra.jpg,images/seagull.jpg,Ist das ein Bild von einer Ente?,q_r_ente.wav,r_e_seemoewe.wav,4,2,Das ist eigentlich ein Bild von einer Seemöwe.,Das ist eigentlich ein Bild von einer ...,Das ist | eigentlich ein Bild von | einer Seemöwe.,Seemöwe,Ente,Seemöwe,reliable,actually,duck01.jpg,seagull.jpg,duck01.jpg,duck01.jpg,seagull.jpg,1,3,unreliable
107,critical,tiger-lion,der,der,bluejay,beaver,Löwe,Tiger,tiger,tiger02.jpg,lion,lion.jpg,images/bluejay.jpg,images/beaver.jpg,images/lion.jpg,images/tiger02.jpg,Ist das ein Bild von einem Tiger?,q_r_tiger.wav,r_e_loewe.wav,3,1,Das ist eigentlich ein Bild von einem Löwen.,Das ist eigentlich ein Bild von einem ...,Das ist | eigentlich ein Bild von | einem Löwen.,Löwe,Tiger,Löwe,reliable,actually,tiger02.jpg,lion.jpg,tiger02.jpg,tiger02.jpg,lion.jpg,1,4,unreliable
181,critical,cauliflower-broccoli,der,der,potatomasher03b,ashtray01,Blumenkohl,Broccoli,cauliflower,cauliflower01.jpg,broccoli,broccoli01a.jpg,images/potatomasher03b.jpg,images/ashtray01.jpg,images/cauliflower01.jpg,images/broccoli01a.jpg,Ist das ein Bild von einem Blumenkohl?,q_u_blumenkohl.wav,u_t_brokkoli.wav,1,9,Das ist tatsächlich ein Bild von einem Broccoli.,Das ist tatsächlich ein Bild von einem ...,Das ist | tatsächlich ein Bild von | einem Broccoli.,Broccoli,Blumenkohl,Broccoli,unreliable,indeed,cauliflower01.jpg,broccoli01a.jpg,cauliflower01.jpg,cauliflower01.jpg,broccoli01a.jpg,1,5,unreliable
41,critical,tower-wind-turbine,der,das,martiniglass01b,gasburner,Windrad,Turm,tower,tower.jpg,wind-turbine,windturbine.jpg,images/martiniglass01b.jpg,images/gasburner.jpg,images/windturbine.jpg,images/tower.jpg,Ist das ein Bild von einem Turm?,q_r_turm.wav,r_t_turm.wav,1,5,Das ist tatsächlich ein Bild von einem Turm.,Das ist tatsächlich ein Bild von einem ...,Das ist | tatsächlich ein Bild von | einem Turm.,Turm,Turm,Windrad,reliable,indeed,tower.jpg,windturbine.jpg,tower.jpg,tower.jpg,windturbine.jpg,1,6,unreliable
163,critical,lock-hinge,das,das,starfish01,puzzlepiece,Schloss,Scharniergelenk,lock,doorlock.jpg,hinge,hinge.jpg,images/starfish01.jpg,images/puzzlepiece.jpg,images/doorlock.jpg,images/hinge.jpg,Ist das ein Bild von einem Schloss?,q_u_schloss.wav,u_t_scharniergelenk.wav,3,7,Das ist tatsächlich ein Bild von einem Scharniergelenk.,Das ist tatsächlich ein Bild von einem ...,Das ist | tatsächlich ein Bild von | einem Scharniergelenk.,Scharniergelenk,Schloss,Scharniergelenk,unreliable,indeed,doorlock.jpg,hinge.jpg,doorlock.jpg,doorlock.jpg,hinge.jpg,1,7,unreliable
85,critical,tape-recorder-walkman,das,der,shoelace,envelope03a,Walkman,Tonbandgerät,tape-recorder,bus.jpg,walkman,walkman.jpg,images/shoelace.jpg,images/envelope03a.jpg,images/walkman.jpg,images/taperecorder.jpg,Ist das ein Bild von einem Tonbandgerät?,q_u_tonbandgeraet.wav,u_e_tonbandgeraet.wav,1,9,Das ist eigentlich ein Bild von einem Tonbandgerät.,Das ist eigentlich ein Bild von einem ...,Das ist | eigentlich ein Bild von | einem Tonbandgerät.,Tonbandgerät,Tonbandgerät,Walkman,unreliable,actually,bus.jpg,walkman.jpg,bus.jpg,bus.jpg,walkman.jpg,1,8,unreliable
203,filler,moose,NA,NA,pigeon,swordfish,muskox,moose,NA,NA,NA,NA,images/pigeon.jpg,images/swordfish.jpg,images/muskox.jpg,images/moose.jpg,Ist das ein Pferd?,q_f_elch.wav,f_elch.wav,NA,1,"Nein, das ist eine Elch.","Nein, das ist eine ...","Nein, | das ist | eine Elch.",moose,NA,NA,filler,NA,moose.jpg,pigeon.jpg,moose.jpg,moose.jpg,pigeon.jpg,1,9,unreliable
251,filler,locomotive,NA,NA,golfbag,bathtub,locomotive,fluorescentlightbulb,NA,NA,NA,NA,images/golfbag.jpg,images/bathtub.jpg,images/locomotive.jpg,images/fluorescentlightbulb.jpg,Magst du auch den Zug?,q_f_lokomotive.wav,f_lokomotive.wav,NA,9,"Ja, das ist eine schöne Lokomotive.","Ja, das ist eine schöne ...","Ja, | das ist | eine schöne Lokomotive.",locomotive,NA,NA,filler,NA,locomotive.jpg,golfbag.jpg,locomotive.jpg,locomotive.jpg,golfbag.jpg,1,10,unreliable
80,critical,broom-glass-mop,der,der,Wischmopp,Besen,cookie01,bungeecord02,broom,broom01.jpg,glass-mop,glassmop.jpg,images/glassmop.jpg,images/broom01.jpg,images/cookie01.jpg,images/bungeecord02.jpg,Ist das ein Bild von einem Besen?,q_u_besen.wav,u_e_besen.wav,4,8,Das ist eigentlich ein Bild von einem Besen.,Das ist eigentlich ein Bild von einem ...,Das ist | eigentlich ein Bild von | einem Besen.,Besen,Besen,Wischmopp,unreliable,actually,broom01.jpg,glassmop.jpg,broom01.jpg,broom01.jpg,glassmop.jpg,1,11,unreliable
24,critical,bicycle-motorbike,das,das,bookshelf,Motorrad,Fahrrad,totempole,bicycle,bicycle.jpg,motorbike,motorcycle.jpg,images/bookshelf.jpg,images/motorcycle.jpg,images/bicycle.jpg,images/totempole.jpg,Ist das ein Bild von einem Fahrrad?,q_r_fahrrad.wav,r_t_fahrrad.wav,4,3,Das ist tatsächlich ein Bild von einem Fahrrad.,Das ist tatsächlich ein Bild von einem ...,Das ist | tatsächlich ein Bild von | einem Fahrrad.,Fahrrad,Fahrrad,Motorrad,reliable,indeed,bicycle.jpg,motorcycle.jpg,bicycle.jpg,bicycle.jpg,motorcycle.jpg,1,12,unreliable
74,critical,paper-clip-safety-pin,die,die,peppermill02b,Sicherheitsnadel,Büroklammer,spraybottle01,paper-clip,paperclip03.jpg,safety-pin,safetypin.jpg,images/peppermill02b.jpg,images/safetypin.jpg,images/paperclip03.jpg,images/spraybottle01.jpg,Ist das ein Bild von einer Büroklammer?,q_u_bueroklammer.wav,u_e_bueroklammer.wav,2,8,Das ist eigentlich ein Bild von einer Büroklammer.,Das ist eigentlich ein Bild von einer ...,Das ist | eigentlich ein Bild von | einer Büroklammer.,Büroklammer,Büroklammer,Sicherheitsnagel,unreliable,actually,paperclip03.jpg,safetypin.jpg,paperclip03.jpg,paperclip03.jpg,safetypin.jpg,2,1,unreliable
45,critical,bolt-bullet,die,die,waterlily,lantern03,Schraube,Gewehrkugel,bolt,bolt01a.jpg,bullet,bullet.jpg,images/waterlily.jpg,images/lantern03.jpg,images/bolt01a.jpg,images/bullet.jpg,Ist das ein Bild von einer Schraube?,q_r_schraube.wav,r_t_schraube.wav,1,5,Das ist tatsächlich ein Bild von einer Schraube.,Das ist tatsächlich ein Bild von einer ...,Das ist | tatsächlich ein Bild von | einer Schraube.,Schraube,Schraube,Gewehrkugel,reliable,indeed,bolt01a.jpg,bullet.jpg,bolt01a.jpg,bolt01a.jpg,bullet.jpg,2,2,unreliable
44,critical,oven-fridge,der,der,huntingknife,Ofen,Kühlschrank,grandpiano,oven,oven.jpg,fridge,fridge.jpg,images/huntingknife.jpg,images/oven.jpg,images/fridge.jpg,images/grandpiano.jpg,Ist das ein Bild von einem Ofen?,q_r_ofen.wav,r_t_ofen.wav,4,5,Das ist tatsächlich ein Bild von einem Ofen.,Das ist tatsächlich ein Bild von einem ...,Das ist | tatsächlich ein Bild von | einem Ofen.,Ofen,Ofen,Kühlschrank,reliable,indeed,oven.jpg,fridge.jpg,oven.jpg,oven.jpg,fridge.jpg,2,3,unreliable
170,critical,car-key-usb-stick,der,der,screwdriver04b,Autoschlüssel,USB-Stick,binoculars01b,car-key,carkey.jpg,usb-stick,usbkey.jpg,images/screwdriver04b.jpg,images/carkey.jpg,images/usbkey.jpg,images/binoculars01b.jpg,Ist das ein Bild von einem Autoschlüssel?,q_u_autoschluessel.wav,u_t_usbstick.wav,2,7,Das ist tatsächlich ein Bild von einem USB-Stick.,Das ist tatsächlich ein Bild von einem ...,Das ist | tatsächlich ein Bild von | einem USB-Stick.,USB-Stick,Autoschlüssel,USB-Stick,unreliable,indeed,carkey.jpg,usbkey.jpg,carkey.jpg,carkey.jpg,usbkey.jpg,2,4,unreliable
87,critical,thimble-thread,der,das,Fingerhut,Garn,racquetballracket,chessboard,thimble,thimble.jpg,thread,thread02.jpg,images/thimble.jpg,images/thread02.jpg,images/racquetballracket.jpg,images/chessboard.jpg,Ist das ein Bild von einem Fingerhut?,q_u_fingerhut.wav,u_e_fingerhut.wav,3,9,Das ist eigentlich ein Bild von einem Fingerhut.,Das ist eigentlich ein Bild von einem ...,Das ist | eigentlich ein Bild von | einem Fingerhut.,Fingerhut,Fingerhut,Garn,unreliable,actually,thimble.jpg,thread02.jpg,thimble.jpg,thimble.jpg,thread02.jpg,2,5,unreliable
214,filler,nyala,NA,NA,heron01,nyala,stuffedpuffin,dalmatian,NA,NA,NA,NA,images/heron01.jpg,images/nyala.jpg,images/stuffedpuffin.jpg,images/dalmatian.jpg,Was ist das für ein Tier mit den langen Hörnern?,q_f_nyala.wav,f_nyala.wav,NA,3,Ich glaube das ist ein Nyala.,Ich glaube das ist ein ...,"Ich glaube, | das ist | ein Nyala.",nyala,NA,NA,filler,NA,nyala.jpg,heron01.jpg,nyala.jpg,nyala.jpg,heron01.jpg,2,7,unreliable
39,critical,shovel-pickaxe,die,die,Spitzhacke,Schaufel,tabascosauce,masquerademask01,shovel,shovel01.jpg,pickaxe,pickaxe02.jpg,images/pickaxe02.jpg,images/shovel01.jpg,images/tabascosauce.jpg,images/masquerademask01.jpg,Ist das ein Bild von einer Schaufel?,q_r_schaufel.wav,r_t_schaufel.wav,3,4,Das ist tatsächlich ein Bild von einer Schaufel.,Das ist tatsächlich ein Bild von einer ...,Das ist | tatsächlich ein Bild von | einer Schaufel.,Schaufel,Schaufel,Spitzhacke,reliable,indeed,shovel01.jpg,pickaxe02.jpg,shovel01.jpg,shovel01.jpg,pickaxe02.jpg,2,8,unreliable
133,critical,mailbox-gargabe-can,der,der,dolly01,tambourine03,Mülleimer,Briefkasten,mailbox,postalmailbox01.jpg,gargabe-can,garbagebin.jpg,images/dolly01.jpg,images/tambourine03.jpg,images/garbagebin.jpg,images/postalmailbox01.jpg,Ist das ein Bild von einem Briefkasten?,q_r_briefkasten.wav,r_e_muelleimer.wav,1,4,Das ist eigentlich ein Bild von einem Mülleimer.,Das ist eigentlich ein Bild von einem ...,Das ist | eigentlich ein Bild von | einem Mülleimer.,Mülleimer,Briefkasten,Mülleimer,reliable,actually,postalmailbox01.jpg,garbagebin.jpg,postalmailbox01.jpg,postalmailbox01.jpg,garbagebin.jpg,2,9,unreliable
137,critical,corn-cork,der,der,weedwacker,parachute,Maiskolben,Korken,corn,corn02.jpg,cork,cork02.jpg,images/weedwacker.jpg,images/parachute.jpg,images/corn02.jpg,images/cork02.jpg,Ist das ein Bild von einem Maiskolben?,q_r_maiskolben.wav,r_e_korken.wav,1,4,Das ist eigentlich ein Bild von einem Korken.,Das ist eigentlich ein Bild von einem ...,Das ist | eigentlich ein Bild von | einem Korken.,Korken,Maiskolben,Korken,reliable,actually,corn02.jpg,cork02.jpg,corn02.jpg,corn02.jpg,cork02.jpg,2,10,unreliable
254,filler,windsurf-board,NA,NA,desktopcomputer,windsurfboard,canoepaddle02,loppingshears,NA,NA,NA,NA,images/desktopcomputer.jpg,images/windsurfboard.jpg,images/canoepaddle02.jpg,images/loppingshears.jpg,Ist das ein kleines Boot?,q_f_windsurfbrett.wav,f_windsurfbrett.wav,NA,9,"Nein, das ist ein Windsurfbrett.","Nein, das ist ein ...","Nein, | das ist | ein Windsurfbrett.",windsurfboard,NA,NA,filler,NA,windsurfboard.jpg,desktopcomputer.jpg,windsurfboard.jpg,windsurfboard.jpg,desktopcomputer.jpg,2,11,unreliable
190,critical,raspberry-red-pepper,die,die,Paprika,sandal,plunger02,Himbeere,raspberry,raspberry01.jpg,red-pepper,pepper04a.jpg,images/pepper04a.jpg,images/sandal.jpg,images/plunger02.jpg,images/raspberry01.jpg,Ist das ein Bild von einer Himbeere?,q_u_himbeere.wav,u_t_paprika.wav,2,9,Das ist tatsächlich ein Bild von einer Paprika.,Das ist tatsächlich ein Bild von einer ...,Das ist | tatsächlich ein Bild von | einer Paprika.,Paprika,Himbeere,Paprika,unreliable,indeed,raspberry01.jpg,pepper04a.jpg,raspberry01.jpg,raspberry01.jpg,pepper04a.jpg,2,12,unreliable
250,filler,beach-umbrella,NA,NA,muffintray01,beachumbrella01,boxtrailer,whiteout,NA,NA,NA,NA,images/muffintray01.jpg,images/beachumbrella01.jpg,images/boxtrailer.jpg,images/whiteout.jpg,Benutzt man das hier am Strand?,q_f_sonnenschirm.wav,f_sonnenschirm.wav,NA,9,"Ja, das ist ein Sonnenschirm.","Ja, das ist ein ...","Ja, | das ist | ein Sonnenschirm.",beachumbrella01,NA,NA,filler,NA,beachumbrella01.jpg,muffintray01.jpg,beachumbrella01.jpg,beachumbrella01.jpg,muffintray01.jpg,3,1,unreliable
208,filler,clownfish,NA,NA,bassethound,americanwhitepelican,honeybee,clownfish,NA,NA,NA,NA,images/bassethound.jpg,images/americanwhitepelican.jpg,images/honeybee.jpg,images/clownfish.jpg,Wie heißt das orangene Tier?,q_f_clownfisch.wav,f_clownfisch.wav,NA,2,Das ist ein Clownfisch.,Das ist ein ...,Das ist | ein Clownfisch.,clownfish,NA,NA,filler,NA,clownfish.jpg,bassethound.jpg,clownfish.jpg,clownfish.jpg,bassethound.jpg,3,2,unreliable
65,critical,frying-pan-pot,der,der,Topf,Wok,whisk,fan,frying-pan,fryingpan02a.jpg,pot,pot02a.jpg,images/pot02a.jpg,images/fryingpan02a.jpg,images/whisk.jpg,images/fan.jpg,Ist das ein Bild von einem Wok?,q_u_wok.wav,u_e_wok.wav,1,7,Das ist eigentlich ein Bild von einem Wok.,Das ist eigentlich ein Bild von einem ...,Das ist | eigentlich ein Bild von | einem Wok.,Wok,Wok,Topf,unreliable,actually,fryingpan02a.jpg,pot02a.jpg,fryingpan02a.jpg,fryingpan02a.jpg,pot02a.jpg,3,3,unreliable
189,critical,onion-potatoe,die,die,toothbrush03b,canister,Zwiebel,Kartoffel,onion,onion.jpg,potatoe,potato02b.jpg,images/toothbrush03b.jpg,images/canister.jpg,images/onion.jpg,images/potato02b.jpg,Ist das ein Bild von einer Zwiebel?,q_u_zwiebel.wav,u_t_kartoffel.wav,1,9,Das ist tatsächlich ein Bild von einer Kartoffel.,Das ist tatsächlich ein Bild von einer ...,Das ist | tatsächlich ein Bild von | einer Kartoffel.,Kartoffel,Zwiebel,Kartoffel,unreliable,indeed,onion.jpg,potato02b.jpg,onion.jpg,onion.jpg,potato02b.jpg,3,4,unreliable
188,critical,sunglasses-swim-goggles,die,die,violin,Sonnenbrille,Schwimmbrille,mug01,sunglasses,sunglasses04.jpg,swim-goggles,swimgoggles.jpg,images/violin.jpg,images/sunglasses04.jpg,images/swimgoggles.jpg,images/mug01.jpg,Ist das ein Bild von einer Sonnenbrille?,q_u_sonnenbrille.wav,u_t_schwimmbrille.wav,4,9,Das ist tatsächlich ein Bild von einer Schwimmbrille.,Das ist tatsächlich ein Bild von einer ...,Das ist | tatsächlich ein Bild von | einer Schwimmbrille.,Schwimmbrille,Sonnenbrille,Schwimmbrille,unreliable,indeed,sunglasses04.jpg,swimgoggles.jpg,sunglasses04.jpg,sunglasses04.jpg,swimgoggles.jpg,3,5,unreliable
31,critical,pot-mug,der,der,Becher,Topf,missile,gastank,pot,cookingpot.jpg,mug,mug05.jpg,images/mug05.jpg,images/cookingpot.jpg,images/missile.jpg,images/gastank.jpg,Ist das ein Bild von einem Topf?,q_r_topf.wav,r_t_topf.wav,3,4,Das ist tatsächlich ein Bild von einem Topf.,Das ist tatsächlich ein Bild von einem ...,Das ist | tatsächlich ein Bild von | einem Topf.,Topf,Topf,Becher,reliable,indeed,cookingpot.jpg,mug05.jpg,cookingpot.jpg,cookingpot.jpg,mug05.jpg,3,6,unreliable
115,critical,parrot-toucan,der,der,chipmunk,greatwhiteshark,Tukan,Papagei,parrot,parrot01.jpg,toucan,toucan.jpg,images/chipmunk.jpg,images/greatwhiteshark.jpg,images/toucan.jpg,images/parrot01.jpg,Ist das ein Bild von einem Papagei?,q_r_papagei.wav,r_e_tucan.wav,3,2,Das ist eigentlich ein Bild von einem Tukan.,Das ist eigentlich ein Bild von einem ...,Das ist | eigentlich ein Bild von | einem Tukan.,Tukan,Papagei,Tukan,reliable,actually,parrot01.jpg,toucan.jpg,parrot01.jpg,parrot01.jpg,toucan.jpg,3,7,unreliable
28,critical,donut-cupcake,der,der,plantpot,Donut,Muffin,well,donut,donut.jpg,cupcake,cupcake.jpg,images/plantpot.jpg,images/donut.jpg,images/cupcake.jpg,images/well.jpg,Ist das ein Bild von einem Donut?,q_r_donut.wav,r_t_donut.wav,4,3,Das ist tatsächlich ein Bild von einem Donut.,Das ist tatsächlich ein Bild von einem ...,Das ist | tatsächlich ein Bild von | einem Donut.,Donut,Donut,Muffin,reliable,indeed,donut.jpg,cupcake.jpg,donut.jpg,donut.jpg,cupcake.jpg,3,8,unreliable
84,critical,lime-honeydew-melon,die,die,lightbulb01,Honigmelone,Limette,ladle02a,lime,lime.jpg,honeydew-melon,honeydewmelon.jpg,images/lightbulb01.jpg,images/honeydewmelon.jpg,images/lime.jpg,images/ladle02a.jpg,Ist das ein Bild von einer Limette?,q_u_limette.wav,u_e_limette.wav,4,9,Das ist eigentlich ein Bild von einer Limette.,Das ist eigentlich ein Bild von einer ...,Das ist | eigentlich ein Bild von | einer Limette.,Limette,Limette,Honigmelone,unreliable,actually,lime.jpg,honeydewmelon.jpg,lime.jpg,lime.jpg,honeydewmelon.jpg,3,9,unreliable
38,critical,pants-shorts,die,die,Badehose,bikepump01,jellybean,Jeans,pants,jeans01.jpg,shorts,swimsuit.jpg,images/swimsuit.jpg,images/bikepump01.jpg,images/jellybean.jpg,images/jeans01.jpg,Ist das ein Bild von einer Jeans?,q_r_jeans.wav,r_t_jeans.wav,2,4,Das ist tatsächlich ein Bild von einer Jeans.,Das ist tatsächlich ein Bild von einer ...,Das ist | tatsächlich ein Bild von | einer Jeans.,Jeans,Jeans,Badehose,reliable,indeed,jeans01.jpg,swimsuit.jpg,jeans01.jpg,jeans01.jpg,swimsuit.jpg,3,10,unreliable
129,critical,wine-beer,der,das,basketballhoop01,badmintonracket,Flasche Wein,Flasche Bier,wine,bottleofwhitewine.jpg,beer,beerbottle.jpg,images/basketballhoop01.jpg,images/badmintonracket.jpg,images/bottleofwhitewine.jpg,images/beerbottle.jpg,Ist das ein Bild von einer Flasche Wein?,q_r_flaschewein.wav,r_e_flaschebier.wav,1,3,Das ist eigentlich ein Bild von einer Flasche Bier.,Das ist eigentlich ein Bild von einer ...,Das ist | eigentlich ein Bild von | einer Flasche Bier.,Flasche Bier,Flasche Wein,Flasche Bier,reliable,actually,bottleofwhitewine.jpg,beerbottle.jpg,bottleofwhitewine.jpg,bottleofwhitewine.jpg,beerbottle.jpg,3,11,unreliable
155,critical,coat-rack-lamp,die,die,Gardarobe,Lampe,espressomachine,microwave,coat-rack,coatrack.jpg,lamp,floorlamp.jpg,images/coatrack.jpg,images/floorlamp.jpg,images/espressomachine.jpg,images/microwave.jpg,Ist das ein Bild von einer Gardarobe?,q_r_gadrobe.wav,r_e_lampe.wav,3,6,Das ist eigentlich ein Bild von einer Lampe.,Das ist eigentlich ein Bild von einer ...,Das ist | eigentlich ein Bild von | einer Lampe.,Lampe,Gardarobe,Lampe,reliable,actually,coatrack.jpg,floorlamp.jpg,coatrack.jpg,coatrack.jpg,floorlamp.jpg,3,12,unreliable
253,filler,pipe-wrench,NA,NA,jeep,pipewrench,flugglehorn,portapotty,NA,NA,NA,NA,images/jeep.jpg,images/pipewrench.jpg,images/flugglehorn.jpg,images/portapotty.jpg,Wie heißt das rote Ding?,q_f_rohrzange.wav,f_rohrzange.wav,NA,9,Das nennt sich Rohrzange.,Das nennt sich ...,Das nennt sich | Rohrzange.,pipewrench,NA,NA,filler,NA,pipewrench.jpg,jeep.jpg,pipewrench.jpg,pipewrench.jpg,jeep.jpg,4,1,unreliable
67,critical,measuring-cup-beer-mug,der,der,tray,globe,Bierkrug,Messbecher,measuring-cup,measuringcup01.jpg,beer-mug,beermug01a.jpg,images/tray.jpg,images/globe.jpg,images/beermug01a.jpg,images/measuringcup01.jpg,Ist das ein Bild von einem Messbecher?,q_u_messbecher.wav,u_e_messbecher.wav,3,7,Das ist eigentlich ein Bild von einem Messbecher.,Das ist eigentlich ein Bild von einem ...,Das ist | eigentlich ein Bild von | einem Messbecher.,Messbecher,Messbecher,Bierkrug,unreliable,actually,measuringcup01.jpg,beermug01a.jpg,measuringcup01.jpg,measuringcup01.jpg,beermug01a.jpg,4,2,unreliable
223,filler,school-bus,NA,NA,bucket02,schoolbus,worldmap,cleaver02,NA,NA,NA,NA,images/bucket02.jpg,images/schoolbus.jpg,images/worldmap.jpg,images/cleaver02.jpg,Magst du auch das gelbe Ding?,q_f_schulbus.wav,f_schulbus.wav,NA,4,"Ja, das ist ein schöner Schulbus.","Ja, das ist ein schöner ...","Ja, | das ist | ein schöner Schulbus.",schoolbus,NA,NA,filler,NA,schoolbus.jpg,bucket02.jpg,schoolbus.jpg,schoolbus.jpg,bucket02.jpg,4,3,unreliable
42,critical,chair-stool,der,der,Klappstuhl,accordion01,skihelmet01,Hocker,chair,foldingchair.jpg,stool,stool01.jpg,images/foldingchair.jpg,images/accordion01.jpg,images/skihelmet01.jpg,images/stool01.jpg,Ist das ein Bild von einem Klappstuhl?,q_r_klappstuhl.wav,r_t_klappstuhl.wav,2,5,Das ist tatsächlich ein Bild von einem Klappstuhl.,Das ist tatsächlich ein Bild von einem ...,Das ist | tatsächlich ein Bild von | einem Klappstuhl.,Klappstuhl,Klappstuhl,Hocker,reliable,indeed,foldingchair.jpg,stool01.jpg,foldingchair.jpg,foldingchair.jpg,stool01.jpg,4,4,unreliable
196,critical,cabbage-lettuce,der,der,nailclipper03b,Kohl,Salat,pictureframe04,cabbage,cabbage.jpg,lettuce,lettuce.jpg,images/nailclipper03b.jpg,images/cabbage.jpg,images/lettuce.jpg,images/pictureframe04.jpg,Ist das ein Bild von einem Kohl?,q_u_kohl.wav,u_t_salat.wav,4,10,Das ist tatsächlich ein Bild von einem Salat.,Das ist tatsächlich ein Bild von einem ...,Das ist | tatsächlich ein Bild von | einem Salat.,Salat,Kohl,Salat,unreliable,indeed,cabbage.jpg,lettuce.jpg,cabbage.jpg,cabbage.jpg,lettuce.jpg,4,5,unreliable
162,critical,stapler-staple-remover,der,der,icecreamcone01a,Tacker,Heftklammerentferner,tank,stapler,stapler03a.jpg,staple-remover,stapleremover.jpg,images/icecreamcone01a.jpg,images/stapler03a.jpg,images/stapleremover.jpg,images/tank.jpg,Ist das ein Bild von einem Tacker?,q_u_tacker.wav,u_t_heftklammerentferner.wav,2,7,Das ist tatsächlich ein Bild von einem Heftklammerentferner.,Das ist tatsächlich ein Bild von einem ...,Das ist | tatsächlich ein Bild von | einem Heftklammerentferner.,Heftklammerentferner,Tacker,Heftklammerentferner,unreliable,indeed,stapler03a.jpg,stapleremover.jpg,stapler03a.jpg,stapler03a.jpg,stapleremover.jpg,4,6,unreliable
125,critical,bus-truck,der,der,birdnest,poolnet,Lastwagen,Bus,bus,bus.jpg,truck,boxtruck.jpg,images/birdnest.jpg,images/poolnet.jpg,images/boxtruck.jpg,images/bus.jpg,Ist das ein Bild von einem Bus?,q_r_bus.wav,r_e_lastwagen.wav,1,3,Das ist eigentlich ein Bild von einem Lastwagen.,Das ist eigentlich ein Bild von einem ...,Das ist | eigentlich ein Bild von | einem Lastwagen.,Lastwagen,Bus,Lastwagen,reliable,actually,bus.jpg,boxtruck.jpg,bus.jpg,bus.jpg,boxtruck.jpg,4,7,unreliable
159,critical,wreath-hula-hoop,der,der,Kranz,Hula-hoop Reifen,keyhole,wetfloorsign,wreath,christmaswreath.jpg,hula-hoop,hulahoop.jpg,images/christmaswreath.jpg,images/hulahoop.jpg,images/keyhole.jpg,images/wetfloorsign.jpg,Ist das ein Bild von einem Kranz?,q_r_kranz.wav,r_e_hulahoopreifen.wav,3,6,Das ist eigentlich ein Bild von einem Hula-hoop Reifen.,Das ist eigentlich ein Bild von einem ...,Das ist | eigentlich ein Bild von | einem Hula-hoop Reifen.,Hula-hoop Reifen,Kranz,Hula-hoop Reifen,reliable,actually,christmaswreath.jpg,hulahoop.jpg,christmaswreath.jpg,christmaswreath.jpg,hulahoop.jpg,4,8,unreliable
40,critical,tractor-tank,der,der,patioumbrella,Panzer,Traktor,foosballtable,tractor,tractor.jpg,tank,tank.jpg,images/patioumbrella.jpg,images/tank.jpg,images/tractor.jpg,images/foosballtable.jpg,Ist das ein Bild von einem Traktor?,q_r_traktor.wav,r_t_traktor.wav,4,4,Das ist tatsächlich ein Bild von einem Traktor.,Das ist tatsächlich ein Bild von einem ...,Das ist | tatsächlich ein Bild von | einem Traktor.,Traktor,Traktor,Panzer,reliable,indeed,tractor.jpg,tank.jpg,tractor.jpg,tractor.jpg,tank.jpg,4,9,unreliable
121,critical,double-bass-banjo,der,das,treadmill,ceilingfan01,Kontrabass,Banjo,double-bass,doublebass.jpg,banjo,banjo.jpg,images/treadmill.jpg,images/ceilingfan01.jpg,images/doublebass.jpg,images/banjo.jpg,Ist das ein Bild von einem Kontrabass?,q_r_kontrabass.wav,r_e_banjo.wav,1,3,Das ist eigentlich ein Bild von einem Banjo.,Das ist eigentlich ein Bild von einem ...,Das ist | eigentlich ein Bild von | einem Banjo.,Banjo,Kontrabass,Banjo,reliable,actually,doublebass.jpg,banjo.jpg,doublebass.jpg,doublebass.jpg,banjo.jpg,4,10,unreliable
97,critical,handmixer-iron,der,das,balloon01b,mushroom01,Handmixer,Bügeleisen,handmixer,handmixer01d.jpg,iron,iron01b.jpg,images/balloon01b.jpg,images/mushroom01.jpg,images/handmixer01d.jpg,images/iron01b.jpg,Ist das ein Bild von einem Handmixer?,q_u_handmixer.wav,u_e_handmixer.wav,1,10,Das ist eigentlich ein Bild von einem Handmixer.,Das ist eigentlich ein Bild von einem ...,Das ist | eigentlich ein Bild von | einem Handmixer.,Handmixer,Handmixer,Bügeleisen,unreliable,actually,handmixer01d.jpg,iron01b.jpg,handmixer01d.jpg,handmixer01d.jpg,iron01b.jpg,4,11,unreliable
60,critical,saxophone-cornet,das,das,revolver,Saxophon,Kornett,shower,saxophone,saxophone.jpg,cornet,cornet.jpg,images/revolver.jpg,images/saxophone.jpg,images/cornet.jpg,images/shower.jpg,Ist das ein Bild von einem Saxophon?,q_r_saxophon.wav,r_t_saxophon.wav,4,6,Das ist tatsächlich ein Bild von einem Saxophon.,Das ist tatsächlich ein Bild von einem ...,Das ist | tatsächlich ein Bild von | einem Saxophon.,Saxophon,Saxophon,Kornett,reliable,indeed,saxophone.jpg,cornet.jpg,saxophone.jpg,saxophone.jpg,cornet.jpg,4,12,unreliable
34,critical,boot-rollerblade,der,der,Gummistiefel,triangle,filingcabinet,Inlineskate,boot,rainboot.jpg,rollerblade,rollerblade.jpg,images/rainboot.jpg,images/triangle.jpg,images/filingcabinet.jpg,images/rollerblade.jpg,Ist das ein Bild von einem Gummistiefel?,q_r_gummistiefel.wav,r_t_gummistiefel.wav,2,4,Das ist tatsächlich ein Bild von einem Gummistiefel.,Das ist tatsächlich ein Bild von einem ...,Das ist | tatsächlich ein Bild von | einem Gummistiefel.,Gummistiefel,Gummistiefel,Inlineskate,reliable,indeed,rainboot.jpg,rollerblade.jpg,rainboot.jpg,rainboot.jpg,rollerblade.jpg,5,1,unreliable
229,filler,lighthouse,NA,NA,lighthouse,barbecuelighter,lunchbag,bowtie,NA,NA,NA,NA,images/lighthouse.jpg,images/barbecuelighter.jpg,images/lunchbag.jpg,images/bowtie.jpg,"Ist das das große Ding, was wir am Strand gesehen haben?",q_f_leuchtturm.wav,f_leuchtturm.wav,NA,5,"Ja, das ist ein Leuchtturm.","Ja, das ist ein ...","Ja, | das ist | ein Leuchtturm.",lighthouse,NA,NA,filler,NA,lighthouse.jpg,lunchbag.jpg,lighthouse.jpg,lighthouse.jpg,lunchbag.jpg,5,2,unreliable
104,critical,hippopotamus-rhinoceros,das,das,Nashorn,sealion,cedarwaxwing,Nilpferd,hippopotamus,hippopotamus.jpg,rhinoceros,rhinoceros02.jpg,images/rhinoceros02.jpg,images/sealion.jpg,images/cedarwaxwing.jpg,images/hippopotamus.jpg,Ist das ein Bild von einem Nilpferd?,q_r_nilpferd.wav,r_e_nashorn.wav,4,1,Das ist eigentlich ein Bild von einem Nashorn.,Das ist eigentlich ein Bild von einem ...,Das ist | eigentlich ein Bild von | einem Nashorn.,Nashorn,Nilpferd,Nashorn,reliable,actually,hippopotamus.jpg,rhinoceros02.jpg,hippopotamus.jpg,hippopotamus.jpg,rhinoceros02.jpg,5,3,unreliable
126,critical,basketball-volleyball,der,der,Basketball,skipole,bowlingpin,Volleyball,basketball,basketball01.jpg,volleyball,volleyball.jpg,images/basketball01.jpg,images/skipole.jpg,images/bowlingpin.jpg,images/volleyball.jpg,Ist das ein Bild von einem Basketball?,q_r_basketball.wav,r_e_volleyball.wav,2,3,Das ist eigentlich ein Bild von einem Volleyball.,Das ist eigentlich ein Bild von einem ...,Das ist | eigentlich ein Bild von | einem Volleyball.,Volleyball,Basketball,Volleyball,reliable,actually,basketball01.jpg,volleyball.jpg,basketball01.jpg,basketball01.jpg,volleyball.jpg,5,4,unreliable
258,filler,gift,NA,NA,ironingboard01,chest01,patiochair,gift01,NA,NA,NA,NA,images/ironingboard01.jpg,images/chest01.jpg,images/patiochair.jpg,images/gift01.jpg,Magst du auch das bunte Ding?,q_f_geschenk.wav,f_geschenk.wav,NA,10,"Ja, das ist ein schönes Geschenk.","Ja, das ist ein schönes ...","Ja, | das ist | ein schönes Geschenk.",gift01,NA,NA,filler,NA,gift01.jpg,ironingboard01.jpg,gift01.jpg,gift01.jpg,ironingboard01.jpg,5,5,unreliable
143,critical,toilet-sink,das,das,Klo,Waschbecken,pouch01b,gardenutilityvehicle,toilet,toilet.jpg,sink,sink.jpg,images/toilet.jpg,images/sink.jpg,images/pouch01b.jpg,images/gardenutilityvehicle.jpg,Ist das ein Bild von einem Klo?,q_r_klo.wav,r_e_waschbecken.wav,3,5,Das ist eigentlich ein Bild von einem Waschbecken.,Das ist eigentlich ein Bild von einem ...,Das ist | eigentlich ein Bild von | einem Waschbecken.,Waschbecken,Klo,Waschbecken,reliable,actually,toilet.jpg,sink.jpg,toilet.jpg,toilet.jpg,sink.jpg,5,6,unreliable
56,critical,salt-shaker-showerhead,der,der,servingspoon01,Duschkopf,Salzstreuer,doorhandle,salt-shaker,saltshaker03a.jpg,showerhead,showerhead01.jpg,images/servingspoon01.jpg,images/showerhead01.jpg,images/saltshaker03a.jpg,images/doorhandle.jpg,Ist das ein Bild von einem Salzstreuer?,q_r_salzstreuer.wav,r_t_salzstreuer.wav,4,6,Das ist tatsächlich ein Bild von einem Salzstreuer.,Das ist tatsächlich ein Bild von einem ...,Das ist | tatsächlich ein Bild von | einem Salzstreuer.,Salzstreuer,Salzstreuer,Duschkopf,reliable,indeed,saltshaker03a.jpg,showerhead01.jpg,saltshaker03a.jpg,saltshaker03a.jpg,showerhead01.jpg,5,7,unreliable
46,critical,blender-coffee-maker,der,der,Kaffeekocher,kiddiepool,barrel01,Mixer,blender,blender.jpg,coffee-maker,coffeemaker.jpg,images/coffeemaker.jpg,images/kiddiepool.jpg,images/barrel01.jpg,images/blender.jpg,Ist das ein Bild von einem Mixer?,q_r_mixer.wav,r_t_mixer.wav,2,5,Das ist tatsächlich ein Bild von einem Mixer.,Das ist tatsächlich ein Bild von einem ...,Das ist | tatsächlich ein Bild von | einem Mixer.,Mixer,Mixer,Kaffeekocher,reliable,indeed,blender.jpg,coffeemaker.jpg,blender.jpg,blender.jpg,coffeemaker.jpg,5,8,unreliable
95,critical,power-cable-ribbon,das,das,Kabel,Geschenkband,bucket01a,cane,power-cable,powercable.jpg,ribbon,ribbon04.jpg,images/powercable.jpg,images/ribbon04.jpg,images/bucket01a.jpg,images/cane.jpg,Ist das ein Bild von einem Kabel?,q_u_kabel2.wav,u_e_kabel.wav,3,10,Das ist eigentlich ein Bild von einem Kabel.,Das ist eigentlich ein Bild von einem ...,Das ist | eigentlich ein Bild von | einem Kabel.,Kabel,Kabel,Geschenkband,unreliable,actually,powercable.jpg,ribbon04.jpg,powercable.jpg,powercable.jpg,ribbon04.jpg,5,9,unreliable
178,critical,candle-chalk,die,die,tuque03a,Kerze,Kreide,sewingmachine01a,candle,candle01.jpg,chalk,chalk.jpg,images/tuque03a.jpg,images/candle01.jpg,images/chalk.jpg,images/sewingmachine01a.jpg,Ist das ein Bild von einer Kerze?,q_u_kerze.wav,u_t_kreide.wav,2,8,Das ist tatsächlich ein Bild von einer Kreide.,Das ist tatsächlich ein Bild von einer ...,Das ist | tatsächlich ein Bild von | einer Kreide.,Kreide,Kerze,Kreide,unreliable,indeed,candle01.jpg,chalk.jpg,candle01.jpg,candle01.jpg,chalk.jpg,5,10,unreliable
193,critical,ping-pong-paddle-lollipop,der,der,eraser,lock03a,Lolli,Tischtennisschläger,ping-pong-paddle,pingpongpaddle01a.jpg,lollipop,lollipop01.jpg,images/eraser.jpg,images/lock03a.jpg,images/lollipop01.jpg,images/pingpongpaddle01a.jpg,Ist das ein Bild von einem Tischtennisschläger?,q_u_tischtennisschlaeger.wav,u_t_lolli.wav,1,10,Das ist tatsächlich ein Bild von einem Lolli.,Das ist tatsächlich ein Bild von einem ...,Das ist | tatsächlich ein Bild von | einem Lolli.,Lolli,Tischtennisschläger,Lolli,unreliable,indeed,pingpongpaddle01a.jpg,lollipop01.jpg,pingpongpaddle01a.jpg,pingpongpaddle01a.jpg,lollipop01.jpg,5,11,unreliable
69,critical,garlic-press-grater,die,die,Knoblauchpresse,Reibe,mascarabrush,battery02b,garlic-press,garlicpress02a.jpg,grater,grater01a.jpg,images/garlicpress02a.jpg,images/grater01a.jpg,images/mascarabrush.jpg,images/battery02b.jpg,Ist das ein Bild von einer Knoblauchpresse?,q_u_knoblauchpresse.wav,u_e_knoblauchpresse.wav,1,7,Das ist eigentlich ein Bild von einer Knoblauchpresse.,Das ist eigentlich ein Bild von einer ...,Das ist | eigentlich ein Bild von | einer Knoblauchpresse.,Knoblauchpresse,Knoblauchpresse,Reibe,unreliable,actually,garlicpress02a.jpg,grater01a.jpg,garlicpress02a.jpg,garlicpress02a.jpg,grater01a.jpg,5,12,unreliable
19,critical,Shrimp-lobster,die,die,canadiangoose,toad,Garnele,Languste,shrimp,shrimp.jpg,lobster,rocklobster.jpg,images/canadiangoose.jpg,images/toad.jpg,images/shrimp.jpg,images/rocklobster.jpg,Ist das ein Bild von einer Garnele ?,q_r_garnelle.wav,r_t_garnele.wav,3,2,Das ist tatsächlich ein Bild von einer Garnele.,Das ist tatsächlich ein Bild von einer ...,Das ist | tatsächlich ein Bild von | einer Garnele.,Garnele,Garnele,Languste,reliable,indeed,shrimp.jpg,rocklobster.jpg,shrimp.jpg,shrimp.jpg,rocklobster.jpg,6,1,unreliable
112,critical,shark-dolphin,der,der,Delphin,squid,cardinal,Hai,shark,sandbarshark.jpg,dolphin,dolphin01.jpg,images/dolphin01.jpg,images/squid.jpg,images/cardinal.jpg,images/sandbarshark.jpg,Ist das ein Bild von einem Hai?,q_r_hai.wav,r_e_delphin.wav,4,2,Das ist eigentlich ein Bild von einem Delphin.,Das ist eigentlich ein Bild von einem ...,Das ist | eigentlich ein Bild von | einem Delphin.,Delphin,Hai,Delphin,reliable,actually,sandbarshark.jpg,dolphin01.jpg,sandbarshark.jpg,sandbarshark.jpg,dolphin01.jpg,6,2,unreliable
230,filler,honeycomb,NA,NA,windshieldwiper,wallclock,machete,honeycomb,NA,NA,NA,NA,images/windshieldwiper02.jpg,images/wallclock.jpg,images/machete.jpg,images/honeycomb.jpg,"Ist das gelbe Ding, das, wovon wir Honig bekommen?",q_f_bienenwabe.wav,f_bienenwabe.wav,NA,5,"Ja, das ist eine Bienenwabe.","Ja, das ist eine ...","Ja, | das ist | eine Bienenwabe.",honeycomb,NA,NA,filler,NA,honeycomb.jpg,windshieldwiper02.jpg,honeycomb.jpg,honeycomb.jpg,windshieldwiper02.jpg,6,3,unreliable
123,critical,paper-plane-kite,das,der,Drache,Papierflieger,centurionhelmet,magneticcompass,paper-plane,paperairplane.jpg,kite,kite.jpg,images/kite.jpg,images/paperairplane.jpg,images/centurionhelmet.jpg,images/magneticcompass.jpg,Ist das ein Bild von einem Papierflieger?,q_r_papierflieger.wav,r_e_drachen.wav,3,3,Das ist eigentlich ein Bild von einem Drachen.,Das ist eigentlich ein Bild von einem ...,Das ist | eigentlich ein Bild von | einem Drachen.,Drachen,Papierflieger,Drachen,reliable,actually,paperairplane.jpg,kite.jpg,paperairplane.jpg,paperairplane.jpg,kite.jpg,6,4,unreliable
109,critical,fox-raccoon,der,der,Fuchs,Waschbär,seal,falcon,fox,redfox.jpg,raccoon,raccoon.jpg,images/redfox.jpg,images/raccoon.jpg,images/seal.jpg,images/falcon.jpg,Ist das ein Bild von einem Fuchs?,q_r_fuchs.wav,r_e_waschbaer.wav,1,1,Das ist eigentlich ein Bild von einem Waschbär.,Das ist eigentlich ein Bild von einem ...,Das ist | eigentlich ein Bild von | einem Waschbär.,Waschbär,Fuchs,Waschbär,reliable,actually,redfox.jpg,raccoon.jpg,redfox.jpg,redfox.jpg,raccoon.jpg,6,5,unreliable
47,critical,pinboard-calendar,die,die,Kalender,Pinnwand,cannon,electrictoothbrush01c,pinboard,corkboard.jpg,calendar,calendar.jpg,images/calendar.jpg,images/corkboard.jpg,images/cannon.jpg,images/electrictoothbrush01c.jpg,Ist das ein Bild von einer Pinnwand?,q_r_pinnwand.wav,r_t_pinnwand.wav,3,5,Das ist tatsächlich ein Bild von einer Pinnwand.,Das ist tatsächlich ein Bild von einer ...,Das ist | tatsächlich ein Bild von | einer Pinnwand.,Pinnwand,Pinnwand,Kalender,reliable,indeed,corkboard.jpg,calendar.jpg,corkboard.jpg,corkboard.jpg,calendar.jpg,6,6,unreliable
66,critical,tweezers-tongs,die,die,cd,Grillzange,Pinzette,candle08b,tweezers,tweezers02a.jpg,tongs,tongs01b.jpg,images/cd.jpg,images/tongs01b.jpg,images/tweezers02a.jpg,images/candle08b.jpg,Ist das ein Bild von einer Pinzette?,q_u_pinsette.wav,u_e_pinzette.wav,2,7,Das ist eigentlich ein Bild von einer Pinzette.,Das ist eigentlich ein Bild von einer ...,Das ist | eigentlich ein Bild von | einer Pinzette.,Pinzette,Pinzette,Grillzange,unreliable,actually,tweezers02a.jpg,tongs01b.jpg,tweezers02a.jpg,tweezers02a.jpg,tongs01b.jpg,6,7,unreliable
172,critical,electric-razor-hair-clipper,der,der,Haarschneider,hanger02a,shirt01,Elektrorasierer,electric-razor,electricrazor.jpg,hair-clipper,hairclipper.jpg,images/hairclipper.jpg,images/hanger02a.jpg,images/shirt01.jpg,images/electricrazor.jpg,Ist das ein Bild von einem Elektrorasierer?,q_u_elektrorasierer.wav,u_t_haarschneider.wav,4,8,Das ist tatsächlich ein Bild von einem Haarschneider.,Das ist tatsächlich ein Bild von einem ...,Das ist | tatsächlich ein Bild von | einem Haarschneider.,Haarschneider,Elektrorasierer,Haarschneider,unreliable,indeed,electricrazor.jpg,hairclipper.jpg,electricrazor.jpg,electricrazor.jpg,hairclipper.jpg,6,8,unreliable
191,critical,pen-mechanical-pen,der,der,Druckbleistift,Kugelschreiber,cardboardbox,plate01b,pen,pen04b.jpg,mechanical-pen,mechanicalpencil02.jpg,images/mechanicalpencil02.jpg,images/pen04b.jpg,images/cardboardbox.jpg,images/plate01b.jpg,Ist das ein Bild von einem Kugelschreiber?,q_u_kugelschreiber.wav,u_t_druckbleistift.wav,3,10,Das ist tatsächlich ein Bild von einem Druckbleistift.,Das ist tatsächlich ein Bild von einem ...,Das ist | tatsächlich ein Bild von | einem Druckbleistift.,Druckbleistift,Kugelschreiber,Druckbleistift,unreliable,indeed,pen04b.jpg,mechanicalpencil02.jpg,pen04b.jpg,pen04b.jpg,mechanicalpencil02.jpg,6,9,unreliable
228,filler,cello,NA,NA,towelrack,coffeemachine,cello,football,NA,NA,NA,NA,images/towelrack.jpg,images/coffeemachine.jpg,images/cello.jpg,images/football.jpg,Ist das eine Geige?,q_f_cello.wav,f_cello.wav,NA,5,"Nein, das hier ist größer. Das ist ein Cello.","Nein, das hier ist größer. Das ist ein ...","Nein, | das hier ist größer. | Das ist | ein Cello.",cello,NA,NA,filler,NA,cello.jpg,towelrack.jpg,cello.jpg,cello.jpg,towelrack.jpg,6,10,unreliable
77,critical,rope-yarn,das,das,Seil,Wollknäuel,ring01,crayon,rope,rope03.jpg,yarn,yarn.jpg,images/rope03.jpg,images/yarn.jpg,images/ring01.jpg,images/crayon.jpg,Ist das ein Bild von einem Seil?,q_u_seil.wav,u_e_seil.wav,1,8,Das ist eigentlich ein Bild von einem Seil.,Das ist eigentlich ein Bild von einem ...,Das ist | eigentlich ein Bild von | einem Seil.,Seil,Seil,Wollknäuel,unreliable,actually,rope03.jpg,yarn.jpg,rope03.jpg,rope03.jpg,yarn.jpg,6,11,unreliable
53,critical,recorder-clarinet,die,die,flag,bench01,Flöte,Klarinette,recorder,recorder04.jpg,clarinet,clarinet.jpg,images/flag.jpg,images/bench01.jpg,images/recorder04.jpg,images/clarinet.jpg,Ist das ein Bild von einer Flöte?,q_r_floete.wav,r_t_floete.wav,1,6,Das ist tatsächlich ein Bild von einer Flöte.,Das ist tatsächlich ein Bild von einer ...,Das ist | tatsächlich ein Bild von | einer Flöte.,Flöte,Flöte,Klarinette,reliable,indeed,recorder04.jpg,clarinet.jpg,recorder04.jpg,recorder04.jpg,clarinet.jpg,6,12,unreliable
259,filler,fish-knife,NA,NA,fanblades,butterknife,playground,boatmotor,NA,NA,NA,NA,images/fanblades.jpg,images/butterknife.jpg,images/playground.jpg,images/boatmotor.jpg,Benutzt man das hier für Butter?,q_f_messerfisch.wav,f_messerfisch.wav,NA,10,"Nein, das ist ein spezielles Messer für Fisch.","Nein, das ist ein spezielles ... für Fisch.","Nein, | das ist | ein spezielles Messer für Fisch.",butterknife,NA,NA,filler,NA,butterknife.jpg,fanblades.jpg,butterknife.jpg,butterknife.jpg,fanblades.jpg,7,1,unreliable
132,critical,airplane-helicopter,das,der,spicerack,Hubschrauber,Flugzeug,jarofapplesauce,airplane,cessna.jpg,helicopter,helicopter.jpg,images/spicerack.jpg,images/helicopter.jpg,images/cessna.jpg,images/jarofapplesauce.jpg,Ist das ein Bild von einem Flugzeug?,q_r_flugzeug.wav,r_e_hubschrauber.wav,4,4,Das ist eigentlich ein Bild von einem Hubschrauber.,Das ist eigentlich ein Bild von einem ...,Das ist | eigentlich ein Bild von | einem Hubschrauber.,Hubschrauber,Flugzeug,Hubschrauber,reliable,actually,cessna.jpg,helicopter.jpg,cessna.jpg,cessna.jpg,helicopter.jpg,7,2,unreliable
103,critical,ant-cockroach,die,die,hyena,antelope,Ameise,Kakerlake,ant,ant.jpg,cockroach,cockroach02.jpg,images/hyena.jpg,images/antelope.jpg,images/ant.jpg,images/cockroach02.jpg,Ist das ein Bild von einer Ameise?,q_r_ameise.wav,r_e_kakerlake.wav,3,1,Das ist eigentlich ein Bild von einer Kakerlake.,Das ist eigentlich ein Bild von einer ...,Das ist | eigentlich ein Bild von | einer Kakerlake.,Kakerlake,Ameise,Kakerlake,reliable,actually,ant.jpg,cockroach02.jpg,ant.jpg,ant.jpg,cockroach02.jpg,7,3,unreliable
73,critical,jack-drill-bit,der,der,Bohrer,Stecker,measuringtape01,pencilsharpener02a,jack,jack.jpg,drill-bit,drillbit03a.jpg,images/drillbit03a.jpg,images/jack.jpg,images/measuringtape01.jpg,images/pencilsharpener02a.jpg,Ist das ein Bild von einem Stecker?,q_u_stecker.wav,u_e_stecker.wav,1,8,Das ist eigentlich ein Bild von einem Stecker.,Das ist eigentlich ein Bild von einem ...,Das ist | eigentlich ein Bild von | einem Stecker.,Stecker,Stecker,Bohrer,unreliable,actually,jack.jpg,drillbit03a.jpg,jack.jpg,jack.jpg,drillbit03a.jpg,7,4,unreliable
1,critical,wolf-dog,der,der,Wolf,Hund,holdfast,americangoldfinch,wolf,greywolf.jpg,dog,greyhound.jpg,images/greywolf.jpg,images/greyhound.jpg,images/holdfast.jpg,images/americangoldfinch.jpg,Ist das ein Bild von einem Wolf?,q_r_wolf.wav,r_t_wolf.wav,1,1,Das ist tatsächlich ein Bild von einem Wolf.,Das ist tatsächlich ein Bild von einem ...,Das ist | tatsächlich ein Bild von | einem Wolf.,Wolf,Wolf,Hund,reliable,indeed,greywolf.jpg,greyhound.jpg,greywolf.jpg,greywolf.jpg,greyhound.jpg,7,5,unreliable
164,critical,teapot-watering-can,die,die,Gießkanne,fork03c,giftbag01a,Teekanne,teapot,teapot.jpg,watering-can,wateringcan.jpg,images/wateringcan.jpg,images/fork03c.jpg,images/giftbag01a.jpg,images/teapot.jpg,Ist das ein Bild von einer Teekanne?,q_u_teekanne.wav,u_t_giesskanne.wav,4,7,Das ist tatsächlich ein Bild von einer Gießkanne.,Das ist tatsächlich ein Bild von einer ...,Das ist | tatsächlich ein Bild von | einer Gießkanne.,Gießkanne,Teekanne,Gießkanne,unreliable,indeed,teapot.jpg,wateringcan.jpg,teapot.jpg,teapot.jpg,wateringcan.jpg,7,6,unreliable
92,critical,fountain-pen-pencil,der,der,garlic01a,Bleistift,Füller,bikehelmet,fountain-pen,fountainpen.jpg,pencil,pencil01.jpg,images/garlic01a.jpg,images/pencil01.jpg,images/fountainpen.jpg,images/bikehelmet.jpg,Ist das ein Bild von einem Füller?,q_u_fueller.wav,u_e_fueller.wav,4,10,Das ist eigentlich ein Bild von einem Füller.,Das ist eigentlich ein Bild von einem ...,Das ist | eigentlich ein Bild von | einem Füller.,Füller,Füller,Bleistift,unreliable,actually,fountainpen.jpg,pencil01.jpg,fountainpen.jpg,fountainpen.jpg,pencil01.jpg,7,7,unreliable
110,critical,dragonfly-moth,die,die,tortoise01,Libelle,Motte,cat,dragonfly,dragonfly01.jpg,moth,moth.jpg,images/tortoise01.jpg,images/dragonfly01.jpg,images/moth.jpg,images/cat.jpg,Ist das ein Bild von einer Libelle?,q_r_libelle.wav,r_e_motto.wav,2,1,Das ist eigentlich ein Bild von einer Motte.,Das ist eigentlich ein Bild von einer ...,Das ist | eigentlich ein Bild von | einer Motte.,Motte,Libelle,Motte,reliable,actually,dragonfly01.jpg,moth.jpg,dragonfly01.jpg,dragonfly01.jpg,moth.jpg,7,8,unreliable
238,filler,artichoke,NA,NA,artichoke01b,waterfountain02,pumpkin,atm,NA,NA,NA,NA,images/artichoke01b.jpg,images/waterfountain02.jpg,images/pumpkin.jpg,images/atm.jpg,Ist das eine Blume?,q_f_artischoke.wav,f_artischoke.wav,NA,7,"Nein, das ist eine Artischocke, man kann sie kochen.","Nein, das ist eine ..., man kann sie kochen.","Nein, | das ist | eine Artischocke, | man kann sie kochen.",artichoke01b,NA,NA,filler,NA,artichoke01b.jpg,pumpkin.jpg,artichoke01b.jpg,artichoke01b.jpg,pumpkin.jpg,7,9,unreliable
199,critical,headphones-hairband,der,der,Haarreifen,Kopfhörer,candy,leek,headphones,headphones02b.jpg,hairband,hairband.jpg,images/hairband.jpg,images/headphones02b.jpg,images/candy.jpg,images/leek.jpg,Ist das ein Bild von einem Kopfhörer?,q_u_kopfhoerer.wav,u_t_haarreif.wav,3,10,Das ist tatsächlich ein Bild von einer Haarreifen.,Das ist tatsächlich ein Bild von einer ...,Das ist | tatsächlich ein Bild von | einer Haarreifen.,Haarreifen,Kopfhörer,Haarreifen,unreliable,indeed,headphones02b.jpg,hairband.jpg,headphones02b.jpg,headphones02b.jpg,hairband.jpg,7,10,unreliable
49,critical,wheel-steering-wheel,das,das,watercolorpaintset,scanner,Lenkrad,Rad,wheel,wheel04.jpg,steering-wheel,steeringwheel.jpg,images/watercolorpaintset.jpg,images/scanner.jpg,images/steeringwheel.jpg,images/wheel04.jpg,Ist das ein Bild von einem Rad?,q_r_rad.wav,r_t_rad.wav,1,5,Das ist tatsächlich ein Bild von einem Rad.,Das ist tatsächlich ein Bild von einem ...,Das ist | tatsächlich ein Bild von | einem Rad.,Rad,Rad,Lenkrad,reliable,indeed,wheel04.jpg,steeringwheel.jpg,wheel04.jpg,wheel04.jpg,steeringwheel.jpg,7,11,unreliable
6,critical,panda-polar-bear,der,der,warthog,Eisbär,Panda,alligator,panda,panda.jpg,polar-bear,polarbear.jpg,images/warthog.jpg,images/polarbear.jpg,images/panda.jpg,images/alligator.jpg,Ist das ein Bild von einem Panda?,q_r_panda.wav,r_t_panda.wav,2,1,Das ist tatsächlich ein Bild von einem Panda.,Das ist tatsächlich ein Bild von einem ...,Das ist | tatsächlich ein Bild von | einem Panda.,Panda,Panda,Eisbär,reliable,indeed,panda.jpg,polarbear.jpg,panda.jpg,panda.jpg,polarbear.jpg,7,12,unreliable
118,critical,squirrel-skunk,das,das,bison,Eichhörnchen,Stinktier,jaguar,squirrel,squirrel.jpg,skunk,skunk.jpg,images/bison.jpg,images/squirrel.jpg,images/skunk.jpg,images/jaguar.jpg,Ist das ein Bild von einem Eichhörnchen?,q_r_eichhoernchen.wav,r_e_stinktier.wav,2,2,Das ist eigentlich ein Bild von einem Stinktier.,Das ist eigentlich ein Bild von einem ...,Das ist | eigentlich ein Bild von | einem Stinktier.,Stinktier,Eichhörnchen,Stinktier,reliable,actually,squirrel.jpg,skunk.jpg,squirrel.jpg,squirrel.jpg,skunk.jpg,8,1,unreliable
171,critical,squeegee-razor,der,der,bracelet04,metronome,Fensterabzieher,Rasierer,squeegee,squeegee01b.jpg,razor,razor01.jpg,images/bracelet04.jpg,images/metronome.jpg,images/squeegee01b.jpg,images/razor01.jpg,Ist das ein Bild von einem Fensterabzieher?,q_u_fensterabszieher.wav,u_t_rasierer.wav,3,8,Das ist tatsächlich ein Bild von einem Rasierer.,Das ist tatsächlich ein Bild von einem ...,Das ist | tatsächlich ein Bild von | einem Rasierer.,Rasierer,Fensterabzieher,Rasierer,unreliable,indeed,squeegee01b.jpg,razor01.jpg,squeegee01b.jpg,squeegee01b.jpg,razor01.jpg,8,2,unreliable
246,filler,napkin,NA,NA,napkin,cymbal,outdoorchair,spotlight,NA,NA,NA,NA,images/napkin.jpg,images/cymbal.jpg,images/outdoorchair.jpg,images/spotlight.jpg,Magst du auch das bunte Ding?,q_f_serviette.wav,f_servierte.wav,NA,8,"Ja, das ist eine sehr schöne Serviette.","Ja, das ist eine sehr schöne ...","Ja, | das ist | eine sehr schöne Serviette.",napkin,NA,NA,filler,NA,napkin.jpg,spotlight.jpg,napkin.jpg,napkin.jpg,spotlight.jpg,8,3,unreliable
11,critical,flamingo-turkey,der,der,narwhal,puma,Flamingo,Truthahn,flamingo,flamingo.jpg,turkey,turkey.jpg,images/narwhal.jpg,images/puma.jpg,images/flamingo.jpg,images/turkey.jpg,Ist das ein Bild von einem Flamingo?,q_r_flamingo.wav,r_t_flamingo.wav,3,2,Das ist tatsächlich ein Bild von einem Flamingo.,Das ist tatsächlich ein Bild von einem ...,Das ist | tatsächlich ein Bild von | einem Flamingo.,Flamingo,Flamingo,Truthahn,reliable,indeed,flamingo.jpg,turkey.jpg,flamingo.jpg,flamingo.jpg,turkey.jpg,8,4,unreliable
17,critical,sheep-ram,das,der,Schaaf,Bock,chimpanzee,armadillo,sheep,sheep.jpg,ram,ram.jpg,images/sheep.jpg,images/ram.jpg,images/chimpanzee.jpg,images/armadillo.jpg,Ist das ein Bild von einem Schaf?,q_r_schaf.wav,r_t_schaf.wav,1,2,Das ist tatsächlich ein Bild von einem Schaf.,Das ist tatsächlich ein Bild von einem ...,Das ist | tatsächlich ein Bild von | einem Schaf.,Schaf,Schaaf,Bock,reliable,indeed,sheep.jpg,ram.jpg,sheep.jpg,sheep.jpg,ram.jpg,8,5,unreliable
35,critical,knife-sword,das,das,Messer,Schwert,candelabra,bikewheel,knife,knife03.jpg,sword,sword01.jpg,images/knife03.jpg,images/sword01.jpg,images/candelabra.jpg,images/bikewheel.jpg,Ist das ein Bild von einem Messer?,q_r_messer.wav,r_t_messer.wav,3,4,Das ist tatsächlich ein Bild von einem Messer.,Das ist tatsächlich ein Bild von einem ...,Das ist | tatsächlich ein Bild von | einem Messer.,Messer,Messer,Schwert,reliable,indeed,knife03.jpg,sword01.jpg,knife03.jpg,knife03.jpg,sword01.jpg,8,6,unreliable
175,critical,bottle-opener-shoehorn,der,der,candleholder01,leaf02a,Schuhlöffel,Flaschenöffner,bottle-opener,bottleopener01.jpg,shoehorn,shoehorn.jpg,images/candleholder01.jpg,images/leaf02a.jpg,images/shoehorn.jpg,images/bottleopener01.jpg,Ist das ein Bild von einem Flaschenöffner?,q_u_flaschenoeffner.wav,u_t_schuhloeffel.wav,3,8,Das ist tatsächlich ein Bild von einem Schuhlöffel.,Das ist tatsächlich ein Bild von einem ...,Das ist | tatsächlich ein Bild von | einem Schuhlöffel.,Schuhlöffel,Flaschenöffner,Schuhlöffel,unreliable,indeed,bottleopener01.jpg,shoehorn.jpg,bottleopener01.jpg,bottleopener01.jpg,shoehorn.jpg,8,7,unreliable
94,critical,belt-rubber-band,der,das,Gürtel,jug,hammer01,Gummiband,belt,belt02a.jpg,rubber-band,rubberband01.jpg,images/belt02a.jpg,images/jug.jpg,images/hammer01.jpg,images/rubberband01.jpg,Ist das ein Bild von einem Gürtel?,q_u_guertel.wav,u_e_guertel.wav,2,10,Das ist eigentlich ein Bild von einem Gürtel.,Das ist eigentlich ein Bild von einem ...,Das ist | eigentlich ein Bild von | einem Gürtel.,Gürtel,Gürtel,Gummiband,unreliable,actually,belt02a.jpg,rubberband01.jpg,belt02a.jpg,belt02a.jpg,rubberband01.jpg,8,8,unreliable
206,filler,black-bear,NA,NA,bat,pig,salmon,blackbear,NA,NA,NA,NA,images/bat.jpg,images/pig.jpg,images/salmon.jpg,images/blackbear.jpg,Magst du auch das große schwarze Tier?,q_f_baer.wav,f_baer.wav,NA,1,"Ja, das ist ein sehr schöner schwarzer Bär.","Ja, das ist ein sehr schöner schwarzer ...","Ja, | das ist | ein sehr schöner schwarzer Bär.",blackbear,NA,NA,filler,NA,blackbear.jpg,bat.jpg,blackbear.jpg,blackbear.jpg,bat.jpg,8,9,unreliable
79,critical,match-toothpick,das,der,hairdryer02a,peach01,Streichholz,Zahnstocher,match,match.jpg,toothpick,toothpick02.jpg,images/hairdryer02a.jpg,images/peach01.jpg,images/match.jpg,images/toothpick02.jpg,Ist das ein Bild von einem Streichholz?,q_u_streichholz.wav,u_e_streichholz.wav,3,8,Das ist eigentlich ein Bild von einem Streichholz.,Das ist eigentlich ein Bild von einem ...,Das ist | eigentlich ein Bild von | einem Streichholz.,Streichholz,Streichholz,Zahnstocher,unreliable,actually,match.jpg,toothpick02.jpg,match.jpg,match.jpg,toothpick02.jpg,8,10,unreliable
114,critical,monkey-gorilla,der,der,hammerheadshark,Gorilla,Affen,riverotter,monkey,macaque.jpg,gorilla,gorilla.jpg,images/hammerheadshark.jpg,images/gorilla.jpg,images/macaque.jpg,images/riverotter.jpg,Ist das ein Bild von einem Affen?,q_r_affe.wav,r_e_gorilla.wav,2,2,Das ist eigentlich ein Bild von einem Gorilla.,Das ist eigentlich ein Bild von einem ...,Das ist | eigentlich ein Bild von | einem Gorilla.,Gorilla,Affen,Gorilla,reliable,actually,macaque.jpg,gorilla.jpg,macaque.jpg,macaque.jpg,gorilla.jpg,8,11,unreliable
108,critical,horse-camel,das,das,Pferd,jackrabbit,stingray,Kamel,horse,horse.jpg,camel,dromedary.jpg,images/horse.jpg,images/jackrabbit.jpg,images/stingray.jpg,images/dromedary.jpg,Ist das ein Bild von einem Pferd?,q_r_pferd.wav,r_e_kamel.wav,4,1,Das ist eigentlich ein Bild von einem Kamel.,Das ist eigentlich ein Bild von einem ...,Das ist | eigentlich ein Bild von | einem Kamel.,Kamel,Pferd,Kamel,reliable,actually,horse.jpg,dromedary.jpg,horse.jpg,horse.jpg,dromedary.jpg,8,12,unreliable
158,critical,cable-hose,das,der,Kabel,diploma01,clover,Schlauch,cable,usbcable01a.jpg,hose,hose.jpg,images/usbcable01a.jpg,images/diploma01.jpg,images/clover.jpg,images/hose.jpg,Ist das ein Bild von einem Kabel?,q_r_kabel1.wav,r_e_schlauch.wav,2,6,Das ist eigentlich ein Bild von einem Schlauch.,Das ist eigentlich ein Bild von einem ...,Das ist | eigentlich ein Bild von | einem Schlauch.,Schlauch,Kabel,Schlauch,reliable,actually,usbcable01a.jpg,hose.jpg,usbcable01a.jpg,usbcable01a.jpg,hose.jpg,9,1,unreliable
27,critical,soccerball-golf-ball,der,der,Fußball,Golfball,safe,stepladder,soccer-ball,soccerball.jpg,golf-ball,golfball.jpg,images/soccerball.jpg,images/golfball.jpg,images/safe.jpg,images/stepladder.jpg,Ist das ein Bild von einem Fußball?,q_r_fussball.wav,r_t_fussball.wav,3,3,Das ist tatsächlich ein Bild von einem Fußball.,Das ist tatsächlich ein Bild von einem ...,Das ist | tatsächlich ein Bild von | einem Fußball.,Fußball,Fußball,Golfball,reliable,indeed,soccerball.jpg,golfball.jpg,soccerball.jpg,soccerball.jpg,golfball.jpg,9,2,unreliable
83,critical,toast-baguette,das,das,Baguette,Toastbrot,lipstick02a,teabag,toast,toast.jpg,baguette,baguette01.jpg,images/baguette01.jpg,images/toast.jpg,images/lipstick02a.jpg,images/teabag.jpg,Ist das ein Bild von einem Toastbrot?,q_u_toastbrot.wav,u_e_toastbrot.wav,3,9,Das ist eigentlich ein Bild von einem Toastbrot.,Das ist eigentlich ein Bild von einem ...,Das ist | eigentlich ein Bild von | einem Toastbrot.,Toastbrot,Toastbrot,Baguette,unreliable,actually,toast.jpg,baguette01.jpg,toast.jpg,toast.jpg,baguette01.jpg,9,3,unreliable
122,critical,snowman-garden-gnome,der,der,Gartenzwerg,turnstile,guitarcase,Schneemann,snowman,snowman.jpg,garden-gnome,gardengnome02.jpg,images/gardengnome02.jpg,images/turnstile.jpg,images/guitarcase.jpg,images/snowman.jpg,Ist das ein Bild von einem Schneemann?,q_r_schneemann.wav,r_e_gartenzwerg.wav,2,3,Das ist eigentlich ein Bild von einem Gartenzwerg.,Das ist eigentlich ein Bild von einem ...,Das ist | eigentlich ein Bild von | einem Gartenzwerg.,Gartenzwerg,Schneemann,Gartenzwerg,reliable,actually,snowman.jpg,gardengnome02.jpg,snowman.jpg,snowman.jpg,gardengnome02.jpg,9,4,unreliable
168,critical,needlenose-pliers-scissors,die,die,Kneifzange,computermouse06,lamp04a,Schere,needlenose-pliers,needlenosepliers01.jpg,scissors,scissors01.jpg,images/needlenosepliers01.jpg,images/computermouse06.jpg,images/lamp04a.jpg,images/scissors01.jpg,Ist das ein Bild von einer Kneifzange?,q_u_kneifzange.wav,u_t_schere.wav,4,7,Das ist tatsächlich ein Bild von einer Schere.,Das ist tatsächlich ein Bild von einer ...,Das ist | tatsächlich ein Bild von | einer Schere.,Schere,Kneifzange,Schere,unreliable,indeed,needlenosepliers01.jpg,scissors01.jpg,needlenosepliers01.jpg,needlenosepliers01.jpg,scissors01.jpg,9,5,unreliable
240,filler,vacuum-cleaner,NA,NA,vacuumcleaner01,flipflop01b,curtain,drumset,NA,NA,NA,NA,images/vacuumcleaner01.jpg,images/flipflop01b.jpg,images/curtain.jpg,images/drumset.jpg,Macht man hiermit den Boden sauber?,q_f_staubsauger.wav,f_staubsauger.wav,NA,7,"Ja, das ist ein Staubsauger.","Ja, das ist ein ...","Ja, | das ist | ein Staubsauger.",vacuumcleaner01,NA,NA,filler,NA,vacuumcleaner01.jpg,drumset.jpg,vacuumcleaner01.jpg,vacuumcleaner01.jpg,drumset.jpg,9,6,unreliable
186,critical,scarf-rug,der,der,Schal,flask,marker01a,Teppich,scarf,scarf.jpg,rug,rug01.jpg,images/scarf.jpg,images/flask.jpg,images/marker01a.jpg,images/rug01.jpg,Ist das ein Bild von einem Schal?,q_u_schal.wav,u_t_teppich.wav,2,9,Das ist tatsächlich ein Bild von einem Teppich.,Das ist tatsächlich ein Bild von einem ...,Das ist | tatsächlich ein Bild von | einem Teppich.,Teppich,Schal,Teppich,unreliable,indeed,scarf.jpg,rug01.jpg,scarf.jpg,scarf.jpg,rug01.jpg,9,7,unreliable
98,critical,scale-food-processor,die,die,Küchenmaschine,syringe02,greenolive,Waage,scale,kitchenscale01a.jpg,food-processor,foodprocessor.jpg,images/foodprocessor.jpg,images/syringe02.jpg,images/greenolive.jpg,images/kitchenscale01a.jpg,Ist das ein Bild von einer Waage?,q_u_waage.wav,u_e_waage.wav,2,10,Das ist eigentlich ein Bild von einer Waage.,Das ist eigentlich ein Bild von einer ...,Das ist | eigentlich ein Bild von | einer Waage.,Waage,Waage,Küchenmaschine,unreliable,actually,kitchenscale01a.jpg,foodprocessor.jpg,kitchenscale01a.jpg,kitchenscale01a.jpg,foodprocessor.jpg,9,8,unreliable
234,filler,daffodil,NA,NA,lilypad,fighterjet,stubbywrench01a,daffodil,NA,NA,NA,NA,images/lilypad.jpg,images/fighterjet.jpg,images/stubbywrench01a.jpg,images/daffodil.jpg,Magst du auch das gelbe Ding?,q_f_narzisse.wav,f_narzisse.wav,NA,6,"Ja, das ist eine schöne Narzisse.","Ja, das ist eine schöne ...","Ja, | das ist | eine schöne Narzisse.",daffodil,NA,NA,filler,NA,daffodil.jpg,lilypad.jpg,daffodil.jpg,daffodil.jpg,lilypad.jpg,9,9,unreliable
136,critical,hat-hard-hat,der,der,radiator,Hut,Schutzhelm,arrow02,hat,witchhat.jpg,hard-hat,hardhat02.jpg,images/radiator.jpg,images/witchhat.jpg,images/hardhat02.jpg,images/arrow02.jpg,Ist das ein Bild von einem Hut?,q_r_hut.wav,r_e_schutzhelm.wav,4,4,Das ist eigentlich ein Bild von einem Schutzhelm.,Das ist eigentlich ein Bild von einem ...,Das ist | eigentlich ein Bild von | einem Schutzhelm.,Schutzhelm,Hut,Schutzhelm,reliable,actually,witchhat.jpg,hardhat02.jpg,witchhat.jpg,witchhat.jpg,hardhat02.jpg,9,10,unreliable
52,critical,snow-shovel-rake,die,die,tie02,Schneeschippe,Harke,amphora,snow-shovel,snowshovel.jpg,rake,leafrake.jpg,images/tie02.jpg,images/snowshovel.jpg,images/leafrake.jpg,images/amphora.jpg,Ist das ein Bild von einer Schneeschippe?,q_r_schneeschippe.wav,r_t_schneeschippe.wav,4,6,Das ist tatsächlich ein Bild von einer Schneeschippe.,Das ist tatsächlich ein Bild von einer ...,Das ist | tatsächlich ein Bild von | einer Schneeschippe.,Schneeschippe,Schneeschippe,Harke,reliable,indeed,snowshovel.jpg,leafrake.jpg,snowshovel.jpg,snowshovel.jpg,leafrake.jpg,9,11,unreliable
51,critical,boat-ship,das,das,Boot,Schiff,puzzle,fern,boat,sailboat.jpg,ship,cruiseship.jpg,images/sailboat.jpg,images/cruiseship.jpg,images/puzzle.jpg,images/fern.jpg,Ist das ein Bild von einem Boot?,q_r_boot.wav,r_t_boot.wav,3,6,Das ist tatsächlich ein Bild von einem Boot.,Das ist tatsächlich ein Bild von einem ...,Das ist | tatsächlich ein Bild von | einem Boot.,Boot,Boot,Schiff,reliable,indeed,sailboat.jpg,cruiseship.jpg,sailboat.jpg,sailboat.jpg,cruiseship.jpg,9,12,unreliable
237,filler,recycling-bin,NA,NA,skateboard,recyclingbin,lily,kiwi03,NA,NA,NA,NA,images/skateboard.jpg,images/recyclingbin.jpg,images/lily.jpg,images/kiwi03.jpg,Benutzt man das um Müll zu recyclen?,q_f_kiste.wav,f_kistewiederverwerten.wav,NA,7,"Ja, das ist eine Kiste zum Wiederverwerten.","Ja, das ist eine ... zum Wiederverwerten.","Ja, | das ist | eine Kiste zum Wiederverwerten.",recyclingbin,NA,NA,filler,NA,recyclingbin.jpg,skateboard.jpg,recyclingbin.jpg,recyclingbin.jpg,skateboard.jpg,10,1,unreliable
100,critical,clipboard-binder,das,der,stuffedanimal02b,Ordner,Klemmbrett,nailpolish03b,clipboard,clipboard.jpg,binder,binder03b.jpg,images/stuffedanimal02b.jpg,images/binder03b.jpg,images/clipboard.jpg,images/nailpolish03b.jpg,Ist das ein Bild von einem Klemmbrett?,q_u_klemmbrett.wav,u_e_klemmbrett.wav,4,10,Das ist eigentlich ein Bild von einem Klemmbrett.,Das ist eigentlich ein Bild von einem ...,Das ist | eigentlich ein Bild von | einem Klemmbrett.,Klemmbrett,Klemmbrett,Ordner,unreliable,actually,clipboard.jpg,binder03b.jpg,clipboard.jpg,clipboard.jpg,binder03b.jpg,10,2,unreliable
2,critical,crab-spider,die,die,tern,Krabbe,Spinne,lizard,crab,crab01.jpg,spider,daddylonglegs.jpg,images/tern.jpg,images/crab01.jpg,images/daddylonglegs.jpg,images/lizard.jpg,Ist das ein Bild von einer Krabbe?,q_r_krabbe.wav,r_t_krabbe.wav,2,1,Das ist tatsächlich ein Bild von einer Krabbe.,Das ist tatsächlich ein Bild von einer ...,Das ist | tatsächlich ein Bild von | einer Krabbe.,Krabbe,Krabbe,Spinne,reliable,indeed,crab01.jpg,daddylonglegs.jpg,crab01.jpg,crab01.jpg,daddylonglegs.jpg,10,3,unreliable
20,critical,gecko-chameleon,der,das,Chamäleon,Gecko,sapsucker,fennec,gecko,gecko.jpg,chameleon,chameleon.jpg,images/chameleon.jpg,images/gecko.jpg,images/sapsucker.jpg,images/fennec.jpg,Ist das ein Bild von einem Gecko?,q_r_gecko.wav,r_t_gecko.wav,4,2,Das ist tatsächlich ein Bild von einem Gecko.,Das ist tatsächlich ein Bild von einem ...,Das ist | tatsächlich ein Bild von | einem Gecko.,Gecko,Gecko,Chamäleon,reliable,indeed,gecko.jpg,chameleon.jpg,gecko.jpg,gecko.jpg,chameleon.jpg,10,4,unreliable
248,filler,waffle-maker,NA,NA,flower01,wafflemaker,scooter,chandelier,NA,NA,NA,NA,images/flower01.jpg,images/wafflemaker.jpg,images/scooter.jpg,images/chandelier.jpg,Benutzt man das hier um Waffeln zu machen?,q_f_waffeleisen.wav,f_waffeleisen.wav,NA,8,"Ja, das ist ein Waffeleisen.","Ja, das ist ein ...","Ja, | das ist | ein Waffeleisen.",wafflemaker,NA,NA,filler,NA,wafflemaker.jpg,flower01.jpg,wafflemaker.jpg,wafflemaker.jpg,flower01.jpg,10,5,unreliable
148,critical,tennis-racket-snowshoe,der,der,television,Schneeschuh,Tennisschläger,jokercard,tennis-racket,tennisracket.jpg,snowshoe,snowshoe.jpg,images/television.jpg,images/snowshoe.jpg,images/tennisracket.jpg,images/jokercard.jpg,Ist das ein Bild von einem Tennisschläger?,q_r_tennisschlaeger.wav,r_e_schneeschuh.wav,4,5,Das ist eigentlich ein Bild von einem Schneeschuh.,Das ist eigentlich ein Bild von einem ...,Das ist | eigentlich ein Bild von | einem Schneeschuh.,Schneeschuh,Tennisschläger,Schneeschuh,reliable,actually,tennisracket.jpg,snowshoe.jpg,tennisracket.jpg,tennisracket.jpg,snowshoe.jpg,10,6,unreliable
182,critical,kiwi-coconut,die,die,Kokosnuss,chain01,cigarette,Kiwi,kiwi,kiwi01a.jpg,coconut,coconut.jpg,images/coconut.jpg,images/chain01.jpg,images/cigarette.jpg,images/kiwi01a.jpg,Ist das ein Bild von einer Kiwi?,q_u_kiwi.wav,u_t_kokosnuss.wav,2,9,Das ist tatsächlich ein Bild von einer Kokosnuss.,Das ist tatsächlich ein Bild von einer ...,Das ist | tatsächlich ein Bild von | einer Kokosnuss.,Kokosnuss,Kiwi,Kokosnuss,unreliable,indeed,kiwi01a.jpg,coconut.jpg,kiwi01a.jpg,kiwi01a.jpg,coconut.jpg,10,7,unreliable
30,critical,bed-couch,das,das,Sofa,chair,toyfiretruck,Bett,bed,bed.jpg,couch,couch02.jpg,images/couch02.jpg,images/chair.jpg,images/toyfiretruck.jpg,images/bed.jpg,Ist das ein Bild von einem Bett?,q_r_bett.wav,r_t_bett.wav,2,3,Das ist tatsächlich ein Bild von einem Bett.,Das ist tatsächlich ein Bild von einem ...,Das ist | tatsächlich ein Bild von | einem Bett.,Bett,Bett,Sofa,reliable,indeed,bed.jpg,couch02.jpg,bed.jpg,bed.jpg,couch02.jpg,10,8,unreliable
113,critical,eagle-vulture,der,der,Geier,Adler,lynx01,bull,eagle,eagle.jpg,vulture,vulture.jpg,images/vulture.jpg,images/eagle.jpg,images/lynx01.jpg,images/bull.jpg,Ist das ein Bild von einem Adler?,q_r_adler.wav,r_e_geier.wav,1,2,Das ist eigentlich ein Bild von einem Geier.,Das ist eigentlich ein Bild von einem ...,Das ist | eigentlich ein Bild von | einem Geier.,Geier,Adler,Geier,reliable,actually,eagle.jpg,vulture.jpg,eagle.jpg,eagle.jpg,vulture.jpg,10,9,unreliable
161,critical,strainer-plastic-basket,das,der,Sieb,Korb,alarmclock01,apple07,strainer,strainer02.jpg,plastic-basket,Gummi,images/strainer02.jpg,images/plasticbasket01a.jpg,images/alarmclock01.jpg,images/apple07.jpg,Ist das ein Bild von einem Sieb?,q_u_sieb.wav,u_t_korb.wav,1,7,Das ist tatsächlich ein Bild von einem Korb.,Das ist tatsächlich ein Bild von einem ...,Das ist | tatsächlich ein Bild von | einem Korb.,Korb,Sieb,Korb,unreliable,indeed,strainer02.jpg,rubberband01.jpg,strainer02.jpg,strainer02.jpg,rubberband01.jpg,10,10,unreliable
76,critical,wallet-glasses-case,das,das,Portemonnaie,bib,mitten04,Brillenetui,wallet,wallet02a.jpg,glasses-case,glassescase.jpg,images/wallet02a.jpg,images/bib.jpg,images/mitten04.jpg,images/glassescase.jpg,Ist das ein Bild von einem Portemonnaie?,q_u_portemonnaie.wav,u_e_portemonnaie.wav,4,8,Das ist eigentlich ein Bild von einem Portemonnaie.,Das ist eigentlich ein Bild von einem ...,Das ist | eigentlich ein Bild von | einem Portemonnaie.,Portemonnaie,Portemonnaie,Brillenetui,unreliable,actually,wallet02a.jpg,glassescase.jpg,wallet02a.jpg,wallet02a.jpg,glassescase.jpg,10,11,unreliable
105,critical,chicken-rooster,das,der,Hahn,Huhn,rockbass,killerwhale,chicken,hen.jpg,rooster,rooster.jpg,images/rooster.jpg,images/hen.jpg,images/rockbass.jpg,images/killerwhale.jpg,Ist das ein Bild von einem Huhn?,q_r_huhn.wav,r_e_hahn.wav,1,1,Das ist eigentlich ein Bild von einem Hahn.,Das ist eigentlich ein Bild von einem ...,Das ist | eigentlich ein Bild von | einem Hahn.,Hahn,Huhn,Hahn,reliable,actually,hen.jpg,rooster.jpg,hen.jpg,hen.jpg,rooster.jpg,10,12,unreliable
