item_id,item_type,item_name,det_target,det_competitor,option1,option2,option3,option4,mentioned_element,mentioned_file,unmentioned_element,unmentioned_file,picture1,picture2,picture3,picture4,question,question_file,answer_file,target_position,list,complete_answer,incomplete_answer,chunked_answer,expected_response,target,competitor,condition,DP,picture_target,picture_competitor,MT_target,MT_pic_left,MT_pic_right,block,trial_nr_in_block,group_type
216,filler,pirate-flag,NA,NA,trumpet,rose,pirateflag,chefshat,NA,NA,NA,NA,images/trumpet.jpg,images/rose.jpg,images/pirateflag.jpg,images/chefshat.jpg,Findest du das Ding mit dem Totenkopf auch gruselig?,q_f_piratenflagge.wav,f_piratenflagge.wav,NA,3,"Ja, die Piratenflagge ist ein bisschen gruselig.","Ja, die ... ist ein bisschen gruselig.","Ja, | die Piratenflagge ist | ein bisschen gruselig.",pirateflag,NA,NA,filler,NA,pirateflag.jpg,trumpet.jpg,pirateflag.jpg,pirateflag.jpg,trumpet.jpg,1,1,unreliable
156,critical,salt-shaker-showerhead,der,der,servingspoon01,Duschkopf,Salzstreuer,doorhandle,salt-shaker,saltshaker03a.jpg,showerhead,showerhead01.jpg,images/servingspoon01.jpg,images/showerhead01.jpg,images/saltshaker03a.jpg,images/doorhandle.jpg,Ist das ein Bild von einem Salzstreuer?,q_r_salzstreuer.wav,r_e_duschkopf.wav,4,6,Das ist eigentlich ein Bild von einem Duschkopf.,Das ist eigentlich ein Bild von einem ...,Das ist | eigentlich ein Bild von | einem Duschkopf.,Duschkopf,Salzstreuer,Duschkopf,reliable,actually,saltshaker03a.jpg,showerhead01.jpg,saltshaker03a.jpg,saltshaker03a.jpg,showerhead01.jpg,1,2,unreliable
10,critical,dragonfly-moth,die,die,tortoise01,Libelle,Motte,cat,dragonfly,dragonfly01.jpg,moth,moth.jpg,images/tortoise01.jpg,images/dragonfly01.jpg,images/moth.jpg,images/cat.jpg,Ist das ein Bild von einer Libelle?,q_r_libelle.wav,r_t_libelle.wav,2,1,Das ist tatsächlich ein Bild von einer Libelle.,Das ist tatsächlich ein Bild von einer ...,Das ist | tatsächlich ein Bild von | einer Libelle.,Libelle,Libelle,Motte,reliable,indeed,dragonfly01.jpg,moth.jpg,dragonfly01.jpg,dragonfly01.jpg,moth.jpg,1,3,unreliable
204,filler,ladybug,NA,NA,zebra,ostrich,ladybug03,sturgeon,NA,NA,NA,NA,images/zebra.jpg,images/ostrich.jpg,images/ladybug03.jpg,images/sturgeon.jpg,Magst du auch das Tier mit den schwarzen Punkten?,q_f_marienkaefer.wav,f_marienkaefer.wav,NA,1,"Ja, das ist ein sehr schöner Marienkäfer.","Ja, das ist ein sehr schöner ...","Ja, | das ist | ein sehr schöner Marienkäfer.",ladybug03,NA,NA,filler,NA,ladybug03.jpg,zebra.jpg,ladybug03.jpg,ladybug03.jpg,zebra.jpg,1,4,unreliable
198,critical,scale-food-processor,die,die,Küchenmaschine,syringe02,greenolive,Waage,scale,kitchenscale01a.jpg,food-processor,foodprocessor.jpg,images/foodprocessor.jpg,images/syringe02.jpg,images/greenolive.jpg,images/kitchenscale01a.jpg,Ist das ein Bild von einer Waage?,q_u_waage.wav,u_t_kuechenmachine.wav,2,10,Das ist tatsächlich ein Bild von einer Küchenmaschine.,Das ist tatsächlich ein Bild von einer ...,Das ist | tatsächlich ein Bild von | einer Küchenmaschine.,Küchenmaschine,Waage,Küchenmaschine,unreliable,indeed,kitchenscale01a.jpg,foodprocessor.jpg,kitchenscale01a.jpg,kitchenscale01a.jpg,foodprocessor.jpg,1,5,unreliable
180,critical,broom-glass-mop,der,der,Wischmopp,Besen,cookie01,bungeecord02,broom,broom01.jpg,glass-mop,glassmop.jpg,images/glassmop.jpg,images/broom01.jpg,images/cookie01.jpg,images/bungeecord02.jpg,Ist das ein Bild von einem Besen?,q_u_besen.wav,u_t_wischmobb.wav,4,8,Das ist tatsächlich ein Bild von einem Wischmopp.,Das ist tatsächlich ein Bild von einem ...,Das ist | tatsächlich ein Bild von | einem Wischmopp.,Wischmopp,Besen,Wischmopp,unreliable,indeed,broom01.jpg,glassmop.jpg,broom01.jpg,broom01.jpg,glassmop.jpg,1,6,unreliable
93,critical,ping-pong-paddle-lollipop,der,der,eraser,lock03a,Lolli,Tischtennisschläger,ping-pong-paddle,pingpongpaddle01a.jpg,lollipop,lollipop01.jpg,images/eraser.jpg,images/lock03a.jpg,images/lollipop01.jpg,images/pingpongpaddle01a.jpg,Ist das ein Bild von einem Tischtennisschläger?,q_u_tischtennisschlaeger.wav,u_e_tischtennisschlaeger.wav,1,10,Das ist eigentlich ein Bild von einem Tischtennisschläger.,Das ist eigentlich ein Bild von einem ...,Das ist | eigentlich ein Bild von | einem Tischtennisschläger.,Tischtennisschläger,Tischtennisschläger,Lolli,unreliable,actually,pingpongpaddle01a.jpg,lollipop01.jpg,pingpongpaddle01a.jpg,pingpongpaddle01a.jpg,lollipop01.jpg,1,7,unreliable
63,critical,lock-hinge,das,das,starfish01,puzzlepiece,Schloss,Scharniergelenk,lock,doorlock.jpg,hinge,hinge.jpg,images/starfish01.jpg,images/puzzlepiece.jpg,images/doorlock.jpg,images/hinge.jpg,Ist das ein Bild von einem Schloss?,q_u_schloss.wav,u_e_schloss.wav,3,7,Das ist eigentlich ein Bild von einem Schloss.,Das ist eigentlich ein Bild von einem ...,Das ist | eigentlich ein Bild von | einem Schloss.,Schloss,Schloss,Scharniergelenk,unreliable,actually,doorlock.jpg,hinge.jpg,doorlock.jpg,doorlock.jpg,hinge.jpg,1,8,unreliable
57,critical,trombone-tuba,die,die,townsquarepostclock,electricoutlet,Tuba,Posaune,trombone,trombone.jpg,tuba,tuba.jpg,images/townsquarepostclock.jpg,images/electricoutlet.jpg,images/tuba.jpg,images/trombone.jpg,Ist das ein Bild von einer Posaune?,q_r_posaune.wav,r_t_posaune.wav,1,6,Das ist tatsächlich ein Bild von einer Posaune.,Das ist tatsächlich ein Bild von einer ...,Das ist | tatsächlich ein Bild von | einer Posaune.,Posaune,Posaune,Tuba,reliable,indeed,trombone.jpg,tuba.jpg,trombone.jpg,trombone.jpg,tuba.jpg,1,9,unreliable
3,critical,ant-cockroach,die,die,hyena,antelope,Ameise,Kakerlake,ant,ant.jpg,cockroach,cockroach02.jpg,images/hyena.jpg,images/antelope.jpg,images/ant.jpg,images/cockroach02.jpg,Ist das ein Bild von einer Ameise?,q_r_ameise.wav,r_t_ameise.wav,3,1,Das ist tatsächlich ein Bild von einer Ameise.,Das ist tatsächlich ein Bild von einer ...,Das ist | tatsächlich ein Bild von | einer Ameise.,Ameise,Ameise,Kakerlake,reliable,indeed,ant.jpg,cockroach02.jpg,ant.jpg,ant.jpg,cockroach02.jpg,1,10,unreliable
108,critical,horse-camel,das,das,Pferd,jackrabbit,stingray,Kamel,horse,horse.jpg,camel,dromedary.jpg,images/horse.jpg,images/jackrabbit.jpg,images/stingray.jpg,images/dromedary.jpg,Ist das ein Bild von einem Pferd?,q_r_pferd.wav,r_e_kamel.wav,4,1,Das ist eigentlich ein Bild von einem Kamel.,Das ist eigentlich ein Bild von einem ...,Das ist | eigentlich ein Bild von | einem Kamel.,Kamel,Pferd,Kamel,reliable,actually,horse.jpg,dromedary.jpg,horse.jpg,horse.jpg,dromedary.jpg,1,11,unreliable
112,critical,shark-dolphin,der,der,Delphin,squid,cardinal,Hai,shark,sandbarshark.jpg,dolphin,dolphin01.jpg,images/dolphin01.jpg,images/squid.jpg,images/cardinal.jpg,images/sandbarshark.jpg,Ist das ein Bild von einem Hai?,q_r_hai.wav,r_e_delphin.wav,4,2,Das ist eigentlich ein Bild von einem Delphin.,Das ist eigentlich ein Bild von einem ...,Das ist | eigentlich ein Bild von | einem Delphin.,Delphin,Hai,Delphin,reliable,actually,sandbarshark.jpg,dolphin01.jpg,sandbarshark.jpg,sandbarshark.jpg,dolphin01.jpg,1,12,unreliable
164,critical,teapot-watering-can,die,die,Gießkanne,fork03c,giftbag01a,Teekanne,teapot,teapot.jpg,watering-can,wateringcan.jpg,images/wateringcan.jpg,images/fork03c.jpg,images/giftbag01a.jpg,images/teapot.jpg,Ist das ein Bild von einer Teekanne?,q_u_teekanne.wav,u_t_giesskanne.wav,4,7,Das ist tatsächlich ein Bild von einer Gießkanne.,Das ist tatsächlich ein Bild von einer ...,Das ist | tatsächlich ein Bild von | einer Gießkanne.,Gießkanne,Teekanne,Gießkanne,unreliable,indeed,teapot.jpg,wateringcan.jpg,teapot.jpg,teapot.jpg,wateringcan.jpg,2,1,unreliable
172,critical,electric-razor-hair-clipper,der,der,Haarschneider,hanger02a,shirt01,Elektrorasierer,electric-razor,electricrazor.jpg,hair-clipper,hairclipper.jpg,images/hairclipper.jpg,images/hanger02a.jpg,images/shirt01.jpg,images/electricrazor.jpg,Ist das ein Bild von einem Elektrorasierer?,q_u_elektrorasierer.wav,u_t_haarschneider.wav,4,8,Das ist tatsächlich ein Bild von einem Haarschneider.,Das ist tatsächlich ein Bild von einem ...,Das ist | tatsächlich ein Bild von | einem Haarschneider.,Haarschneider,Elektrorasierer,Haarschneider,unreliable,indeed,electricrazor.jpg,hairclipper.jpg,electricrazor.jpg,electricrazor.jpg,hairclipper.jpg,2,2,unreliable
234,filler,daffodil,NA,NA,lilypad,fighterjet,stubbywrench01a,daffodil,NA,NA,NA,NA,images/lilypad.jpg,images/fighterjet.jpg,images/stubbywrench01a.jpg,images/daffodil.jpg,Magst du auch das gelbe Ding?,q_f_narzisse.wav,f_narzisse.wav,NA,6,"Ja, das ist eine schöne Narzisse.","Ja, das ist eine schöne ...","Ja, | das ist | eine schöne Narzisse.",daffodil,NA,NA,filler,NA,daffodil.jpg,lilypad.jpg,daffodil.jpg,daffodil.jpg,lilypad.jpg,2,3,unreliable
15,critical,parrot-toucan,der,der,chipmunk,greatwhiteshark,Tukan,Papagei,parrot,parrot01.jpg,toucan,toucan.jpg,images/chipmunk.jpg,images/greatwhiteshark.jpg,images/toucan.jpg,images/parrot01.jpg,Ist das ein Bild von einem Papagei?,q_r_papagei.wav,r_t_papagei.wav,3,2,Das ist tatsächlich ein Bild von einem Papagei.,Das ist tatsächlich ein Bild von einem ...,Das ist | tatsächlich ein Bild von | einem Papagei.,Papagei,Papagei,Tukan,reliable,indeed,parrot01.jpg,toucan.jpg,parrot01.jpg,parrot01.jpg,toucan.jpg,2,4,unreliable
86,critical,scarf-rug,der,der,Schal,flask,marker01a,Teppich,scarf,scarf.jpg,rug,rug01.jpg,images/scarf.jpg,images/flask.jpg,images/marker01a.jpg,images/rug01.jpg,Ist das ein Bild von einem Schal?,q_u_schal.wav,u_e_schal.wav,2,9,Das ist eigentlich ein Bild von einem Schal.,Das ist eigentlich ein Bild von einem ...,Das ist | eigentlich ein Bild von | einem Schal.,Schal,Schal,Teppich,unreliable,actually,scarf.jpg,rug01.jpg,scarf.jpg,scarf.jpg,rug01.jpg,2,5,unreliable
139,critical,shovel-pickaxe,die,die,Spitzhacke,Schaufel,tabascosauce,masquerademask01,shovel,shovel01.jpg,pickaxe,pickaxe02.jpg,images/pickaxe02.jpg,images/shovel01.jpg,images/tabascosauce.jpg,images/masquerademask01.jpg,Ist das ein Bild von einer Schaufel?,q_r_schaufel.wav,r_e_spitzhacke.wav,3,4,Das ist eigentlich ein Bild von einer Spitzhacke.,Das ist eigentlich ein Bild von einer ...,Das ist | eigentlich ein Bild von | einer Spitzhacke.,Spitzhacke,Schaufel,Spitzhacke,reliable,actually,shovel01.jpg,pickaxe02.jpg,shovel01.jpg,shovel01.jpg,pickaxe02.jpg,2,6,unreliable
131,critical,pot-mug,der,der,Becher,Topf,missile,gastank,pot,cookingpot.jpg,mug,mug05.jpg,images/mug05.jpg,images/cookingpot.jpg,images/missile.jpg,images/gastank.jpg,Ist das ein Bild von einem Topf?,q_r_topf.wav,r_e_becher.wav,3,4,Das ist eigentlich ein Bild von einem Becher.,Das ist eigentlich ein Bild von einem ...,Das ist | eigentlich ein Bild von | einem Becher.,Becher,Topf,Becher,reliable,actually,cookingpot.jpg,mug05.jpg,cookingpot.jpg,cookingpot.jpg,mug05.jpg,2,7,unreliable
5,critical,chicken-rooster,das,der,Hahn,Huhn,rockbass,killerwhale,chicken,hen.jpg,rooster,rooster.jpg,images/rooster.jpg,images/hen.jpg,images/rockbass.jpg,images/killerwhale.jpg,Ist das ein Bild von einem Huhn?,q_r_huhn.wav,r_t_huhn.wav,1,1,Das ist tatsächlich ein Bild von einem Huhn.,Das ist tatsächlich ein Bild von einem ...,Das ist | tatsächlich ein Bild von | einem Huhn.,Huhn,Huhn,Hahn,reliable,indeed,hen.jpg,rooster.jpg,hen.jpg,hen.jpg,rooster.jpg,2,8,unreliable
229,filler,lighthouse,NA,NA,lighthouse,barbecuelighter,lunchbag,bowtie,NA,NA,NA,NA,images/lighthouse.jpg,images/barbecuelighter.jpg,images/lunchbag.jpg,images/bowtie.jpg,"Ist das das große Ding, was wir am Strand gesehen haben?",q_f_leuchtturm.wav,f_leuchtturm.wav,NA,5,"Ja, das ist ein Leuchtturm.","Ja, das ist ein ...","Ja, | das ist | ein Leuchtturm.",lighthouse,NA,NA,filler,NA,lighthouse.jpg,lunchbag.jpg,lighthouse.jpg,lighthouse.jpg,lunchbag.jpg,2,9,unreliable
153,critical,recorder-clarinet,die,die,flag,bench01,Flöte,Klarinette,recorder,recorder04.jpg,clarinet,clarinet.jpg,images/flag.jpg,images/bench01.jpg,images/recorder04.jpg,images/clarinet.jpg,Ist das ein Bild von einer Flöte?,q_r_floete.wav,r_e_klarinette.wav,1,6,Das ist eigentlich ein Bild von einer Klarinette.,Das ist eigentlich ein Bild von einer ...,Das ist | eigentlich ein Bild von | einer Klarinette.,Klarinette,Flöte,Klarinette,reliable,actually,recorder04.jpg,clarinet.jpg,recorder04.jpg,recorder04.jpg,clarinet.jpg,2,10,unreliable
66,critical,tweezers-tongs,die,die,cd,Grillzange,Pinzette,candle08b,tweezers,tweezers02a.jpg,tongs,tongs01b.jpg,images/cd.jpg,images/tongs01b.jpg,images/tweezers02a.jpg,images/candle08b.jpg,Ist das ein Bild von einer Pinzette?,q_u_pinsette.wav,u_e_pinzette.wav,2,7,Das ist eigentlich ein Bild von einer Pinzette.,Das ist eigentlich ein Bild von einer ...,Das ist | eigentlich ein Bild von | einer Pinzette.,Pinzette,Pinzette,Grillzange,unreliable,actually,tweezers02a.jpg,tongs01b.jpg,tweezers02a.jpg,tweezers02a.jpg,tongs01b.jpg,2,11,unreliable
254,filler,windsurf-board,NA,NA,desktopcomputer,windsurfboard,canoepaddle02,loppingshears,NA,NA,NA,NA,images/desktopcomputer.jpg,images/windsurfboard.jpg,images/canoepaddle02.jpg,images/loppingshears.jpg,Ist das ein kleines Boot?,q_f_windsurfbrett.wav,f_windsurfbrett.wav,NA,9,"Nein, das ist ein Windsurfbrett.","Nein, das ist ein ...","Nein, | das ist | ein Windsurfbrett.",windsurfboard,NA,NA,filler,NA,windsurfboard.jpg,desktopcomputer.jpg,windsurfboard.jpg,windsurfboard.jpg,desktopcomputer.jpg,3,1,unreliable
210,filler,proboscis-monkey,NA,NA,proboscismonkey,giraffe,monarchbutterfly,saintbernard,NA,NA,NA,NA,images/proboscismonkey.jpg,images/giraffe.jpg,images/monarchbutterfly.jpg,images/saintbernard.jpg,Findest du das Tier mit der dicken Nase auch lustig?,q_f_affe.wav,f_affe.wav,NA,2,"Ja, das ist ein lustiger Affee.","Ja, das ist ein lustiger ...","Ja, | das ist | ein lustiger Affee.",proboscismonkey,NA,NA,filler,NA,proboscismonkey.jpg,saintbernard.jpg,proboscismonkey.jpg,proboscismonkey.jpg,saintbernard.jpg,3,2,unreliable
182,critical,kiwi-coconut,die,die,Kokosnuss,chain01,cigarette,Kiwi,kiwi,kiwi01a.jpg,coconut,coconut.jpg,images/coconut.jpg,images/chain01.jpg,images/cigarette.jpg,images/kiwi01a.jpg,Ist das ein Bild von einer Kiwi?,q_u_kiwi.wav,u_t_kokosnuss.wav,2,9,Das ist tatsächlich ein Bild von einer Kokosnuss.,Das ist tatsächlich ein Bild von einer ...,Das ist | tatsächlich ein Bild von | einer Kokosnuss.,Kokosnuss,Kiwi,Kokosnuss,unreliable,indeed,kiwi01a.jpg,coconut.jpg,kiwi01a.jpg,kiwi01a.jpg,coconut.jpg,3,3,unreliable
189,critical,onion-potatoe,die,die,toothbrush03b,canister,Zwiebel,Kartoffel,onion,onion.jpg,potatoe,potato02b.jpg,images/toothbrush03b.jpg,images/canister.jpg,images/onion.jpg,images/potato02b.jpg,Ist das ein Bild von einer Zwiebel?,q_u_zwiebel.wav,u_t_kartoffel.wav,1,9,Das ist tatsächlich ein Bild von einer Kartoffel.,Das ist tatsächlich ein Bild von einer ...,Das ist | tatsächlich ein Bild von | einer Kartoffel.,Kartoffel,Zwiebel,Kartoffel,unreliable,indeed,onion.jpg,potato02b.jpg,onion.jpg,onion.jpg,potato02b.jpg,3,4,unreliable
37,critical,corn-cork,der,der,weedwacker,parachute,Maiskolben,Korken,corn,corn02.jpg,cork,cork02.jpg,images/weedwacker.jpg,images/parachute.jpg,images/corn02.jpg,images/cork02.jpg,Ist das ein Bild von einem Maiskolben?,q_r_maiskolben.wav,r_t_maiskolben.wav,1,4,Das ist tatsächlich ein Bild von einem Maiskolben.,Das ist tatsächlich ein Bild von einem ...,Das ist | tatsächlich ein Bild von | einem Maiskolben.,Maiskolben,Maiskolben,Korken,reliable,indeed,corn02.jpg,cork02.jpg,corn02.jpg,corn02.jpg,cork02.jpg,3,5,unreliable
21,critical,double-bass-banjo,der,das,treadmill,ceilingfan01,Kontrabass,Banjo,double-bass,doublebass.jpg,banjo,banjo.jpg,images/treadmill.jpg,images/ceilingfan01.jpg,images/doublebass.jpg,images/banjo.jpg,Ist das ein Bild von einem Kontrabass?,q_r_kontrabass.wav,r_t_kontrabass.wav,1,3,Das ist tatsächlich ein Bild von einem Kontrabass.,Das ist tatsächlich ein Bild von einem ...,Das ist | tatsächlich ein Bild von | einem Kontrabass.,Kontrabass,Kontrabass,Banjo,reliable,indeed,doublebass.jpg,banjo.jpg,doublebass.jpg,doublebass.jpg,banjo.jpg,3,6,unreliable
111,critical,flamingo-turkey,der,der,narwhal,puma,Flamingo,Truthahn,flamingo,flamingo.jpg,turkey,turkey.jpg,images/narwhal.jpg,images/puma.jpg,images/flamingo.jpg,images/turkey.jpg,Ist das ein Bild von einem Flamingo?,q_r_flamingo.wav,r_e_truthahn.wav,3,2,Das ist eigentlich ein Bild von einem Truthahn.,Das ist eigentlich ein Bild von einem ...,Das ist | eigentlich ein Bild von | einem Truthahn.,Truthahn,Flamingo,Truthahn,reliable,actually,flamingo.jpg,turkey.jpg,flamingo.jpg,flamingo.jpg,turkey.jpg,3,7,unreliable
85,critical,tape-recorder-walkman,das,der,shoelace,envelope03a,Walkman,Tonbandgerät,tape-recorder,bus.jpg,walkman,walkman.jpg,images/shoelace.jpg,images/envelope03a.jpg,images/walkman.jpg,images/taperecorder.jpg,Ist das ein Bild von einem Tonbandgerät?,q_u_tonbandgeraet.wav,u_e_tonbandgeraet.wav,1,9,Das ist eigentlich ein Bild von einem Tonbandgerät.,Das ist eigentlich ein Bild von einem ...,Das ist | eigentlich ein Bild von | einem Tonbandgerät.,Tonbandgerät,Tonbandgerät,Walkman,unreliable,actually,bus.jpg,walkman.jpg,bus.jpg,bus.jpg,walkman.jpg,3,8,unreliable
92,critical,fountain-pen-pencil,der,der,garlic01a,Bleistift,Füller,bikehelmet,fountain-pen,fountainpen.jpg,pencil,pencil01.jpg,images/garlic01a.jpg,images/pencil01.jpg,images/fountainpen.jpg,images/bikehelmet.jpg,Ist das ein Bild von einem Füller?,q_u_fueller.wav,u_e_fueller.wav,4,10,Das ist eigentlich ein Bild von einem Füller.,Das ist eigentlich ein Bild von einem ...,Das ist | eigentlich ein Bild von | einem Füller.,Füller,Füller,Bleistift,unreliable,actually,fountainpen.jpg,pencil01.jpg,fountainpen.jpg,fountainpen.jpg,pencil01.jpg,3,9,unreliable
38,critical,pants-shorts,die,die,Badehose,bikepump01,jellybean,Jeans,pants,jeans01.jpg,shorts,swimsuit.jpg,images/swimsuit.jpg,images/bikepump01.jpg,images/jellybean.jpg,images/jeans01.jpg,Ist das ein Bild von einer Jeans?,q_r_jeans.wav,r_t_jeans.wav,2,4,Das ist tatsächlich ein Bild von einer Jeans.,Das ist tatsächlich ein Bild von einer ...,Das ist | tatsächlich ein Bild von | einer Jeans.,Jeans,Jeans,Badehose,reliable,indeed,jeans01.jpg,swimsuit.jpg,jeans01.jpg,jeans01.jpg,swimsuit.jpg,3,10,unreliable
134,critical,boot-rollerblade,der,der,Gummistiefel,triangle,filingcabinet,Inlineskate,boot,rainboot.jpg,rollerblade,rollerblade.jpg,images/rainboot.jpg,images/triangle.jpg,images/filingcabinet.jpg,images/rollerblade.jpg,Ist das ein Bild von einem Gummistiefel?,q_r_gummistiefel.wav,r_e_inlineskate.wav,2,4,Das ist eigentlich ein Bild von einem Inlineskate.,Das ist eigentlich ein Bild von einem ...,Das ist | eigentlich ein Bild von | einem Inlineskate.,Inlineskate,Gummistiefel,Inlineskate,reliable,actually,rainboot.jpg,rollerblade.jpg,rainboot.jpg,rainboot.jpg,rollerblade.jpg,3,11,unreliable
106,critical,panda-polar-bear,der,der,warthog,Eisbär,Panda,alligator,panda,panda.jpg,polar-bear,polarbear.jpg,images/warthog.jpg,images/polarbear.jpg,images/panda.jpg,images/alligator.jpg,Ist das ein Bild von einem Panda?,q_r_panda.wav,r_e_eisbaer.wav,2,1,Das ist eigentlich ein Bild von einem Eisbär.,Das ist eigentlich ein Bild von einem ...,Das ist | eigentlich ein Bild von | einem Eisbär.,Eisbär,Panda,Eisbär,reliable,actually,panda.jpg,polarbear.jpg,panda.jpg,panda.jpg,polarbear.jpg,3,12,unreliable
160,critical,saxophone-cornet,das,das,revolver,Saxophon,Kornett,shower,saxophone,saxophone.jpg,cornet,cornet.jpg,images/revolver.jpg,images/saxophone.jpg,images/cornet.jpg,images/shower.jpg,Ist das ein Bild von einem Saxophon?,q_r_saxophon.wav,r_e_kornett.wav,4,6,Das ist eigentlich ein Bild von einem Kornett.,Das ist eigentlich ein Bild von einem ...,Das ist | eigentlich ein Bild von | einem Kornett.,Kornett,Saxophon,Kornett,reliable,actually,saxophone.jpg,cornet.jpg,saxophone.jpg,saxophone.jpg,cornet.jpg,4,1,unreliable
162,critical,stapler-staple-remover,der,der,icecreamcone01a,Tacker,Heftklammerentferner,tank,stapler,stapler03a.jpg,staple-remover,stapleremover.jpg,images/icecreamcone01a.jpg,images/stapler03a.jpg,images/stapleremover.jpg,images/tank.jpg,Ist das ein Bild von einem Tacker?,q_u_tacker.wav,u_t_heftklammerentferner.wav,2,7,Das ist tatsächlich ein Bild von einem Heftklammerentferner.,Das ist tatsächlich ein Bild von einem ...,Das ist | tatsächlich ein Bild von | einem Heftklammerentferner.,Heftklammerentferner,Tacker,Heftklammerentferner,unreliable,indeed,stapler03a.jpg,stapleremover.jpg,stapler03a.jpg,stapler03a.jpg,stapleremover.jpg,4,2,unreliable
219,filler,frisbee,NA,NA,ferry,trailer,frisbee,shipinabottle,NA,NA,NA,NA,images/ferry.jpg,images/trailer.jpg,images/frisbee.jpg,images/shipinabottle.jpg,"Wie heißt das gelbe Ding, was man werfen kann?",q_f_frisbee.wav,f_frisbee.wav,NA,4,Das ist eine Frisbee.,Das ist eine ...,Das ist | eine Frisbee.,frisbee,NA,NA,filler,NA,frisbee.jpg,ferry.jpg,frisbee.jpg,frisbee.jpg,ferry.jpg,4,3,unreliable
144,critical,oven-fridge,der,der,huntingknife,Ofen,Kühlschrank,grandpiano,oven,oven.jpg,fridge,fridge.jpg,images/huntingknife.jpg,images/oven.jpg,images/fridge.jpg,images/grandpiano.jpg,Ist das ein Bild von einem Ofen?,q_r_ofen.wav,r_e_kuehlschrank.wav,4,5,Das ist eigentlich ein Bild von einem Kühlschrank.,Das ist eigentlich ein Bild von einem ...,Das ist | eigentlich ein Bild von | einem Kühlschrank.,Kühlschrank,Ofen,Kühlschrank,reliable,actually,oven.jpg,fridge.jpg,oven.jpg,oven.jpg,fridge.jpg,4,4,unreliable
50,critical,tire-life-preserver,der,der,Reifen,mortarandpestle,shelf,Rettungsring,tire,tire.jpg,life-preserver,lifesaver.jpg,images/tire.jpg,images/mortarandpestle.jpg,images/shelf.jpg,images/lifesaver.jpg,Ist das ein Bild von einem Reifen?,q_r_reifen.wav,r_t_reifen.wav,2,5,Das ist tatsächlich ein Bild von einem Reifen.,Das ist tatsächlich ein Bild von einem ...,Das ist | tatsächlich ein Bild von | einem Reifen.,Reifen,Reifen,Rettungsring,reliable,indeed,tire.jpg,lifesaver.jpg,tire.jpg,tire.jpg,lifesaver.jpg,4,5,unreliable
68,critical,needlenose-pliers-scissors,die,die,Kneifzange,computermouse06,lamp04a,Schere,needlenose-pliers,needlenosepliers01.jpg,scissors,scissors01.jpg,images/needlenosepliers01.jpg,images/computermouse06.jpg,images/lamp04a.jpg,images/scissors01.jpg,Ist das ein Bild von einer Kneifzange?,q_u_kneifzange.wav,u_e_kneifzange.wav,4,7,Das ist eigentlich ein Bild von einer Kneifzange.,Das ist eigentlich ein Bild von einer ...,Das ist | eigentlich ein Bild von | einer Kneifzange.,Kneifzange,Kneifzange,Schere,unreliable,actually,needlenosepliers01.jpg,scissors01.jpg,needlenosepliers01.jpg,needlenosepliers01.jpg,scissors01.jpg,4,6,unreliable
47,critical,pinboard-calendar,die,die,Kalender,Pinnwand,cannon,electrictoothbrush01c,pinboard,corkboard.jpg,calendar,calendar.jpg,images/calendar.jpg,images/corkboard.jpg,images/cannon.jpg,images/electrictoothbrush01c.jpg,Ist das ein Bild von einer Pinnwand?,q_r_pinnwand.wav,r_t_pinnwand.wav,3,5,Das ist tatsächlich ein Bild von einer Pinnwand.,Das ist tatsächlich ein Bild von einer ...,Das ist | tatsächlich ein Bild von | einer Pinnwand.,Pinnwand,Pinnwand,Kalender,reliable,indeed,corkboard.jpg,calendar.jpg,corkboard.jpg,corkboard.jpg,calendar.jpg,4,7,unreliable
200,critical,clipboard-binder,das,der,stuffedanimal02b,Ordner,Klemmbrett,nailpolish03b,clipboard,clipboard.jpg,binder,binder03b.jpg,images/stuffedanimal02b.jpg,images/binder03b.jpg,images/clipboard.jpg,images/nailpolish03b.jpg,Ist das ein Bild von einem Klemmbrett?,q_u_klemmbrett.wav,u_t_ordner.wav,4,10,Das ist tatsächlich ein Bild von einem Ordner.,Das ist tatsächlich ein Bild von einem ...,Das ist | tatsächlich ein Bild von | einem Ordner.,Ordner,Klemmbrett,Ordner,unreliable,indeed,clipboard.jpg,binder03b.jpg,clipboard.jpg,clipboard.jpg,binder03b.jpg,4,8,unreliable
202,filler,cuttlefish,NA,NA,grizzly,cuttlefish,kingfisher,mouse,NA,NA,NA,NA,images/grizzly.jpg,images/cuttlefish.jpg,images/kingfisher.jpg,images/mouse.jpg,Was ist das für ein Tier mit dem seltsamen Kopf?,q_f_tintenfisch.wav,f_tintenfisch.wav,NA,1,Das ist ein Tintenfisch.,Das ist ein ...,Das ist | ein Tintenfisch.,cuttlefish,NA,NA,filler,NA,cuttlefish.jpg,grizzly.jpg,cuttlefish.jpg,cuttlefish.jpg,grizzly.jpg,4,9,unreliable
24,critical,bicycle-motorbike,das,das,bookshelf,Motorrad,Fahrrad,totempole,bicycle,bicycle.jpg,motorbike,motorcycle.jpg,images/bookshelf.jpg,images/motorcycle.jpg,images/bicycle.jpg,images/totempole.jpg,Ist das ein Bild von einem Fahrrad?,q_r_fahrrad.wav,r_t_fahrrad.wav,4,3,Das ist tatsächlich ein Bild von einem Fahrrad.,Das ist tatsächlich ein Bild von einem ...,Das ist | tatsächlich ein Bild von | einem Fahrrad.,Fahrrad,Fahrrad,Motorrad,reliable,indeed,bicycle.jpg,motorcycle.jpg,bicycle.jpg,bicycle.jpg,motorcycle.jpg,4,10,unreliable
75,critical,bottle-opener-shoehorn,der,der,candleholder01,leaf02a,Schuhlöffel,Flaschenöffner,bottle-opener,bottleopener01.jpg,shoehorn,shoehorn.jpg,images/candleholder01.jpg,images/leaf02a.jpg,images/shoehorn.jpg,images/bottleopener01.jpg,Ist das ein Bild von einem Flaschenöffner?,q_u_flaschenoeffner.wav,u_e_flaschenoeffner.wav,3,8,Das ist eigentlich ein Bild von einem Flaschenöffner.,Das ist eigentlich ein Bild von einem ...,Das ist | eigentlich ein Bild von | einem Flaschenöffner.,Flaschenöffner,Flaschenöffner,Schuhlöffel,unreliable,actually,bottleopener01.jpg,shoehorn.jpg,bottleopener01.jpg,bottleopener01.jpg,shoehorn.jpg,4,11,unreliable
133,critical,mailbox-gargabe-can,der,der,dolly01,tambourine03,Mülleimer,Briefkasten,mailbox,postalmailbox01.jpg,gargabe-can,garbagebin.jpg,images/dolly01.jpg,images/tambourine03.jpg,images/garbagebin.jpg,images/postalmailbox01.jpg,Ist das ein Bild von einem Briefkasten?,q_r_briefkasten.wav,r_e_muelleimer.wav,1,4,Das ist eigentlich ein Bild von einem Mülleimer.,Das ist eigentlich ein Bild von einem ...,Das ist | eigentlich ein Bild von | einem Mülleimer.,Mülleimer,Briefkasten,Mülleimer,reliable,actually,postalmailbox01.jpg,garbagebin.jpg,postalmailbox01.jpg,postalmailbox01.jpg,garbagebin.jpg,4,12,unreliable
42,critical,chair-stool,der,der,Klappstuhl,accordion01,skihelmet01,Hocker,chair,foldingchair.jpg,stool,stool01.jpg,images/foldingchair.jpg,images/accordion01.jpg,images/skihelmet01.jpg,images/stool01.jpg,Ist das ein Bild von einem Klappstuhl?,q_r_klappstuhl.wav,r_t_klappstuhl.wav,2,5,Das ist tatsächlich ein Bild von einem Klappstuhl.,Das ist tatsächlich ein Bild von einem ...,Das ist | tatsächlich ein Bild von | einem Klappstuhl.,Klappstuhl,Klappstuhl,Hocker,reliable,indeed,foldingchair.jpg,stool01.jpg,foldingchair.jpg,foldingchair.jpg,stool01.jpg,5,1,unreliable
205,filler,platypus,NA,NA,cougar,platypus,greathornowl,crocodile,NA,NA,NA,NA,images/cougar.jpg,images/platypus.jpg,images/greathornowl.jpg,images/crocodile.jpg,Was ist das mit dem Schabel für ein Tier?,q_f_schnabeltier.wav,f_schnabeltier.wav,NA,1,Das ist ein Schnabeltier.,Das ist ein ...,Das ist | ein Schnabeltier.,platypus,NA,NA,filler,NA,platypus.jpg,cougar.jpg,platypus.jpg,platypus.jpg,cougar.jpg,5,2,unreliable
7,critical,tiger-lion,der,der,bluejay,beaver,Löwe,Tiger,tiger,tiger02.jpg,lion,lion.jpg,images/bluejay.jpg,images/beaver.jpg,images/lion.jpg,images/tiger02.jpg,Ist das ein Bild von einem Tiger?,q_r_tiger.wav,r_t_tiger.wav,3,1,Das ist tatsächlich ein Bild von einem Tiger.,Das ist tatsächlich ein Bild von einem ...,Das ist | tatsächlich ein Bild von | einem Tiger.,Tiger,Tiger,Löwe,reliable,indeed,tiger02.jpg,lion.jpg,tiger02.jpg,tiger02.jpg,lion.jpg,5,3,unreliable
78,critical,candle-chalk,die,die,tuque03a,Kerze,Kreide,sewingmachine01a,candle,candle01.jpg,chalk,chalk.jpg,images/tuque03a.jpg,images/candle01.jpg,images/chalk.jpg,images/sewingmachine01a.jpg,Ist das ein Bild von einer Kerze?,q_u_kerze.wav,u_e_kerze.wav,2,8,Das ist eigentlich ein Bild von einer Kerze.,Das ist eigentlich ein Bild von einer ...,Das ist | eigentlich ein Bild von | einer Kerze.,Kerze,Kerze,Kreide,unreliable,actually,candle01.jpg,chalk.jpg,candle01.jpg,candle01.jpg,chalk.jpg,5,4,unreliable
116,critical,duck-seagull,die,die,Ente,jellyfish,cobra,Seemöwe,duck,duck01.jpg,seagull,seagull.jpg,images/duck01.jpg,images/jellyfish.jpg,images/cobra.jpg,images/seagull.jpg,Ist das ein Bild von einer Ente?,q_r_ente.wav,r_e_seemoewe.wav,4,2,Das ist eigentlich ein Bild von einer Seemöwe.,Das ist eigentlich ein Bild von einer ...,Das ist | eigentlich ein Bild von | einer Seemöwe.,Seemöwe,Ente,Seemöwe,reliable,actually,duck01.jpg,seagull.jpg,duck01.jpg,duck01.jpg,seagull.jpg,5,5,unreliable
77,critical,rope-yarn,das,das,Seil,Wollknäuel,ring01,crayon,rope,rope03.jpg,yarn,yarn.jpg,images/rope03.jpg,images/yarn.jpg,images/ring01.jpg,images/crayon.jpg,Ist das ein Bild von einem Seil?,q_u_seil.wav,u_e_seil.wav,1,8,Das ist eigentlich ein Bild von einem Seil.,Das ist eigentlich ein Bild von einem ...,Das ist | eigentlich ein Bild von | einem Seil.,Seil,Seil,Wollknäuel,unreliable,actually,rope03.jpg,yarn.jpg,rope03.jpg,rope03.jpg,yarn.jpg,5,6,unreliable
170,critical,car-key-usb-stick,der,der,screwdriver04b,Autoschlüssel,USB-Stick,binoculars01b,car-key,carkey.jpg,usb-stick,usbkey.jpg,images/screwdriver04b.jpg,images/carkey.jpg,images/usbkey.jpg,images/binoculars01b.jpg,Ist das ein Bild von einem Autoschlüssel?,q_u_autoschluessel.wav,u_t_usbstick.wav,2,7,Das ist tatsächlich ein Bild von einem USB-Stick.,Das ist tatsächlich ein Bild von einem ...,Das ist | tatsächlich ein Bild von | einem USB-Stick.,USB-Stick,Autoschlüssel,USB-Stick,unreliable,indeed,carkey.jpg,usbkey.jpg,carkey.jpg,carkey.jpg,usbkey.jpg,5,7,unreliable
249,filler,rake,NA,NA,dresser02,busshelter,bowrake,megaphone,NA,NA,NA,NA,images/dresser02.jpg,images/busshelter.jpg,images/bowrake.jpg,images/megaphone.jpg,Benutzt man das hier für Blätter?,q_f_harke.wav,f_harke.wav,NA,9,"Ja, das nennt sich Harke.","Ja, das nennt sich ...","Ja, | das nennt sich | Harke.",bowrake,NA,NA,filler,NA,bowrake.jpg,dresser02.jpg,bowrake.jpg,bowrake.jpg,dresser02.jpg,5,8,unreliable
120,critical,gecko-chameleon,der,das,Chamäleon,Gecko,sapsucker,fennec,gecko,gecko.jpg,chameleon,chameleon.jpg,images/chameleon.jpg,images/gecko.jpg,images/sapsucker.jpg,images/fennec.jpg,Ist das ein Bild von einem Gecko?,q_r_gecko.wav,r_e_chameleon.wav,4,2,Das ist eigentlich ein Bild von einem Chamäleon.,Das ist eigentlich ein Bild von einem ...,Das ist | eigentlich ein Bild von | einem Chamäleon.,Chamäleon,Gecko,Chamäleon,reliable,actually,gecko.jpg,chameleon.jpg,gecko.jpg,gecko.jpg,chameleon.jpg,5,9,unreliable
114,critical,monkey-gorilla,der,der,hammerheadshark,Gorilla,Affen,riverotter,monkey,macaque.jpg,gorilla,gorilla.jpg,images/hammerheadshark.jpg,images/gorilla.jpg,images/macaque.jpg,images/riverotter.jpg,Ist das ein Bild von einem Affen?,q_r_affe.wav,r_e_gorilla.wav,2,2,Das ist eigentlich ein Bild von einem Gorilla.,Das ist eigentlich ein Bild von einem ...,Das ist | eigentlich ein Bild von | einem Gorilla.,Gorilla,Affen,Gorilla,reliable,actually,macaque.jpg,gorilla.jpg,macaque.jpg,macaque.jpg,gorilla.jpg,5,10,unreliable
58,critical,cable-hose,das,der,Kabel,diploma01,clover,Schlauch,cable,usbcable01a.jpg,hose,hose.jpg,images/usbcable01a.jpg,images/diploma01.jpg,images/clover.jpg,images/hose.jpg,Ist das ein Bild von einem Kabel?,q_r_kabel1.wav,r_t_kabel.wav,2,6,Das ist tatsächlich ein Bild von einem Kabel.,Das ist tatsächlich ein Bild von einem ...,Das ist | tatsächlich ein Bild von | einem Kabel.,Kabel,Kabel,Schlauch,reliable,indeed,usbcable01a.jpg,hose.jpg,usbcable01a.jpg,usbcable01a.jpg,hose.jpg,5,11,unreliable
181,critical,cauliflower-broccoli,der,der,potatomasher03b,ashtray01,Blumenkohl,Broccoli,cauliflower,cauliflower01.jpg,broccoli,broccoli01a.jpg,images/potatomasher03b.jpg,images/ashtray01.jpg,images/cauliflower01.jpg,images/broccoli01a.jpg,Ist das ein Bild von einem Blumenkohl?,q_u_blumenkohl.wav,u_t_brokkoli.wav,1,9,Das ist tatsächlich ein Bild von einem Broccoli.,Das ist tatsächlich ein Bild von einem ...,Das ist | tatsächlich ein Bild von | einem Broccoli.,Broccoli,Blumenkohl,Broccoli,unreliable,indeed,cauliflower01.jpg,broccoli01a.jpg,cauliflower01.jpg,cauliflower01.jpg,broccoli01a.jpg,5,12,unreliable
222,filler,lawn-mower,NA,NA,firtree,lawnmower,washingmachine,watercooler,NA,NA,NA,NA,images/firtree.jpg,images/lawnmower.jpg,images/washingmachine.jpg,images/watercooler.jpg,Benutzt man das hier zum Gras schneiden?,q_f_rasenmaeher.wav,f_rasenmaeher.wav,NA,4,"Ja, das nennt sich Rasenmäher.","Ja, das nennt sich ...","Ja, | das nennt sich | Rasenmäher.",lawnmower,NA,NA,filler,NA,lawnmower.jpg,firtree.jpg,lawnmower.jpg,lawnmower.jpg,firtree.jpg,6,1,unreliable
127,critical,soccerball-golf-ball,der,der,Fußball,Golfball,safe,stepladder,soccer-ball,soccerball.jpg,golf-ball,golfball.jpg,images/soccerball.jpg,images/golfball.jpg,images/safe.jpg,images/stepladder.jpg,Ist das ein Bild von einem Fußball?,q_r_fussball.wav,r_e_golfball.wav,3,3,Das ist eigentlich ein Bild von einem Golfball.,Das ist eigentlich ein Bild von einem ...,Das ist | eigentlich ein Bild von | einem Golfball.,Golfball,Fußball,Golfball,reliable,actually,soccerball.jpg,golfball.jpg,soccerball.jpg,soccerball.jpg,golfball.jpg,6,2,unreliable
67,critical,measuring-cup-beer-mug,der,der,tray,globe,Bierkrug,Messbecher,measuring-cup,measuringcup01.jpg,beer-mug,beermug01a.jpg,images/tray.jpg,images/globe.jpg,images/beermug01a.jpg,images/measuringcup01.jpg,Ist das ein Bild von einem Messbecher?,q_u_messbecher.wav,u_e_messbecher.wav,3,7,Das ist eigentlich ein Bild von einem Messbecher.,Das ist eigentlich ein Bild von einem ...,Das ist | eigentlich ein Bild von | einem Messbecher.,Messbecher,Messbecher,Bierkrug,unreliable,actually,measuringcup01.jpg,beermug01a.jpg,measuringcup01.jpg,measuringcup01.jpg,beermug01a.jpg,6,3,unreliable
136,critical,hat-hard-hat,der,der,radiator,Hut,Schutzhelm,arrow02,hat,witchhat.jpg,hard-hat,hardhat02.jpg,images/radiator.jpg,images/witchhat.jpg,images/hardhat02.jpg,images/arrow02.jpg,Ist das ein Bild von einem Hut?,q_r_hut.wav,r_e_schutzhelm.wav,4,4,Das ist eigentlich ein Bild von einem Schutzhelm.,Das ist eigentlich ein Bild von einem ...,Das ist | eigentlich ein Bild von | einem Schutzhelm.,Schutzhelm,Hut,Schutzhelm,reliable,actually,witchhat.jpg,hardhat02.jpg,witchhat.jpg,witchhat.jpg,hardhat02.jpg,6,4,unreliable
25,critical,bus-truck,der,der,birdnest,poolnet,Lastwagen,Bus,bus,bus.jpg,truck,boxtruck.jpg,images/birdnest.jpg,images/poolnet.jpg,images/boxtruck.jpg,images/bus.jpg,Ist das ein Bild von einem Bus?,q_r_bus.wav,r_t_bus.wav,1,3,Das ist tatsächlich ein Bild von einem Bus.,Das ist tatsächlich ein Bild von einem ...,Das ist | tatsächlich ein Bild von | einem Bus.,Bus,Bus,Lastwagen,reliable,indeed,bus.jpg,boxtruck.jpg,bus.jpg,bus.jpg,boxtruck.jpg,6,5,unreliable
29,critical,wine-beer,der,das,basketballhoop01,badmintonracket,Flasche Wein,Flasche Bier,wine,bottleofwhitewine.jpg,beer,beerbottle.jpg,images/basketballhoop01.jpg,images/badmintonracket.jpg,images/bottleofwhitewine.jpg,images/beerbottle.jpg,Ist das ein Bild von einer Flasche Wein?,q_r_flaschewein.wav,r_t_flaschewein.wav,1,3,Das ist tatsächlich ein Bild von einer Flasche Wein.,Das ist tatsächlich ein Bild von einer ...,Das ist | tatsächlich ein Bild von | einer Flasche Wein.,Flasche Wein,Flasche Wein,Flasche Bier,reliable,indeed,bottleofwhitewine.jpg,beerbottle.jpg,bottleofwhitewine.jpg,bottleofwhitewine.jpg,beerbottle.jpg,6,6,unreliable
61,critical,strainer-plastic-basket,das,der,Sieb,Korb,alarmclock01,apple07,strainer,strainer02.jpg,plastic-basket,plasticbasket01a.jpg,images/strainer02.jpg,images/plasticbasket01a.jpg,images/alarmclock01.jpg,images/apple07.jpg,Ist das ein Bild von einem Sieb?,q_u_sieb.wav,u_e_sieb.wav,1,7,Das ist eigentlich ein Bild von einem Sieb.,Das ist eigentlich ein Bild von einem ...,Das ist | eigentlich ein Bild von | einem Sieb.,Sieb,Sieb,Korb,unreliable,actually,strainer02.jpg,plasticbasket01a.jpg,strainer02.jpg,strainer02.jpg,plasticbasket01a.jpg,6,7,unreliable
255,filler,trophy,NA,NA,picnictable,nametag01a,trophy01,linedpaper,NA,NA,NA,NA,images/picnictable.jpg,images/nametag01a.jpg,images/trophy01.jpg,images/linedpaper.jpg,Magst du auch das sehr glänzende Ding?,q_f_trophaee.wav,f_trophaee.wav,NA,10,"Ja, das ist eine sehr glänzende Trophäe.","Ja, das ist eine sehr glänzende ...","Ja, | das ist | eine sehr glänzende Trophäe.",trophy01,NA,NA,filler,NA,trophy01.jpg,picnictable.jpg,trophy01.jpg,trophy01.jpg,picnictable.jpg,6,8,unreliable
126,critical,basketball-volleyball,der,der,Basketball,skipole,bowlingpin,Volleyball,basketball,basketball01.jpg,volleyball,volleyball.jpg,images/basketball01.jpg,images/skipole.jpg,images/bowlingpin.jpg,images/volleyball.jpg,Ist das ein Bild von einem Basketball?,q_r_basketball.wav,r_e_volleyball.wav,2,3,Das ist eigentlich ein Bild von einem Volleyball.,Das ist eigentlich ein Bild von einem ...,Das ist | eigentlich ein Bild von | einem Volleyball.,Volleyball,Basketball,Volleyball,reliable,actually,basketball01.jpg,volleyball.jpg,basketball01.jpg,basketball01.jpg,volleyball.jpg,6,9,unreliable
191,critical,pen-mechanical-pen,der,der,Druckbleistift,Kugelschreiber,cardboardbox,plate01b,pen,pen04b.jpg,mechanical-pen,mechanicalpencil02.jpg,images/mechanicalpencil02.jpg,images/pen04b.jpg,images/cardboardbox.jpg,images/plate01b.jpg,Ist das ein Bild von einem Kugelschreiber?,q_u_kugelschreiber.wav,u_t_druckbleistift.wav,3,10,Das ist tatsächlich ein Bild von einem Druckbleistift.,Das ist tatsächlich ein Bild von einem ...,Das ist | tatsächlich ein Bild von | einem Druckbleistift.,Druckbleistift,Kugelschreiber,Druckbleistift,unreliable,indeed,pen04b.jpg,mechanicalpencil02.jpg,pen04b.jpg,pen04b.jpg,mechanicalpencil02.jpg,6,10,unreliable
188,critical,sunglasses-swim-goggles,die,die,violin,Sonnenbrille,Schwimmbrille,mug01,sunglasses,sunglasses04.jpg,swim-goggles,swimgoggles.jpg,images/violin.jpg,images/sunglasses04.jpg,images/swimgoggles.jpg,images/mug01.jpg,Ist das ein Bild von einer Sonnenbrille?,q_u_sonnenbrille.wav,u_t_schwimmbrille.wav,4,9,Das ist tatsächlich ein Bild von einer Schwimmbrille.,Das ist tatsächlich ein Bild von einer ...,Das ist | tatsächlich ein Bild von | einer Schwimmbrille.,Schwimmbrille,Sonnenbrille,Schwimmbrille,unreliable,indeed,sunglasses04.jpg,swimgoggles.jpg,sunglasses04.jpg,sunglasses04.jpg,swimgoggles.jpg,6,11,unreliable
1,critical,wolf-dog,der,der,Wolf,Hund,holdfast,americangoldfinch,wolf,greywolf.jpg,dog,greyhound.jpg,images/greywolf.jpg,images/greyhound.jpg,images/holdfast.jpg,images/americangoldfinch.jpg,Ist das ein Bild von einem Wolf?,q_r_wolf.wav,r_t_wolf.wav,1,1,Das ist tatsächlich ein Bild von einem Wolf.,Das ist tatsächlich ein Bild von einem ...,Das ist | tatsächlich ein Bild von | einem Wolf.,Wolf,Wolf,Hund,reliable,indeed,greywolf.jpg,greyhound.jpg,greywolf.jpg,greywolf.jpg,greyhound.jpg,6,12,unreliable
18,critical,squirrel-skunk,das,das,bison,Eichhörnchen,Stinktier,jaguar,squirrel,squirrel.jpg,skunk,skunk.jpg,images/bison.jpg,images/squirrel.jpg,images/skunk.jpg,images/jaguar.jpg,Ist das ein Bild von einem Eichhörnchen?,q_r_eichhoernchen.wav,r_t_eichhoernchen.wav,2,2,Das ist tatsächlich ein Bild von einem Eichhörnchen.,Das ist tatsächlich ein Bild von einem ...,Das ist | tatsächlich ein Bild von | einem Eichhörnchen.,Eichhörnchen,Eichhörnchen,Stinktier,reliable,indeed,squirrel.jpg,skunk.jpg,squirrel.jpg,squirrel.jpg,skunk.jpg,7,1,unreliable
208,filler,clownfish,NA,NA,bassethound,americanwhitepelican,honeybee,clownfish,NA,NA,NA,NA,images/bassethound.jpg,images/americanwhitepelican.jpg,images/honeybee.jpg,images/clownfish.jpg,Wie heißt das orangene Tier?,q_f_clownfisch.wav,f_clownfisch.wav,NA,2,Das ist ein Clownfisch.,Das ist ein ...,Das ist | ein Clownfisch.,clownfish,NA,NA,filler,NA,clownfish.jpg,bassethound.jpg,clownfish.jpg,clownfish.jpg,bassethound.jpg,7,2,unreliable
95,critical,power-cable-ribbon,das,das,Kabel,Geschenkband,bucket01a,cane,power-cable,powercable.jpg,ribbon,ribbon04.jpg,images/powercable.jpg,images/ribbon04.jpg,images/bucket01a.jpg,images/cane.jpg,Ist das ein Bild von einem Kabel?,q_u_kabel2.wav,u_e_kabel.wav,3,10,Das ist eigentlich ein Bild von einem Kabel.,Das ist eigentlich ein Bild von einem ...,Das ist | eigentlich ein Bild von | einem Kabel.,Kabel,Kabel,Geschenkband,unreliable,actually,powercable.jpg,ribbon04.jpg,powercable.jpg,powercable.jpg,ribbon04.jpg,7,3,unreliable
102,critical,crab-spider,die,die,tern,Krabbe,Spinne,lizard,crab,crab01.jpg,spider,daddylonglegs.jpg,images/tern.jpg,images/crab01.jpg,images/daddylonglegs.jpg,images/lizard.jpg,Ist das ein Bild von einer Krabbe?,q_r_krabbe.wav,r_e_spinne.wav,2,1,Das ist eigentlich ein Bild von einer Spinne.,Das ist eigentlich ein Bild von einer ...,Das ist | eigentlich ein Bild von | einer Spinne.,Spinne,Krabbe,Spinne,reliable,actually,crab01.jpg,daddylonglegs.jpg,crab01.jpg,crab01.jpg,daddylonglegs.jpg,7,4,unreliable
65,critical,frying-pan-pot,der,der,Topf,Wok,whisk,fan,frying-pan,fryingpan02a.jpg,pot,pot02a.jpg,images/pot02a.jpg,images/fryingpan02a.jpg,images/whisk.jpg,images/fan.jpg,Ist das ein Bild von einem Wok?,q_u_wok.wav,u_e_wok.wav,1,7,Das ist eigentlich ein Bild von einem Wok.,Das ist eigentlich ein Bild von einem ...,Das ist | eigentlich ein Bild von | einem Wok.,Wok,Wok,Topf,unreliable,actually,fryingpan02a.jpg,pot02a.jpg,fryingpan02a.jpg,fryingpan02a.jpg,pot02a.jpg,7,5,unreliable
233,filler,Rubiks-cube,NA,NA,dishrack,securitycamera,rubikcube,apron,NA,NA,NA,NA,images/dishrack.jpg,images/securitycamera.jpg,images/rubikcube.jpg,images/apron.jpg,Wie heißt das bunte Ding?,q_f_zauberwuerfel.wav,f_zauberwuerfel.wav,NA,6,Das ist ein Zauberwürfel.,Das ist ein ...,Das ist | ein Zauberwürfel.,rubikcube,NA,NA,filler,NA,rubikcube.jpg,dishrack.jpg,rubikcube.jpg,rubikcube.jpg,dishrack.jpg,7,6,unreliable
199,critical,headphones-hairband,der,der,Haarreifen,Kopfhörer,candy,leek,headphones,headphones02b.jpg,hairband,hairband.jpg,images/hairband.jpg,images/headphones02b.jpg,images/candy.jpg,images/leek.jpg,Ist das ein Bild von einem Kopfhörer?,q_u_kopfhoerer.wav,u_t_haarreif.wav,3,10,Das ist tatsächlich ein Bild von einer Haarreifen.,Das ist tatsächlich ein Bild von einer ...,Das ist | tatsächlich ein Bild von | einer Haarreifen.,Haarreifen,Kopfhörer,Haarreifen,unreliable,indeed,headphones02b.jpg,hairband.jpg,headphones02b.jpg,headphones02b.jpg,hairband.jpg,7,7,unreliable
48,critical,tennis-racket-snowshoe,der,der,television,Schneeschuh,Tennisschläger,jokercard,tennis-racket,tennisracket.jpg,snowshoe,snowshoe.jpg,images/television.jpg,images/snowshoe.jpg,images/tennisracket.jpg,images/jokercard.jpg,Ist das ein Bild von einem Tennisschläger?,q_r_tennisschlaeger.wav,r_t_tennisschlaeger.wav,4,5,Das ist tatsächlich ein Bild von einem Tennisschläger.,Das ist tatsächlich ein Bild von einem ...,Das ist | tatsächlich ein Bild von | einem Tennisschläger.,Tennisschläger,Tennisschläger,Schneeschuh,reliable,indeed,tennisracket.jpg,snowshoe.jpg,tennisracket.jpg,tennisracket.jpg,snowshoe.jpg,7,8,unreliable
35,critical,knife-sword,das,das,Messer,Schwert,candelabra,bikewheel,knife,knife03.jpg,sword,sword01.jpg,images/knife03.jpg,images/sword01.jpg,images/candelabra.jpg,images/bikewheel.jpg,Ist das ein Bild von einem Messer?,q_r_messer.wav,r_t_messer.wav,3,4,Das ist tatsächlich ein Bild von einem Messer.,Das ist tatsächlich ein Bild von einem ...,Das ist | tatsächlich ein Bild von | einem Messer.,Messer,Messer,Schwert,reliable,indeed,knife03.jpg,sword01.jpg,knife03.jpg,knife03.jpg,sword01.jpg,7,9,unreliable
183,critical,toast-baguette,das,das,Baguette,Toastbrot,lipstick02a,teabag,toast,toast.jpg,baguette,baguette01.jpg,images/baguette01.jpg,images/toast.jpg,images/lipstick02a.jpg,images/teabag.jpg,Ist das ein Bild von einem Toastbrot?,q_u_toastbrot.wav,u_t_baguette.wav,3,9,Das ist tatsächlich ein Bild von einem Baguette.,Das ist tatsächlich ein Bild von einem ...,Das ist | tatsächlich ein Bild von | einem Baguette.,Baguette,Toastbrot,Baguette,unreliable,indeed,toast.jpg,baguette01.jpg,toast.jpg,toast.jpg,baguette01.jpg,7,10,unreliable
151,critical,boat-ship,das,das,Boot,Schiff,puzzle,fern,boat,sailboat.jpg,ship,cruiseship.jpg,images/sailboat.jpg,images/cruiseship.jpg,images/puzzle.jpg,images/fern.jpg,Ist das ein Bild von einem Boot?,q_r_boot.wav,r_e_schiff.wav,3,6,Das ist eigentlich ein Bild von einem Schiff.,Das ist eigentlich ein Bild von einem ...,Das ist | eigentlich ein Bild von | einem Schiff.,Schiff,Boot,Schiff,reliable,actually,sailboat.jpg,cruiseship.jpg,sailboat.jpg,sailboat.jpg,cruiseship.jpg,7,11,unreliable
117,critical,sheep-ram,das,der,Schaaf,Bock,chimpanzee,armadillo,sheep,sheep.jpg,ram,ram.jpg,images/sheep.jpg,images/ram.jpg,images/chimpanzee.jpg,images/armadillo.jpg,Ist das ein Bild von einem Schaaf?,q_r_schaf.wav,r_e_bock.wav,1,2,Das ist eigentlich ein Bild von einem Bock.,Das ist eigentlich ein Bild von einem ...,Das ist | eigentlich ein Bild von | einem Bock.,Bock,Schaaf,Bock,reliable,actually,sheep.jpg,ram.jpg,sheep.jpg,sheep.jpg,ram.jpg,7,12,unreliable
119,critical,Shrimp-lobster,die,die,canadiangoose,toad,Garnele,Languste,shrimp,shrimp.jpg,lobster,rocklobster.jpg,images/canadiangoose.jpg,images/toad.jpg,images/shrimp.jpg,images/rocklobster.jpg,Ist das ein Bild von einer Garnele ?,q_r_garnelle.wav,r_e_languste.wav,3,2,Das ist eigentlich ein Bild von einer Languste.,Das ist eigentlich ein Bild von einer ...,Das ist | eigentlich ein Bild von | einer Languste.,Languste,Garnele,Languste,reliable,actually,shrimp.jpg,rocklobster.jpg,shrimp.jpg,shrimp.jpg,rocklobster.jpg,8,1,unreliable
141,critical,tower-wind-turbine,der,das,martiniglass01b,gasburner,Windrad,Turm,tower,tower.jpg,wind-turbine,windturbine.jpg,images/martiniglass01b.jpg,images/gasburner.jpg,images/windturbine.jpg,images/tower.jpg,Ist das ein Bild von einem Turm?,q_r_turm.wav,r_e_windrad.wav,1,5,Das ist eigentlich ein Bild von einem Windrad.,Das ist eigentlich ein Bild von einem ...,Das ist | eigentlich ein Bild von | einem Windrad.,Windrad,Turm,Windrad,reliable,actually,tower.jpg,windturbine.jpg,tower.jpg,tower.jpg,windturbine.jpg,8,2,unreliable
52,critical,snow-shovel-rake,die,die,tie02,Schneeschippe,Harke,amphora,snow-shovel,snowshovel.jpg,rake,leafrake.jpg,images/tie02.jpg,images/snowshovel.jpg,images/leafrake.jpg,images/amphora.jpg,Ist das ein Bild von einer Schneeschippe?,q_r_schneeschippe.wav,r_t_schneeschippe.wav,4,6,Das ist tatsächlich ein Bild von einer Schneeschippe.,Das ist tatsächlich ein Bild von einer ...,Das ist | tatsächlich ein Bild von | einer Schneeschippe.,Schneeschippe,Schneeschippe,Harke,reliable,indeed,snowshovel.jpg,leafrake.jpg,snowshovel.jpg,snowshovel.jpg,leafrake.jpg,8,3,unreliable
194,critical,belt-rubber-band,der,das,Gürtel,jug,hammer01,Gummiband,belt,belt02a.jpg,rubber-band,rubberband01.jpg,images/belt02a.jpg,images/jug.jpg,images/hammer01.jpg,images/rubberband01.jpg,Ist das ein Bild von einem Gürtel?,q_u_guertel.wav,u_t_gummiband.wav,2,10,Das ist tatsächlich ein Bild von einem Gummiband.,Das ist tatsächlich ein Bild von einem ...,Das ist | tatsächlich ein Bild von | einem Gummiband.,Gummiband,Gürtel,Gummiband,unreliable,indeed,belt02a.jpg,rubberband01.jpg,belt02a.jpg,belt02a.jpg,rubberband01.jpg,8,4,unreliable
226,filler,office-chair,NA,NA,diploma02,gravyboat,crosscountryski,officechair03,NA,NA,NA,NA,images/diploma02.jpg,images/gravyboat.jpg,images/crosscountryski.jpg,images/officechair03.jpg,"Findest du auch, dass das Schwarze gemütlich aussieht?",q_f_stuhl.wav,f_stuhl.wav,NA,5,"Ja, der Stuhl sieht sehr gemütlich aus.","Ja, der ... sieht sehr gemütlich aus.","Ja, | der Stuhl sieht | sehr gemütlich aus.",officechair03,NA,NA,filler,NA,officechair03.jpg,diploma02.jpg,officechair03.jpg,officechair03.jpg,diploma02.jpg,8,5,unreliable
30,critical,bed-couch,das,das,Sofa,chair,toyfiretruck,Bett,bed,bed.jpg,couch,couch02.jpg,images/couch02.jpg,images/chair.jpg,images/toyfiretruck.jpg,images/bed.jpg,Ist das ein Bild von einem Bett?,q_r_bett.wav,r_t_bett.wav,2,3,Das ist tatsächlich ein Bild von einem Bett.,Das ist tatsächlich ein Bild von einem ...,Das ist | tatsächlich ein Bild von | einem Bett.,Bett,Bett,Sofa,reliable,indeed,bed.jpg,couch02.jpg,bed.jpg,bed.jpg,couch02.jpg,8,6,unreliable
40,critical,tractor-tank,der,der,patioumbrella,Panzer,Traktor,foosballtable,tractor,tractor.jpg,tank,tank.jpg,images/patioumbrella.jpg,images/tank.jpg,images/tractor.jpg,images/foosballtable.jpg,Ist das ein Bild von einem Traktor?,q_r_traktor.wav,r_t_traktor.wav,4,4,Das ist tatsächlich ein Bild von einem Traktor.,Das ist tatsächlich ein Bild von einem ...,Das ist | tatsächlich ein Bild von | einem Traktor.,Traktor,Traktor,Panzer,reliable,indeed,tractor.jpg,tank.jpg,tractor.jpg,tractor.jpg,tank.jpg,8,7,unreliable
84,critical,lime-honeydew-melon,die,die,lightbulb01,Honigmelone,Limette,ladle02a,lime,lime.jpg,honeydew-melon,honeydewmelon.jpg,images/lightbulb01.jpg,images/honeydewmelon.jpg,images/lime.jpg,images/ladle02a.jpg,Ist das ein Bild von einer Limette?,q_u_limette.wav,u_e_limette.wav,4,9,Das ist eigentlich ein Bild von einer Limette.,Das ist eigentlich ein Bild von einer ...,Das ist | eigentlich ein Bild von | einer Limette.,Limette,Limette,Honigmelone,unreliable,actually,lime.jpg,honeydewmelon.jpg,lime.jpg,lime.jpg,honeydewmelon.jpg,8,8,unreliable
196,critical,cabbage-lettuce,der,der,nailclipper03b,Kohl,Salat,pictureframe04,cabbage,cabbage.jpg,lettuce,lettuce.jpg,images/nailclipper03b.jpg,images/cabbage.jpg,images/lettuce.jpg,images/pictureframe04.jpg,Ist das ein Bild von einem Kohl?,q_u_kohl.wav,u_t_salat.wav,4,10,Das ist tatsächlich ein Bild von einem Salat.,Das ist tatsächlich ein Bild von einem ...,Das ist | tatsächlich ein Bild von | einem Salat.,Salat,Kohl,Salat,unreliable,indeed,cabbage.jpg,lettuce.jpg,cabbage.jpg,cabbage.jpg,lettuce.jpg,8,9,unreliable
132,critical,airplane-helicopter,das,der,spicerack,Hubschrauber,Flugzeug,jarofapplesauce,airplane,cessna.jpg,helicopter,helicopter.jpg,images/spicerack.jpg,images/helicopter.jpg,images/cessna.jpg,images/jarofapplesauce.jpg,Ist das ein Bild von einem Flugzeug?,q_r_flugzeug.wav,r_e_hubschrauber.wav,4,4,Das ist eigentlich ein Bild von einem Hubschrauber.,Das ist eigentlich ein Bild von einem ...,Das ist | eigentlich ein Bild von | einem Hubschrauber.,Hubschrauber,Flugzeug,Hubschrauber,reliable,actually,cessna.jpg,helicopter.jpg,cessna.jpg,cessna.jpg,helicopter.jpg,8,10,unreliable
71,critical,squeegee-razor,der,der,bracelet04,metronome,Fensterabzieher,Rasierer,squeegee,squeegee01b.jpg,razor,razor01.jpg,images/bracelet04.jpg,images/metronome.jpg,images/squeegee01b.jpg,images/razor01.jpg,Ist das ein Bild von einem Fensterabzieher?,q_u_fensterabszieher.wav,u_e_fensterabzieher.wav,3,8,Das ist eigentlich ein Bild von einem Fensterabzieher.,Das ist eigentlich ein Bild von einem ...,Das ist | eigentlich ein Bild von | einem Fensterabzieher.,Fensterabzieher,Fensterabzieher,Rasierer,unreliable,actually,squeegee01b.jpg,razor01.jpg,squeegee01b.jpg,squeegee01b.jpg,razor01.jpg,8,11,unreliable
252,filler,snowboard,NA,NA,spinningtoy,christmaslights,acousticguitar02,snowboard,NA,NA,NA,NA,images/spinningtoy.jpg,images/christmaslights.jpg,images/acousticguitar02.jpg,images/snowboard.jpg,Kann man hiermit im Schnee spielen?,q_f_snowboard.wav,f_snowboard.wav,NA,9,"Ja, das ist ein Snowboard.","Ja, das ist ein ...","Ja, | das ist | ein Snowboard.",snowboard,NA,NA,filler,NA,snowboard.jpg,spinningtoy.jpg,snowboard.jpg,snowboard.jpg,spinningtoy.jpg,8,12,unreliable
109,critical,fox-raccoon,der,der,Fuchs,Waschbär,seal,falcon,fox,redfox.jpg,raccoon,raccoon.jpg,images/redfox.jpg,images/raccoon.jpg,images/seal.jpg,images/falcon.jpg,Ist das ein Bild von einem Fuchs?,q_r_fuchs.wav,r_e_waschbaer.wav,1,1,Das ist eigentlich ein Bild von einem Waschbär.,Das ist eigentlich ein Bild von einem ...,Das ist | eigentlich ein Bild von | einem Waschbär.,Waschbär,Fuchs,Waschbär,reliable,actually,redfox.jpg,raccoon.jpg,redfox.jpg,redfox.jpg,raccoon.jpg,9,1,unreliable
241,filler,painting,NA,NA,entrancegate,cashregister01,exitsign,painting,NA,NA,NA,NA,images/entrancegate.jpg,images/cashregister01.jpg,images/exitsign.jpg,images/painting.jpg,Magst du auch das Ding mit der Blume?,q_f_gemaelde.wav,f_gemaelde.wav,NA,7,"Ja, das ist ein schönes Gemälde.","Ja, das ist ein schönes ...","Ja, | das ist | ein schönes Gemälde.",painting,NA,NA,filler,NA,painting.jpg,entrancegate.jpg,painting.jpg,painting.jpg,entrancegate.jpg,9,2,unreliable
45,critical,bolt-bullet,die,die,waterlily,lantern03,Schraube,Gewehrkugel,bolt,bolt01a.jpg,bullet,bullet.jpg,images/waterlily.jpg,images/lantern03.jpg,images/bolt01a.jpg,images/bullet.jpg,Ist das ein Bild von einer Schraube?,q_r_schraube.wav,r_t_schraube.wav,1,5,Das ist tatsächlich ein Bild von einer Schraube.,Das ist tatsächlich ein Bild von einer ...,Das ist | tatsächlich ein Bild von | einer Schraube.,Schraube,Schraube,Gewehrkugel,reliable,indeed,bolt01a.jpg,bullet.jpg,bolt01a.jpg,bolt01a.jpg,bullet.jpg,9,3,unreliable
73,critical,jack-drill-bit,der,der,Bohrer,Stecker,measuringtape01,pencilsharpener02a,jack,jack.jpg,drill-bit,drillbit03a.jpg,images/drillbit03a.jpg,images/jack.jpg,images/measuringtape01.jpg,images/pencilsharpener02a.jpg,Ist das ein Bild von einem Stecker?,q_u_stecker.wav,u_e_stecker.wav,1,8,Das ist eigentlich ein Bild von einem Stecker.,Das ist eigentlich ein Bild von einem ...,Das ist | eigentlich ein Bild von | einem Stecker.,Stecker,Stecker,Bohrer,unreliable,actually,jack.jpg,drillbit03a.jpg,jack.jpg,jack.jpg,drillbit03a.jpg,9,4,unreliable
248,filler,waffle-maker,NA,NA,flower01,wafflemaker,scooter,chandelier,NA,NA,NA,NA,images/flower01.jpg,images/wafflemaker.jpg,images/scooter.jpg,images/chandelier.jpg,Benutzt man das hier um Waffeln zu machen?,q_f_waffeleisen.wav,f_waffeleisen.wav,NA,8,"Ja, das ist ein Waffeleisen.","Ja, das ist ein ...","Ja, | das ist | ein Waffeleisen.",wafflemaker,NA,NA,filler,NA,wafflemaker.jpg,flower01.jpg,wafflemaker.jpg,wafflemaker.jpg,flower01.jpg,9,5,unreliable
169,critical,garlic-press-grater,die,die,Knoblauchpresse,Reibe,mascarabrush,battery02b,garlic-press,garlicpress02a.jpg,grater,grater01a.jpg,images/garlicpress02a.jpg,images/grater01a.jpg,images/mascarabrush.jpg,images/battery02b.jpg,Ist das ein Bild von einer Knoblauchpresse?,q_u_knoblauchpresse.wav,u_t_reibe.wav,1,7,Das ist tatsächlich ein Bild von einer Reibe.,Das ist tatsächlich ein Bild von einer ...,Das ist | tatsächlich ein Bild von | einer Reibe.,Reibe,Knoblauchpresse,Reibe,unreliable,indeed,garlicpress02a.jpg,grater01a.jpg,garlicpress02a.jpg,garlicpress02a.jpg,grater01a.jpg,9,6,unreliable
46,critical,blender-coffee-maker,der,der,Kaffeekocher,kiddiepool,barrel01,Mixer,blender,blender.jpg,coffee-maker,coffeemaker.jpg,images/coffeemaker.jpg,images/kiddiepool.jpg,images/barrel01.jpg,images/blender.jpg,Ist das ein Bild von einem Mixer?,q_r_mixer.wav,r_t_mixer.wav,2,5,Das ist tatsächlich ein Bild von einem Mixer.,Das ist tatsächlich ein Bild von einem ...,Das ist | tatsächlich ein Bild von | einem Mixer.,Mixer,Mixer,Kaffeekocher,reliable,indeed,blender.jpg,coffeemaker.jpg,blender.jpg,blender.jpg,coffeemaker.jpg,9,7,unreliable
187,critical,thimble-thread,der,das,Fingerhut,Garn,racquetballracket,chessboard,thimble,thimble.jpg,thread,thread02.jpg,images/thimble.jpg,images/thread02.jpg,images/racquetballracket.jpg,images/chessboard.jpg,Ist das ein Bild von einem Fingerhut?,q_u_fingerhut.wav,u_t_garn.wav,3,9,Das ist tatsächlich ein Bild von einem Garn.,Das ist tatsächlich ein Bild von einem ...,Das ist | tatsächlich ein Bild von | einem Garn.,Garn,Fingerhut,Garn,unreliable,indeed,thimble.jpg,thread02.jpg,thimble.jpg,thimble.jpg,thread02.jpg,9,8,unreliable
74,critical,paper-clip-safety-pin,die,die,peppermill02b,Sicherheitsnadel,Büroklammer,spraybottle01,paper-clip,paperclip03.jpg,safety-pin,safetypin.jpg,images/peppermill02b.jpg,images/safetypin.jpg,images/paperclip03.jpg,images/spraybottle01.jpg,Ist das ein Bild von einer Büroklammer?,q_u_bueroklammer.wav,u_e_bueroklammer.wav,2,8,Das ist eigentlich ein Bild von einer Büroklammer.,Das ist eigentlich ein Bild von einer ...,Das ist | eigentlich ein Bild von | einer Büroklammer.,Büroklammer,Büroklammer,Sicherheitsnagel,unreliable,actually,paperclip03.jpg,safetypin.jpg,paperclip03.jpg,paperclip03.jpg,safetypin.jpg,9,9,unreliable
159,critical,wreath-hula-hoop,der,der,Kranz,Hula-hoop Reifen,keyhole,wetfloorsign,wreath,christmaswreath.jpg,hula-hoop,hulahoop.jpg,images/christmaswreath.jpg,images/hulahoop.jpg,images/keyhole.jpg,images/wetfloorsign.jpg,Ist das ein Bild von einem Kranz?,q_r_kranz.wav,r_e_hulahoopreifen.wav,3,6,Das ist eigentlich ein Bild von einem Hula-hoop Reifen.,Das ist eigentlich ein Bild von einem ...,Das ist | eigentlich ein Bild von | einem Hula-hoop Reifen.,Hula-hoop Reifen,Kranz,Hula-hoop Reifen,reliable,actually,christmaswreath.jpg,hulahoop.jpg,christmaswreath.jpg,christmaswreath.jpg,hulahoop.jpg,9,10,unreliable
104,critical,hippopotamus-rhinoceros,das,das,Nashorn,sealion,cedarwaxwing,Nilpferd,hippopotamus,hippopotamus.jpg,rhinoceros,rhinoceros02.jpg,images/rhinoceros02.jpg,images/sealion.jpg,images/cedarwaxwing.jpg,images/hippopotamus.jpg,Ist das ein Bild von einem Nilpferd?,q_r_nilpferd.wav,r_e_nashorn.wav,4,1,Das ist eigentlich ein Bild von einem Nashorn.,Das ist eigentlich ein Bild von einem ...,Das ist | eigentlich ein Bild von | einem Nashorn.,Nashorn,Nilpferd,Nashorn,reliable,actually,hippopotamus.jpg,rhinoceros02.jpg,hippopotamus.jpg,hippopotamus.jpg,rhinoceros02.jpg,9,11,unreliable
22,critical,snowman-garden-gnome,der,der,Gartenzwerg,turnstile,guitarcase,Schneemann,snowman,snowman.jpg,garden-gnome,gardengnome02.jpg,images/gardengnome02.jpg,images/turnstile.jpg,images/guitarcase.jpg,images/snowman.jpg,Ist das ein Bild von einem Schneemann?,q_r_schneemann.wav,r_t_schneemann.wav,2,3,Das ist tatsächlich ein Bild von einem Schneemann.,Das ist tatsächlich ein Bild von einem ...,Das ist | tatsächlich ein Bild von | einem Schneemann.,Schneemann,Schneemann,Gartenzwerg,reliable,indeed,snowman.jpg,gardengnome02.jpg,snowman.jpg,snowman.jpg,gardengnome02.jpg,9,12,unreliable
123,critical,paper-plane-kite,das,der,Drache,Papierflieger,centurionhelmet,magneticcompass,paper-plane,paperairplane.jpg,kite,kite.jpg,images/kite.jpg,images/paperairplane.jpg,images/centurionhelmet.jpg,images/magneticcompass.jpg,Ist das ein Bild von einem Papierflieger?,q_r_papierflieger.wav,r_e_drachen.wav,3,3,Das ist eigentlich ein Bild von einem Drachen.,Das ist eigentlich ein Bild von einem ...,Das ist | eigentlich ein Bild von | einem Drachen.,Drachen,Papierflieger,Drachen,reliable,actually,paperairplane.jpg,kite.jpg,paperairplane.jpg,paperairplane.jpg,kite.jpg,10,1,unreliable
197,critical,handmixer-iron,der,das,balloon01b,mushroom01,Handmixer,Bügeleisen,handmixer,handmixer01d.jpg,iron,iron01b.jpg,images/balloon01b.jpg,images/mushroom01.jpg,images/handmixer01d.jpg,images/iron01b.jpg,Ist das ein Bild von einem Handmixer?,q_u_handmixer.wav,u_t_buegeleisen.wav,1,10,Das ist tatsächlich ein Bild von einem Bügeleisen.,Das ist tatsächlich ein Bild von einem ...,Das ist | tatsächlich ein Bild von | einem Bügeleisen.,Bügeleisen,Handmixer,Bügeleisen,unreliable,indeed,handmixer01d.jpg,iron01b.jpg,handmixer01d.jpg,handmixer01d.jpg,iron01b.jpg,10,2,unreliable
79,critical,match-toothpick,das,der,hairdryer02a,peach01,Streichholz,Zahnstocher,match,match.jpg,toothpick,toothpick02.jpg,images/hairdryer02a.jpg,images/peach01.jpg,images/match.jpg,images/toothpick02.jpg,Ist das ein Bild von einem Streichholz?,q_u_streichholz.wav,u_e_streichholz.wav,3,8,Das ist eigentlich ein Bild von einem Streichholz.,Das ist eigentlich ein Bild von einem ...,Das ist | eigentlich ein Bild von | einem Streichholz.,Streichholz,Streichholz,Zahnstocher,unreliable,actually,match.jpg,toothpick02.jpg,match.jpg,match.jpg,toothpick02.jpg,10,3,unreliable
113,critical,eagle-vulture,der,der,Geier,Adler,lynx01,bull,eagle,eagle.jpg,vulture,vulture.jpg,images/vulture.jpg,images/eagle.jpg,images/lynx01.jpg,images/bull.jpg,Ist das ein Bild von einem Adler?,q_r_adler.wav,r_e_geier.wav,1,2,Das ist eigentlich ein Bild von einem Geier.,Das ist eigentlich ein Bild von einem ...,Das ist | eigentlich ein Bild von | einem Geier.,Geier,Adler,Geier,reliable,actually,eagle.jpg,vulture.jpg,eagle.jpg,eagle.jpg,vulture.jpg,10,4,unreliable
190,critical,raspberry-red-pepper,die,die,Paprika,sandal,plunger02,Himbeere,raspberry,raspberry01.jpg,red-pepper,pepper04a.jpg,images/pepper04a.jpg,images/sandal.jpg,images/plunger02.jpg,images/raspberry01.jpg,Ist das ein Bild von einer Himbeere?,q_u_himbeere.wav,u_t_paprika.wav,2,9,Das ist tatsächlich ein Bild von einer Paprika.,Das ist tatsächlich ein Bild von einer ...,Das ist | tatsächlich ein Bild von | einer Paprika.,Paprika,Himbeere,Paprika,unreliable,indeed,raspberry01.jpg,pepper04a.jpg,raspberry01.jpg,raspberry01.jpg,pepper04a.jpg,10,5,unreliable
155,critical,coat-rack-lamp,die,die,Gardarobe,Lampe,espressomachine,microwave,coat-rack,coatrack.jpg,lamp,floorlamp.jpg,images/coatrack.jpg,images/floorlamp.jpg,images/espressomachine.jpg,images/microwave.jpg,Ist das ein Bild von einer Gardarobe?,q_r_gadrobe.wav,r_e_lampe.wav,3,6,Das ist eigentlich ein Bild von einer Lampe.,Das ist eigentlich ein Bild von einer ...,Das ist | eigentlich ein Bild von | einer Lampe.,Lampe,Gardarobe,Lampe,reliable,actually,coatrack.jpg,floorlamp.jpg,coatrack.jpg,coatrack.jpg,floorlamp.jpg,10,6,unreliable
76,critical,wallet-glasses-case,das,das,Portemonnaie,bib,mitten04,Brillenetui,wallet,wallet02a.jpg,glasses-case,glassescase.jpg,images/wallet02a.jpg,images/bib.jpg,images/mitten04.jpg,images/glassescase.jpg,Ist das ein Bild von einem Portemonnaie?,q_u_portemonnaie.wav,u_e_portemonnaie.wav,4,8,Das ist eigentlich ein Bild von einem Portemonnaie.,Das ist eigentlich ein Bild von einem ...,Das ist | eigentlich ein Bild von | einem Portemonnaie.,Portemonnaie,Portemonnaie,Brillenetui,unreliable,actually,wallet02a.jpg,glassescase.jpg,wallet02a.jpg,wallet02a.jpg,glassescase.jpg,10,7,unreliable
224,filler,weather-vane,NA,NA,weathervane,tree,pipe,coathook,NA,NA,NA,NA,images/weathervane.jpg,images/tree.jpg,images/pipe.jpg,images/coathook.jpg,Ist das etwas was man auf Hausdächern sieht?,q_f_wetterfahne.wav,f_wetterfahne.wav,NA,4,"Ja, das nennt sich Wetterfahne.","Ja, das nennt sich ...","Ja, | das nennt sich | Wetterfahne.",weathervane,NA,NA,filler,NA,weathervane.jpg,tree.jpg,weathervane.jpg,weathervane.jpg,tree.jpg,10,8,unreliable
28,critical,donut-cupcake,der,der,plantpot,Donut,Muffin,well,donut,donut.jpg,cupcake,cupcake.jpg,images/plantpot.jpg,images/donut.jpg,images/cupcake.jpg,images/well.jpg,Ist das ein Bild von einem Donut?,q_r_donut.wav,r_t_donut.wav,4,3,Das ist tatsächlich ein Bild von einem Donut.,Das ist tatsächlich ein Bild von einem ...,Das ist | tatsächlich ein Bild von | einem Donut.,Donut,Donut,Muffin,reliable,indeed,donut.jpg,cupcake.jpg,donut.jpg,donut.jpg,cupcake.jpg,10,9,unreliable
243,filler,chess-knight,NA,NA,visor,bassguitar,chessknight03a,aluminiumfoil,NA,NA,NA,NA,images/visor.jpg,images/bassguitar.jpg,images/chessknight03a.jpg,images/aluminiumfoil.jpg,"Magst du auch das Ding, was wie ein Pferd aussieht?",q_f_springerschach.wav,f_springerschach.wav,NA,8,"Ja, das ist ein Springer im Schach.","Ja, das ist ein ...","Ja, | das ist | ein Springer im Schach.",chessknight03a,NA,NA,filler,NA,chessknight03a.jpg,visor.jpg,chessknight03a.jpg,chessknight03a.jpg,visor.jpg,10,10,unreliable
49,critical,wheel-steering-wheel,das,das,watercolorpaintset,scanner,Lenkrad,Rad,wheel,wheel04.jpg,steering-wheel,steeringwheel.jpg,images/watercolorpaintset.jpg,images/scanner.jpg,images/steeringwheel.jpg,images/wheel04.jpg,Ist das ein Bild von einem Rad?,q_r_rad.wav,r_t_rad.wav,1,5,Das ist tatsächlich ein Bild von einem Rad.,Das ist tatsächlich ein Bild von einem ...,Das ist | tatsächlich ein Bild von | einem Rad.,Rad,Rad,Lenkrad,reliable,indeed,wheel04.jpg,steeringwheel.jpg,wheel04.jpg,wheel04.jpg,steeringwheel.jpg,10,11,unreliable
43,critical,toilet-sink,das,das,Klo,Waschbecken,pouch01b,gardenutilityvehicle,toilet,toilet.jpg,sink,sink.jpg,images/toilet.jpg,images/sink.jpg,images/pouch01b.jpg,images/gardenutilityvehicle.jpg,Ist das ein Bild von einem Klo?,q_r_klo.wav,r_t_klo.wav,3,5,Das ist tatsächlich ein Bild von einem Klo.,Das ist tatsächlich ein Bild von einem ...,Das ist | tatsächlich ein Bild von | einem Klo.,Klo,Klo,Waschbecken,reliable,indeed,toilet.jpg,sink.jpg,toilet.jpg,toilet.jpg,sink.jpg,10,12,unreliable
