Suite/Test/Step Name,Browser,Description,Start time,End time,Duration,Status
TS001_ManageUsers,Firefox 60.0,,2018-05-28 11:55:01,2018-05-28 11:57:19,2m - 18.228s,FAILED
,,,,,,
Test Cases/TestCasesList/TC_001_Verify_Add_new_User_Func_works_correctly,Firefox 60.0,,2018-05-28 11:55:01,2018-05-28 11:56:22,1m - 20.226s,FAILED
"Statement - oops_msg = ""Whoops, looks like something went wrong.""",Firefox 60.0,,2018-05-28 11:55:02,2018-05-28 11:55:02,0.003s,PASSED
"Statement - message_str = """"",Firefox 60.0,,2018-05-28 11:55:02,2018-05-28 11:55:02,0.000s,PASSED
comment,Firefox 60.0,,2018-05-28 11:55:02,2018-05-28 11:55:02,0.134s,PASSED
callTestCase,Firefox 60.0,,2018-05-28 11:55:02,2018-05-28 11:55:31,29.362s,PASSED
Statement - newuser = new objects.User(),Firefox 60.0,,2018-05-28 11:55:31,2018-05-28 11:55:32,0.096s,PASSED
comment,Firefox 60.0,,2018-05-28 11:55:32,2018-05-28 11:55:32,0.000s,PASSED
callTestCase,Firefox 60.0,,2018-05-28 11:55:32,2018-05-28 11:55:56,24.368s,PASSED
comment,Firefox 60.0,,2018-05-28 11:55:56,2018-05-28 11:55:56,0.000s,PASSED
Statement - editpage = new pages_elements.EditUser(),Firefox 60.0,,2018-05-28 11:55:56,2018-05-28 11:55:56,0.008s,PASSED
Statement - Observed_str = editpage.ErrorMessage().getText(),Firefox 60.0,,2018-05-28 11:55:56,2018-05-28 11:55:56,0.034s,PASSED
Statement - If (oops_msg == Observed_str),Firefox 60.0,,2018-05-28 11:55:56,2018-05-28 11:55:56,0.000s,PASSED
comment,Firefox 60.0,,2018-05-28 11:55:56,2018-05-28 11:55:56,0.000s,PASSED
closeBrowser,Firefox 60.0,,2018-05-28 11:55:56,2018-05-28 11:55:56,0.459s,PASSED
callTestCase,Firefox 60.0,,2018-05-28 11:55:56,2018-05-28 11:56:22,25.158s,PASSED
comment,Firefox 60.0,,2018-05-28 11:56:22,2018-05-28 11:56:22,0.009s,PASSED
Statement - leftmenu = new pages_elements.LeftMenu(),Firefox 60.0,,2018-05-28 11:56:22,2018-05-28 11:56:22,0.000s,PASSED
Statement - If (leftmenu.logo().isDisplayed() != true),Firefox 60.0,,2018-05-28 11:56:22,2018-05-28 11:56:22,0.063s,PASSED
,,,,,,
Test Cases/TestCasesList/TC_002_Verify_Search_User_Func_works_correctly,Firefox 60.0,,2018-05-28 11:56:22,2018-05-28 11:57:19,57.068s,ERROR
comment,Firefox 60.0,,2018-05-28 11:56:22,2018-05-28 11:56:22,0.002s,PASSED
callTestCase,Firefox 60.0,,2018-05-28 11:56:22,2018-05-28 11:56:59,36.647s,PASSED
callTestCase,Firefox 60.0,,2018-05-28 11:56:59,2018-05-28 11:57:18,19.778s,PASSED
callTestCase,Firefox 60.0,,2018-05-28 11:57:18,2018-05-28 11:57:19,0.402s,FAILED
