Suite/Test/Step Name,Browser,Description,Start time,End time,Duration,Status
WWR_ManageCoin,Firefox 60.0,,2018-06-23 11:14:35,2018-06-23 11:16:20,1m - 44.456s,ERROR
,,,,,,
Test Cases/TestCasesList/ManageCoin/TC_MC001_Validation - userID,Firefox 60.0,,2018-06-23 11:14:36,2018-06-23 11:15:39,1m - 3.101s,ERROR
"Statement - result_msg = """"",Firefox 60.0,,2018-06-23 11:14:36,2018-06-23 11:14:36,0.001s,PASSED
Statement - user = new objects.User(),Firefox 60.0,,2018-06-23 11:14:36,2018-06-23 11:14:36,0.083s,PASSED
comment,Firefox 60.0,,2018-06-23 11:14:36,2018-06-23 11:14:36,0.083s,PASSED
callTestCase,Firefox 60.0,,2018-06-23 11:14:36,2018-06-23 11:15:21,44.875s,PASSED
comment,Firefox 60.0,,2018-06-23 11:15:21,2018-06-23 11:15:21,0.002s,PASSED
callTestCase,Firefox 60.0,,2018-06-23 11:15:21,2018-06-23 11:15:29,8.131s,PASSED
Statement - currentpage = new pages_elements.ManageCoin(),Firefox 60.0,,2018-06-23 11:15:29,2018-06-23 11:15:29,0.016s,PASSED
Statement - currentpage.AddCoin_btn().click(),Firefox 60.0,,2018-06-23 11:15:29,2018-06-23 11:15:30,0.894s,PASSED
delay,Firefox 60.0,,2018-06-23 11:15:30,2018-06-23 11:15:32,2.004s,PASSED
comment,Firefox 60.0,,2018-06-23 11:15:32,2018-06-23 11:15:32,0.016s,PASSED
"Statement - userId = ""0001""",Firefox 60.0,,2018-06-23 11:15:32,2018-06-23 11:15:32,0.014s,PASSED
"Statement - expected_msg = ""User does not exist.""",Firefox 60.0,,2018-06-23 11:15:32,2018-06-23 11:15:32,0.019s,PASSED
callTestCase,Firefox 60.0,,2018-06-23 11:15:32,2018-06-23 11:15:33,0.614s,FAILED
comment,Firefox 60.0,,2018-06-23 11:15:33,2018-06-23 11:15:33,0.009s,PASSED
"Statement - userId = """"",Firefox 60.0,,2018-06-23 11:15:33,2018-06-23 11:15:33,0.003s,PASSED
"Statement - expected_msg = ""The user id field is required.""",Firefox 60.0,,2018-06-23 11:15:33,2018-06-23 11:15:33,0.002s,PASSED
callTestCase,Firefox 60.0,,2018-06-23 11:15:33,2018-06-23 11:15:36,2.933s,FAILED
comment,Firefox 60.0,,2018-06-23 11:15:36,2018-06-23 11:15:36,0.000s,PASSED
"Statement - userId = ""abcd""",Firefox 60.0,,2018-06-23 11:15:36,2018-06-23 11:15:36,0.000s,PASSED
Statement - currentpage.UserID_txt().clear(),Firefox 60.0,,2018-06-23 11:15:36,2018-06-23 11:15:36,0.073s,PASSED
Statement - currentpage.UserID_txt().sendKeys(userId),Firefox 60.0,,2018-06-23 11:15:36,2018-06-23 11:15:36,0.098s,PASSED
Statement - observed_msg = currentpage.UserID_txt().getText(),Firefox 60.0,,2018-06-23 11:15:36,2018-06-23 11:15:36,0.070s,PASSED
"Statement - If (observed_msg != """")",Firefox 60.0,,2018-06-23 11:15:36,2018-06-23 11:15:36,0.001s,PASSED
comment,Firefox 60.0,,2018-06-23 11:15:36,2018-06-23 11:15:36,0.002s,PASSED
Statement - username = glb_username,Firefox 60.0,,2018-06-23 11:15:36,2018-06-23 11:15:36,0.001s,PASSED
Statement - user.GetUserInfoFromDB(),Firefox 60.0,,2018-06-23 11:15:36,2018-06-23 11:15:39,2.697s,PASSED
,,,,,,
Test Cases/TestCasesList/ManageCoin/TC_MC002_Validation - Amount,Firefox 60.0,,2018-06-23 11:15:39,2018-06-23 11:16:15,36.318s,FAILED
"Statement - result_msg = """"",Firefox 60.0,,2018-06-23 11:15:39,2018-06-23 11:15:39,0.001s,PASSED
Statement - user = new objects.User(),Firefox 60.0,,2018-06-23 11:15:39,2018-06-23 11:15:39,0.008s,PASSED
comment,Firefox 60.0,,2018-06-23 11:15:39,2018-06-23 11:15:39,0.001s,PASSED
callTestCase,Firefox 60.0,,2018-06-23 11:15:39,2018-06-23 11:16:01,22.057s,PASSED
comment,Firefox 60.0,,2018-06-23 11:16:01,2018-06-23 11:16:01,0.003s,PASSED
callTestCase,Firefox 60.0,,2018-06-23 11:16:01,2018-06-23 11:16:09,7.631s,PASSED
Statement - currentpage = new pages_elements.ManageCoin(),Firefox 60.0,,2018-06-23 11:16:09,2018-06-23 11:16:09,0.001s,PASSED
comment,Firefox 60.0,,2018-06-23 11:16:09,2018-06-23 11:16:09,0.002s,PASSED
"Statement - amount_str = """"",Firefox 60.0,,2018-06-23 11:16:09,2018-06-23 11:16:09,0.002s,PASSED
"Statement - expected_msg = ""The amount field is required.""",Firefox 60.0,,2018-06-23 11:16:09,2018-06-23 11:16:09,0.000s,PASSED
callTestCase,Firefox 60.0,,2018-06-23 11:16:09,2018-06-23 11:16:14,5.033s,PASSED
callTestCase,Firefox 60.0,,2018-06-23 11:16:14,2018-06-23 11:16:14,0.412s,FAILED
comment,Firefox 60.0,,2018-06-23 11:16:14,2018-06-23 11:16:14,0.001s,PASSED
"Statement - amount_str = ""abcd""",Firefox 60.0,,2018-06-23 11:16:14,2018-06-23 11:16:14,0.001s,PASSED
Statement - currentpage.Amount_txt().clear(),Firefox 60.0,,2018-06-23 11:16:14,2018-06-23 11:16:14,0.017s,PASSED
Statement - currentpage.Amount_txt().sendKeys(userId),Firefox 60.0,,2018-06-23 11:16:14,2018-06-23 11:16:15,0.022s,PASSED
Statement - observed_msg = currentpage.Amount_txt().getText(),Firefox 60.0,,2018-06-23 11:16:15,2018-06-23 11:16:15,0.026s,PASSED
"Statement - If (observed_msg != """")",Firefox 60.0,,2018-06-23 11:16:15,2018-06-23 11:16:15,0.000s,PASSED
comment,Firefox 60.0,,2018-06-23 11:16:15,2018-06-23 11:16:15,0.002s,PASSED
Statement - username = glb_username,Firefox 60.0,,2018-06-23 11:16:15,2018-06-23 11:16:15,0.001s,PASSED
Statement - user.GetUserInfoFromDB(),Firefox 60.0,,2018-06-23 11:16:15,2018-06-23 11:16:15,0.474s,PASSED
,,,,,,
Test Cases/TestCasesList/ManageCoin/TC_MC003_Verify_Add_BTC_Coin_functions_works_correctly when increase coin,Firefox 60.0,,2018-06-23 11:16:15,2018-06-23 11:16:16,0.935s,ERROR
Statement - user = new objects.User(),Firefox 60.0,,2018-06-23 11:16:15,2018-06-23 11:16:15,0.001s,PASSED
Statement - username = glb_username,Firefox 60.0,,2018-06-23 11:16:15,2018-06-23 11:16:15,0.000s,PASSED
Statement - user.GetUserInfoFromDB(),Firefox 60.0,,2018-06-23 11:16:15,2018-06-23 11:16:16,0.583s,PASSED
,,,,,,
Test Cases/TestCasesList/ManageCoin/TC_MC004_Admin_User_Verify Add ETH Coin functions works correctly when increase coin,Firefox 60.0,,2018-06-23 11:16:16,2018-06-23 11:16:17,0.919s,ERROR
Statement - user = new objects.User(),Firefox 60.0,,2018-06-23 11:16:16,2018-06-23 11:16:16,0.003s,PASSED
Statement - username = glb_username,Firefox 60.0,,2018-06-23 11:16:16,2018-06-23 11:16:16,0.000s,PASSED
Statement - user.GetUserInfoFromDB(),Firefox 60.0,,2018-06-23 11:16:16,2018-06-23 11:16:17,0.508s,PASSED
,,,,,,
Test Cases/TestCasesList/ManageCoin/TC_MC008_Verify Add BTC Coin functions works correctly when decrease coin,Firefox 60.0,,2018-06-23 11:16:17,2018-06-23 11:16:18,0.942s,ERROR
Statement - user = new objects.User(),Firefox 60.0,,2018-06-23 11:16:17,2018-06-23 11:16:17,0.003s,PASSED
Statement - username = glb_username,Firefox 60.0,,2018-06-23 11:16:17,2018-06-23 11:16:17,0.022s,PASSED
Statement - user.GetUserInfoFromDB(),Firefox 60.0,,2018-06-23 11:16:17,2018-06-23 11:16:18,0.501s,PASSED
,,,,,,
Test Cases/TestCasesList/ManageCoin/TC_MC009_Verify Add ETH Coin functions works correctly when decrease coin,Firefox 60.0,,2018-06-23 11:16:18,2018-06-23 11:16:19,0.933s,ERROR
Statement - user = new objects.User(),Firefox 60.0,,2018-06-23 11:16:18,2018-06-23 11:16:18,0.001s,PASSED
Statement - username = glb_username,Firefox 60.0,,2018-06-23 11:16:18,2018-06-23 11:16:18,0.000s,PASSED
Statement - user.GetUserInfoFromDB(),Firefox 60.0,,2018-06-23 11:16:18,2018-06-23 11:16:19,0.535s,PASSED
