com/example/demo/DemoApplication.class
com/example/demo/service/impl/CustomersServiceImpl.class
com/example/demo/service/CustomersService.class
com/example/demo/entity/CustomersEntity.class
com/example/demo/repository/CustomersRepository.class
com/example/demo/controller/CustomersController.class
