{
	"id": "4be26536-7f3e-4127-90db-4392a7a8870b",
	"name": "Production",
	"values": [
		{
			"key": "baseUrl",
			"value": "http://production.eba-ms3rb8p3.ap-south-1.elasticbeanstalk.com/",
			"enabled": true
		}
	],
	"_postman_variable_scope": "environment",
	"_postman_exported_at": "2020-11-01T16:17:29.227Z",
	"_postman_exported_using": "Postman/7.34.0"
}