^C:\PROJECTS\C++\HOMEWORK_14\X64\DEBUG\HOMEWORK_14.OBJ
C:\PROJECTS\C++\HOMEWORK_14\X64\DEBUG\HOMEWORK_14.EXE
C:\PROJECTS\C++\HOMEWORK_14\X64\DEBUG\HOMEWORK_14.ILK
C:\PROJECTS\C++\HOMEWORK_14\X64\DEBUG\HOMEWORK_14.PDB
