^C:\PROJECTS\C++\HOMEWORK_11\X64\DEBUG\HOMEWORK_11.OBJ
C:\PROJECTS\C++\HOMEWORK_11\X64\DEBUG\HOMEWORK_11.EXE
C:\PROJECTS\C++\HOMEWORK_11\X64\DEBUG\HOMEWORK_11.ILK
C:\PROJECTS\C++\HOMEWORK_11\X64\DEBUG\HOMEWORK_11.PDB
