@startuml
title push offer eligibility Check

box PES Aggregator #LightBlue 
participant be_offer_push as be1 #Orange
participant api_eligibility_check as api1 #YellowGreen
participant api_campaign_tracking as api2 #YellowGreen
Database "Redis[Contact_policy]" as redis #Red
Database contact_policy as db1
Database blacklist_msisdn as db2 #Orange
Database menu_level_id as dbmenu
Database customer_product_campaign as db3 #Orange
Database product_taxonomy as db4
end box
box Loena #Green
participant Loena
end box


be1 -> api1 : push offer egibility check [API Call]
activate be1
activate api1
group push offer eligibility check 
== check contact policy == 
api1 -> redis : query contact policy by msisdn
redis --> api1 : return result
    alt if data exist
        api1 --> be1 : return False
        note left #Red
        stop offering process
        endnote
    else if data not exist
        api1 -> db1 : query contact policy by msisdn
        db1 --> api1 : return result
        alt if alredy max (=2)
        api1 -> redis : save contact policy data
        api1 --> be1 : return False
        note left #Red
        stop offering process
        endnote 
        else if not alredy max (<2)
        api1 -> db1 : update contact policy data
        note left of api1 #Green
        next eligibility check process
        endnote
        end
    end
== check blacklist == 
api1 -> db2 : query blacklist by msisdn
db2 --> api1 : return result
    alt if data exist
    api1 --> be1 : return False
    note left #Red
    stop offering process
    endnote
    else if data not exist
    note left of api1 #Green
    next eligibility check process
    endnote
    end
== check whitelist [customer_product_campaign] ==
api1 -> dbmenu : query menu level data by menu_level_id
dbmenu --> api1 : return result
api1 -> db3 : query customer product campaign by msisdn
db3 --> api1 : return result
    alt if data exist
    note left of api1 #Green
    next eligibility check process
    endnote
    else if data not exist
    api1 --> be1 : return False
    note left #Red
    stop offering process
    endnote
    end
== check product taxonomy ==
api1 -> db4 : query product taxonomy by BID
db4 --> api1 : return result
    alt if data exist
    note left of api1 #Green
    next eligibility check process
    endnote
    else if data not exist
    api1 --> be1 : return False
    note left #Red
    stop offering process
    endnote
    end
== check Credit Limit Scoring Validation ==
api1 -> Loena : API Call Loena [Url param msisdn & transaction_id]
activate Loena
Loena --> api1 : return Response
deactivate Loena
    alt if data match with criteria
    note left of api1 #Green
    next eligibility check process
    endnote
    else if data not match with criteria
    api1 --> be1 : return False
    note left #Red
    stop offering process
    endnote
    end
end
api1 --> be1 : return Response
deactivate api1
deactivate be1



@enduml