@startuml
title Overall Process

database queue_alert as alert #Orange
database adhoc_offer as adhoc #Orange
box PES Aggregator #LightBlue
participant be_offer_consumer_adhoc as be_adhoc #Orange
queue mb_offer as mb #OrangeRed
participant be_offer_push as be1 #Orange
participant api_eligibility_check as api2 #YellowGreen
database keyword_bid_pair as db1 
participant api_campaign_tracing as api3 #YellowGreen
end box
box Loena #Green
participant loena
end box
box ESB #grey
participant esb
end box
be_adhoc -> alert : check alert parameter
note right
if parameter 0 > process data from adhoc_offer
endnote
be_adhoc -> adhoc : query data
activate be_adhoc
be_adhoc -> be_adhoc : process data
note left 
process data and
save data to mb_offer
queue adhoc 0-9
endnote
be_adhoc -> mb : publish data
deactivate be_adhoc
activate mb
be1 -> mb : consume data
deactivate mb
activate be1
be1 -> api2 : push offer eligibility check
activate api2
api2 -> api2 : eligibility check
note left #Yellow
Eligibility check 
process described
in other sequence
endnote
api2 -> loena : chek limit scoring
activate loena
loena --> api2 : return response
deactivate loena
api2 --> be1 : return Result
deactivate api2
note left
if result Success > process offer
if result False > stop process offer
endnote
be1 -> be1 : check destination channel
alt if destination channel include SMS push
be1 -> db1 : get keyword bid
end
be1 -> api3 : send campaign data
be1 -> esb : send push offer SMS
note left
if include SMS push
endnote
be1 -> esb : send push offer Mytsel notif
note left
if include Mytsel notif push
endnote
be1 -> esb : send push offer Mytsel inbox
note left
if include Mytsel inbox push
endnote
deactivate be1




@enduml