@startuml
title push offer eligibility Check [Overall]

box PES Aggregator #LightBlue 
participant be_offer_push as be_op #Orange
participant api_eligibility_check as api_ec #YellowGreen
Database "Redis[contact_policy]" as redis_cp #Red
Database contact_policy as db_cp
Database blacklist_msisdn as db_bm #Orange
Database menu_level_id as dbmenu
Database customer_product_campaign as db_cpc #Orange
Database product_taxonomy as db_pt
Database "Redis[user_location]" as redis_ul #Red
Database whitelisted_bid_international_roaming_trigger as db_wb #Orange
Database whitelisted_country as db_wc #Orange
end box
box Loena #Green
participant Loena
end box
box ESB 
participant ESB
end box


be_op -> api_ec : push offer egibility check [API Call]
activate be_op
activate api_ec
api_ec -> api_ec : check event_trigger parameter
note left
to define ....
endnote
group push offer eligibility check 
== check contact policy == 
api_ec -> redis_cp : query contact policy by msisdn
redis_cp --> api_ec : return result
    alt if data exist
        api_ec --> be_op : return False
        note left #Red
        stop offering process
        endnote
    else if data not exist
        api_ec -> db_cp : query contact policy by msisdn
        db_cp --> api_ec : return result
        alt if alredy max (=2)
        api_ec -> redis_cp : save contact policy data
        api_ec --> be_op : return False
        note left #Red
        stop offering process
        endnote 
        else if not alredy max (<2)
        api_ec -> db_cp : update contact policy data
        note left of api_ec #Green
        next eligibility check process
        endnote
        end
    end
== check blacklist == 
api_ec -> db_bm : query blacklist by msisdn
db_bm --> api_ec : return result
    alt if data exist
    api_ec --> be_op : return False
    note left #Red
    stop offering process
    endnote
    else if data not exist
    note left of api_ec #Green
    next eligibility check process
    endnote
    end
== check whitelist [customer_product_campaign] ==
api_ec -> dbmenu : query menu level data by menu_level_id
dbmenu --> api_ec : return result
api_ec -> db_cpc : query customer product campaign by msisdn
db_cpc --> api_ec : return result
    alt if data exist
    note left of api_ec #Green
    next eligibility check process
    endnote
    else if data not exist
    api_ec --> be_op : return False
    note left #Red
    stop offering process
    endnote
    end
== check product taxonomy ==
api_ec -> db_pt : query product taxonomy by BID
db_pt --> api_ec : return result
    alt if data exist
    note left of api_ec #Green
    next eligibility check process
    endnote
    else if data not exist
    api_ec --> be_op : return False
    note left #Red
    stop offering process
    endnote
    end
== check Credit Limit Scoring Validation ==
api_ec -> Loena : API Call Loena [Url param msisdn & transaction_id]
activate Loena
Loena --> api_ec : return Response
deactivate Loena
    alt if data match with criteria
    note left of api_ec #Green
    next eligibility check process
    endnote
    else if data not match with criteria
    api_ec --> be_op : return False
    note left #Red
    stop offering process
    endnote
    end
end
== check Whitelisted BID international roaming trigger ==
api_ec -> db_wb : query is exist trigger_bid inside the list
db_wb --> api_ec : return result
    alt if data exist
    note left of api_ec #Green
    next eligibility check process
    endnote
    else if data not exist
    api_ec --> be_op : return False
    note left #Red
    stop offering process
    endnote
    end
== check User Location ==
api_ec -> redis_ul : query msisdn location in cache 
redis_ul --> api_ec : return result
    alt user location not found in redis
    api_ec -> ESB : request user location info
    activate ESB
    ESB --> api_ec : return result
    deactivate ESB
        alt user location not found
        api_ec -> api_ec : set International Roaming as Valid
        note left #Yellow
        skip "check whitelisted country"
        endnote
        api_ec --> be_op : return Response
        else user location found 
        api_ec -> redis_ul : store user location data
        note left #Green
        next eligibility check process
        endnote
        end
    else user location found in redis
    note left of api_ec #Green
    next eligibility check process
    endnote
    end
== check Whitelisted Country ==
api_ec -> db_wc : query data by user location (MNC & MCC)
db_wc --> api_ec : return result
    alt MNC & MCC are whitelisted
    note left of api_ec #Green
    next eligibility check process
    endnote
    else MNC & MCC are not whitelisted
    api_ec --> be_op : return False
    note left #Red
    stop offering process
    endnote
    end
api_ec --> be_op : return Response
deactivate api_ec
deactivate be_op



@enduml