{
  "Projeto Vicentini": {
    "1": {
      "Name": "Vincentini",
      "Port": 5432,
      "Username": "vincentini",
      "Host": "db",
      "SSLMode": "prefer",
      "MaintenanceDB": "postgres"
    },
    "2": {
      "Name": "Vincentini Amazon Prod",
      "Port": 5432,
      "Username": "postgresql",
      "Host": "database-1.cx5pmcql086k.sa-east-1.rds.amazonaws.com",
      "SSLMode": "prefer",
      "MaintenanceDB": "postgres"
    }
  }
}