﻿Log file open, 02/05/21 10:52:42
LogInit: Display: Running engine for game: P1_Endless_Runner
LogPlatformFile: Not using cached read wrapper
LogTaskGraph: Started task graph with 5 named threads and 26 total threads with 3 sets of task threads.
LogStats: Stats thread started at 6.962775
LogD3D11RHI: Loaded GFSDK_Aftermath_Lib.x64.dll
LogICUInternationalization: ICU TimeZone Detection - Raw Offset: +8:00, Platform Override: ''
LogPluginManager: Mounting plugin Paper2D
LogPluginManager: Mounting plugin AISupport
LogPluginManager: Mounting plugin LightPropagationVolume
LogPluginManager: Mounting plugin CameraShakePreviewer
LogPluginManager: Mounting plugin ActorLayerUtilities
LogPluginManager: Mounting plugin AnimationSharing
LogPluginManager: Mounting plugin CLionSourceCodeAccess
LogPluginManager: Mounting plugin CodeLiteSourceCodeAccess
LogPluginManager: Mounting plugin GitSourceControl
LogPluginManager: Mounting plugin KDevelopSourceCodeAccess
LogPluginManager: Mounting plugin NullSourceCodeAccess
LogPluginManager: Mounting plugin PerforceSourceControl
LogPluginManager: Mounting plugin PlasticSourceControl
LogPluginManager: Mounting plugin RiderSourceCodeAccess
LogPluginManager: Mounting plugin SubversionSourceControl
LogPluginManager: Mounting plugin UObjectPlugin
LogPluginManager: Mounting plugin VisualStudioCodeSourceCodeAccess
LogPluginManager: Mounting plugin VisualStudioSourceCodeAccess
LogPluginManager: Mounting plugin XCodeSourceCodeAccess
LogPluginManager: Mounting plugin AssetManagerEditor
LogPluginManager: Mounting plugin CryptoKeys
LogPluginManager: Mounting plugin CurveEditorTools
LogPluginManager: Mounting plugin DataValidation
LogPluginManager: Mounting plugin EditorScriptingUtilities
LogPluginManager: Mounting plugin FacialAnimation
LogPluginManager: Mounting plugin GameplayTagsEditor
LogPluginManager: Mounting plugin GeometryMode
LogPluginManager: Mounting plugin MacGraphicsSwitching
LogPluginManager: Mounting plugin MaterialAnalyzer
LogPluginManager: Mounting plugin MobileLauncherProfileWizard
LogPluginManager: Mounting plugin PluginBrowser
LogPluginManager: Mounting plugin SpeedTreeImporter
LogPluginManager: Mounting plugin DatasmithContent
LogPluginManager: Mounting plugin VariantManagerContent
LogPluginManager: Mounting plugin AlembicImporter
LogPluginManager: Mounting plugin AutomationUtils
LogPluginManager: Mounting plugin BackChannel
LogPluginManager: Mounting plugin ChaosCloth
LogPluginManager: Mounting plugin ChaosClothEditor
LogPluginManager: Mounting plugin ChaosEditor
LogPluginManager: Mounting plugin ChaosNiagara
LogPluginManager: Mounting plugin ChaosSolverPlugin
LogPluginManager: Mounting plugin CharacterAI
LogPluginManager: Mounting plugin GeometryCache
LogPluginManager: Mounting plugin GeometryCollectionPlugin
LogPluginManager: Mounting plugin GeometryProcessing
LogPluginManager: Mounting plugin PlanarCut
LogPluginManager: Mounting plugin PlatformCrypto
LogPluginManager: Mounting plugin ProxyLODPlugin
LogPluginManager: Mounting plugin SkeletalReduction
LogPluginManager: Mounting plugin Niagara
LogPluginManager: Mounting plugin MagicLeap
LogPluginManager: Mounting plugin MagicLeapLightEstimation
LogPluginManager: Mounting plugin MagicLeapMedia
LogPluginManager: Mounting plugin MagicLeapPassableWorld
LogPluginManager: Mounting plugin MLSDK
LogPluginManager: Mounting plugin AndroidMedia
LogPluginManager: Mounting plugin AvfMedia
LogPluginManager: Mounting plugin ImgMedia
LogPluginManager: Mounting plugin MediaCompositing
LogPluginManager: Mounting plugin MediaPlayerEditor
LogPluginManager: Mounting plugin WebMMedia
LogPluginManager: Mounting plugin WmfMedia
LogPluginManager: Mounting plugin MeshPainting
LogPluginManager: Mounting plugin TcpMessaging
LogPluginManager: Mounting plugin UdpMessaging
LogPluginManager: Mounting plugin ActorSequence
LogPluginManager: Mounting plugin LevelSequenceEditor
LogPluginManager: Mounting plugin MatineeToLevelSequence
LogPluginManager: Mounting plugin MovieRenderPipeline
LogPluginManager: Mounting plugin TemplateSequence
LogPluginManager: Mounting plugin NetcodeUnitTest
LogPluginManager: Mounting plugin NUTUnrealEngine4
LogPluginManager: Mounting plugin OnlineSubsystemGooglePlay
LogPluginManager: Mounting plugin OnlineSubsystemIOS
LogPluginManager: Mounting plugin OnlineSubsystem
LogPluginManager: Mounting plugin OnlineSubsystemNull
LogPluginManager: Mounting plugin OnlineSubsystemUtils
LogPluginManager: Mounting plugin LauncherChunkInstaller
LogPluginManager: Mounting plugin AndroidDeviceProfileSelector
LogPluginManager: Mounting plugin AndroidMoviePlayer
LogPluginManager: Mounting plugin AndroidPermission
LogPluginManager: Mounting plugin AppleImageUtils
LogPluginManager: Mounting plugin AppleMoviePlayer
LogPluginManager: Mounting plugin ArchVisCharacter
LogPluginManager: Mounting plugin AssetTags
LogPluginManager: Mounting plugin AudioCapture
LogPluginManager: Mounting plugin CableComponent
LogPluginManager: Mounting plugin CustomMeshComponent
LogPluginManager: Mounting plugin EditableMesh
LogPluginManager: Mounting plugin ExampleDeviceProfileSelector
LogPluginManager: Mounting plugin GoogleCloudMessaging
LogPluginManager: Mounting plugin GooglePAD
LogPluginManager: Mounting plugin IOSDeviceProfileSelector
LogPluginManager: Mounting plugin LinuxDeviceProfileSelector
LogPluginManager: Mounting plugin LocationServicesBPLibrary
LogPluginManager: Mounting plugin MobilePatchingUtils
LogPluginManager: Mounting plugin OculusVR
LogPluginManager: Mounting plugin PhysXVehicles
LogPluginManager: Mounting plugin PostSplashScreen
LogPluginManager: Mounting plugin ProceduralMeshComponent
LogPluginManager: Mounting plugin RuntimePhysXCooking
LogPluginManager: Mounting plugin SignificanceManager
LogPluginManager: Mounting plugin SoundFields
LogPluginManager: Mounting plugin SteamVR
LogPluginManager: Mounting plugin Synthesis
LogPluginManager: Mounting plugin WebMMoviePlayer
LogPluginManager: Mounting plugin WindowsMoviePlayer
LogPluginManager: Mounting plugin ScreenshotTools
LogInit: Using libcurl 7.55.1-DEV
LogInit:  - built for x86_64-pc-win32
LogInit:  - supports SSL with OpenSSL/1.1.1
LogInit:  - supports HTTP deflate (compression) using libz 1.2.8
LogInit:  - other features:
LogInit:      CURL_VERSION_SSL
LogInit:      CURL_VERSION_LIBZ
LogInit:      CURL_VERSION_IPV6
LogInit:      CURL_VERSION_ASYNCHDNS
LogInit:      CURL_VERSION_LARGEFILE
LogInit:      CURL_VERSION_IDN
LogInit:  CurlRequestOptions (configurable via config and command line):
LogInit:  - bVerifyPeer = true  - Libcurl will verify peer certificate
LogInit:  - bUseHttpProxy = false  - Libcurl will NOT use HTTP proxy
LogInit:  - bDontReuseConnections = false  - Libcurl will reuse connections
LogInit:  - MaxHostConnections = 16  - Libcurl will limit the number of connections to a host
LogInit:  - LocalHostAddr = Default
LogInit:  - BufferSize = 65536
LogOnline: OSS: Creating online subsystem instance for: NULL
LogInit: WinSock: version 1.1 (2.2), MaxSocks=32767, MaxUdp=65467
LogOnline: OSS: TryLoadSubsystemAndSetDefault: Loaded subsystem for module [NULL]
LogInit: Build: ++UE4+Release-4.25-CL-14469661
LogInit: Engine Version: 4.25.4-14469661+++UE4+Release-4.25
LogInit: Compatible Engine Version: 4.25.0-13144385+++UE4+Release-4.25
LogInit: Net CL: 13144385
LogInit: OS: Windows 10 (Release 2004) (), CPU: Intel(R) Core(TM) i7-9700K CPU @ 3.60GHz, GPU: NVIDIA GeForce RTX 2060
LogInit: Compiled (64-bit): Oct 11 2020 08:10:49
LogInit: Compiled with Visual C++: 19.24.28315.00
LogInit: Build Configuration: Development
LogInit: Branch Name: ++UE4+Release-4.25
LogInit: Command Line:  -EpicPortal -epicusername=S1nCross -epicuserid=e75350d3fe594fa0ba76107a409fd167 -epiclocale=en
LogInit: Base Directory: E:/Game Dev/Unreal/UE_4.25/Engine/Binaries/Win64/
LogInit: Allocator: TBB
LogInit: Installed Engine Build: 1
LogDevObjectVersion: Number of dev versions registered: 26
LogDevObjectVersion:   Dev-Blueprints (B0D832E4-1F89-4F0D-ACCF-7EB736FD4AA2): 10
LogDevObjectVersion:   Dev-Build (E1C64328-A22C-4D53-A36C-8E866417BD8C): 0
LogDevObjectVersion:   Dev-Core (375EC13C-06E4-48FB-B500-84F0262A717E): 4
LogDevObjectVersion:   Dev-Editor (E4B068ED-F494-42E9-A231-DA0B2E46BB41): 38
LogDevObjectVersion:   Dev-Framework (CFFC743F-43B0-4480-9391-14DF171D2073): 37
LogDevObjectVersion:   Dev-Mobile (B02B49B5-BB20-44E9-A304-32B752E40360): 2
LogDevObjectVersion:   Dev-Networking (A4E4105C-59A1-49B5-A7C5-40C4547EDFEE): 0
LogDevObjectVersion:   Dev-Online (39C831C9-5AE6-47DC-9A44-9C173E1C8E7C): 0
LogDevObjectVersion:   Dev-Physics (78F01B33-EBEA-4F98-B9B4-84EACCB95AA2): 4
LogDevObjectVersion:   Dev-Platform (6631380F-2D4D-43E0-8009-CF276956A95A): 0
LogDevObjectVersion:   Dev-Rendering (12F88B9F-8875-4AFC-A67C-D90C383ABD29): 43
LogDevObjectVersion:   Dev-Sequencer (7B5AE74C-D270-4C10-A958-57980B212A5A): 12
LogDevObjectVersion:   Dev-VR (D7296918-1DD6-4BDD-9DE2-64A83CC13884): 3
LogDevObjectVersion:   Dev-LoadTimes (C2A15278-BFE7-4AFE-6C17-90FF531DF755): 1
LogDevObjectVersion:   Private-Geometry (6EACA3D4-40EC-4CC1-B786-8BED09428FC5): 3
LogDevObjectVersion:   Dev-AnimPhys (29E575DD-E0A3-4627-9D10-D276232CDCEA): 17
LogDevObjectVersion:   Dev-Anim (AF43A65D-7FD3-4947-9873-3E8ED9C1BB05): 7
LogDevObjectVersion:   Dev-ReflectionCapture (6B266CEC-1EC7-4B8F-A30B-E4D90942FC07): 1
LogDevObjectVersion:   Dev-Automation (0DF73D61-A23F-47EA-B727-89E90C41499A): 1
LogDevObjectVersion:   FortniteMain (601D1886-AC64-4F84-AA16-D3DE0DEAC7D6): 31
LogDevObjectVersion:   Dev-Enterprise (9DFFBCD6-494F-0158-E221-12823C92A888): 10
LogDevObjectVersion:   Dev-Niagara (F2AED0AC-9AFE-416F-8664-AA7FFA26D6FC): 1
LogDevObjectVersion:   Dev-Destruction (174F1F0B-B4C6-45A5-B13F-2EE8D0FB917D): 10
LogDevObjectVersion:   Dev-Physics-Ext (35F94A83-E258-406C-A318-09F59610247C): 37
LogDevObjectVersion:   Dev-PhysicsMaterial-Chaos (B68FC16E-8B1B-42E2-B453-215C058844FE): 1
LogDevObjectVersion:   Dev-CineCamera (B2E18506-4273-CFC2-A54E-F4BB758BBA07): 1
LogInit: Presizing for max 25165824 objects, including 0 objects not considered by GC, pre-allocating 0 bytes for permanent pool.
LogConfig: Applying CVar settings from Section [/Script/Engine.StreamingSettings] File [E:/Game Dev/GAMPRG Repository/P1_Endless_Runner/Saved/Config/Windows/Engine.ini]
LogConfig: Setting CVar [[s.MinBulkDataSizeForAsyncLoading:131072]]
LogConfig: Setting CVar [[s.AsyncLoadingThreadEnabled:0]]
LogConfig: Setting CVar [[s.EventDrivenLoaderEnabled:1]]
LogConfig: Setting CVar [[s.WarnIfTimeLimitExceeded:0]]
LogConfig: Setting CVar [[s.TimeLimitExceededMultiplier:1.5]]
LogConfig: Setting CVar [[s.TimeLimitExceededMinTime:0.005]]
LogConfig: Setting CVar [[s.UseBackgroundLevelStreaming:1]]
LogConfig: Setting CVar [[s.PriorityAsyncLoadingExtraTime:15.0]]
LogConfig: Setting CVar [[s.LevelStreamingActorsUpdateTimeLimit:5.0]]
LogConfig: Setting CVar [[s.PriorityLevelStreamingActorsUpdateExtraTime:5.0]]
LogConfig: Setting CVar [[s.LevelStreamingComponentsRegistrationGranularity:10]]
LogConfig: Setting CVar [[s.UnregisterComponentsTimeLimit:1.0]]
LogConfig: Setting CVar [[s.LevelStreamingComponentsUnregistrationGranularity:5]]
LogConfig: Setting CVar [[s.FlushStreamingOnExit:1]]
LogInit: Object subsystem initialized
LogConfig: Setting CVar [[con.DebugEarlyDefault:1]]
LogConfig: Setting CVar [[r.setres:1280x720]]
[2021.02.05-02.52.43:634][  0]LogConfig: Setting CVar [[r.VSync:0]]
[2021.02.05-02.52.43:635][  0]LogConfig: Setting CVar [[r.RHICmdBypass:0]]
[2021.02.05-02.52.43:635][  0]LogConfig: Applying CVar settings from Section [/Script/Engine.RendererSettings] File [E:/Game Dev/GAMPRG Repository/P1_Endless_Runner/Saved/Config/Windows/Engine.ini]
[2021.02.05-02.52.43:635][  0]LogConfig: Setting CVar [[r.GPUCrashDebugging:0]]
[2021.02.05-02.52.43:635][  0]LogConfig: Applying CVar settings from Section [/Script/Engine.RendererOverrideSettings] File [E:/Game Dev/GAMPRG Repository/P1_Endless_Runner/Saved/Config/Windows/Engine.ini]
[2021.02.05-02.52.43:635][  0]LogConfig: Applying CVar settings from Section [/Script/Engine.StreamingSettings] File [E:/Game Dev/GAMPRG Repository/P1_Endless_Runner/Saved/Config/Windows/Engine.ini]
[2021.02.05-02.52.43:635][  0]LogConfig: Setting CVar [[s.MinBulkDataSizeForAsyncLoading:131072]]
[2021.02.05-02.52.43:635][  0]LogConfig: Setting CVar [[s.AsyncLoadingThreadEnabled:0]]
[2021.02.05-02.52.43:635][  0]LogConfig: Setting CVar [[s.EventDrivenLoaderEnabled:1]]
[2021.02.05-02.52.43:635][  0]LogConfig: Setting CVar [[s.WarnIfTimeLimitExceeded:0]]
[2021.02.05-02.52.43:635][  0]LogConfig: Setting CVar [[s.TimeLimitExceededMultiplier:1.5]]
[2021.02.05-02.52.43:635][  0]LogConfig: Setting CVar [[s.TimeLimitExceededMinTime:0.005]]
[2021.02.05-02.52.43:635][  0]LogConfig: Setting CVar [[s.UseBackgroundLevelStreaming:1]]
[2021.02.05-02.52.43:635][  0]LogConfig: Setting CVar [[s.PriorityAsyncLoadingExtraTime:15.0]]
[2021.02.05-02.52.43:635][  0]LogConfig: Setting CVar [[s.LevelStreamingActorsUpdateTimeLimit:5.0]]
[2021.02.05-02.52.43:635][  0]LogConfig: Setting CVar [[s.PriorityLevelStreamingActorsUpdateExtraTime:5.0]]
[2021.02.05-02.52.43:635][  0]LogConfig: Setting CVar [[s.LevelStreamingComponentsRegistrationGranularity:10]]
[2021.02.05-02.52.43:635][  0]LogConfig: Setting CVar [[s.UnregisterComponentsTimeLimit:1.0]]
[2021.02.05-02.52.43:635][  0]LogConfig: Setting CVar [[s.LevelStreamingComponentsUnregistrationGranularity:5]]
[2021.02.05-02.52.43:635][  0]LogConfig: Setting CVar [[s.FlushStreamingOnExit:1]]
[2021.02.05-02.52.43:635][  0]LogConfig: Applying CVar settings from Section [/Script/Engine.GarbageCollectionSettings] File [E:/Game Dev/GAMPRG Repository/P1_Endless_Runner/Saved/Config/Windows/Engine.ini]
[2021.02.05-02.52.43:635][  0]LogConfig: Setting CVar [[gc.MaxObjectsNotConsideredByGC:1]]
[2021.02.05-02.52.43:635][  0]LogConfig: Setting CVar [[gc.SizeOfPermanentObjectPool:0]]
[2021.02.05-02.52.43:635][  0]LogConfig: Setting CVar [[gc.FlushStreamingOnGC:0]]
[2021.02.05-02.52.43:635][  0]LogConfig: Setting CVar [[gc.NumRetriesBeforeForcingGC:10]]
[2021.02.05-02.52.43:635][  0]LogConfig: Setting CVar [[gc.AllowParallelGC:1]]
[2021.02.05-02.52.43:635][  0]LogConfig: Setting CVar [[gc.TimeBetweenPurgingPendingKillObjects:61.1]]
[2021.02.05-02.52.43:635][  0]LogConfig: Setting CVar [[gc.MaxObjectsInEditor:25165824]]
[2021.02.05-02.52.43:635][  0]LogConfig: Setting CVar [[gc.IncrementalBeginDestroyEnabled:1]]
[2021.02.05-02.52.43:635][  0]LogConfig: Setting CVar [[gc.CreateGCClusters:1]]
[2021.02.05-02.52.43:635][  0]LogConfig: Setting CVar [[gc.MinGCClusterSize:5]]
[2021.02.05-02.52.43:635][  0]LogConfig: Setting CVar [[gc.ActorClusteringEnabled:0]]
[2021.02.05-02.52.43:635][  0]LogConfig: Setting CVar [[gc.BlueprintClusteringEnabled:0]]
[2021.02.05-02.52.43:635][  0]LogConfig: Setting CVar [[gc.UseDisregardForGCOnDedicatedServers:0]]
[2021.02.05-02.52.43:635][  0]LogConfig: Applying CVar settings from Section [/Script/Engine.NetworkSettings] File [E:/Game Dev/GAMPRG Repository/P1_Endless_Runner/Saved/Config/Windows/Engine.ini]
[2021.02.05-02.52.43:635][  0]LogConfig: Applying CVar settings from Section [/Script/UnrealEd.CookerSettings] File [E:/Game Dev/GAMPRG Repository/P1_Endless_Runner/Saved/Config/Windows/Engine.ini]
[2021.02.05-02.52.43:638][  0]LogConfig: Applying CVar settings from Section [ViewDistanceQuality@3] File [E:/Game Dev/GAMPRG Repository/P1_Endless_Runner/Saved/Config/Windows/Scalability.ini]
[2021.02.05-02.52.43:638][  0]LogConfig: Setting CVar [[r.SkeletalMeshLODBias:0]]
[2021.02.05-02.52.43:638][  0]LogConfig: Setting CVar [[r.ViewDistanceScale:1.0]]
[2021.02.05-02.52.43:638][  0]LogConfig: Applying CVar settings from Section [AntiAliasingQuality@3] File [E:/Game Dev/GAMPRG Repository/P1_Endless_Runner/Saved/Config/Windows/Scalability.ini]
[2021.02.05-02.52.43:638][  0]LogConfig: Setting CVar [[r.PostProcessAAQuality:4]]
[2021.02.05-02.52.43:638][  0]LogConfig: Applying CVar settings from Section [ShadowQuality@3] File [E:/Game Dev/GAMPRG Repository/P1_Endless_Runner/Saved/Config/Windows/Scalability.ini]
[2021.02.05-02.52.43:638][  0]LogConfig: Setting CVar [[r.LightFunctionQuality:1]]
[2021.02.05-02.52.43:638][  0]LogConfig: Setting CVar [[r.ShadowQuality:5]]
[2021.02.05-02.52.43:638][  0]LogConfig: Setting CVar [[r.Shadow.CSM.MaxCascades:10]]
[2021.02.05-02.52.43:638][  0]LogConfig: Setting CVar [[r.Shadow.MaxResolution:2048]]
[2021.02.05-02.52.43:638][  0]LogConfig: Setting CVar [[r.Shadow.MaxCSMResolution:2048]]
[2021.02.05-02.52.43:638][  0]LogConfig: Setting CVar [[r.Shadow.RadiusThreshold:0.01]]
[2021.02.05-02.52.43:638][  0]LogConfig: Setting CVar [[r.Shadow.DistanceScale:1.0]]
[2021.02.05-02.52.43:638][  0]LogConfig: Setting CVar [[r.Shadow.CSM.TransitionScale:1.0]]
[2021.02.05-02.52.43:638][  0]LogConfig: Setting CVar [[r.Shadow.PreShadowResolutionFactor:1.0]]
[2021.02.05-02.52.43:638][  0]LogConfig: Setting CVar [[r.DistanceFieldShadowing:1]]
[2021.02.05-02.52.43:638][  0]LogConfig: Setting CVar [[r.DistanceFieldAO:1]]
[2021.02.05-02.52.43:638][  0]LogConfig: Setting CVar [[r.AOQuality:2]]
[2021.02.05-02.52.43:638][  0]LogConfig: Setting CVar [[r.VolumetricFog:1]]
[2021.02.05-02.52.43:638][  0]LogConfig: Setting CVar [[r.VolumetricFog.GridPixelSize:8]]
[2021.02.05-02.52.43:638][  0]LogConfig: Setting CVar [[r.VolumetricFog.GridSizeZ:128]]
[2021.02.05-02.52.43:638][  0]LogConfig: Setting CVar [[r.VolumetricFog.HistoryMissSupersampleCount:4]]
[2021.02.05-02.52.43:638][  0]LogConfig: Setting CVar [[r.LightMaxDrawDistanceScale:1]]
[2021.02.05-02.52.43:638][  0]LogConfig: Setting CVar [[r.CapsuleShadows:1]]
[2021.02.05-02.52.43:638][  0]LogConfig: Applying CVar settings from Section [PostProcessQuality@3] File [E:/Game Dev/GAMPRG Repository/P1_Endless_Runner/Saved/Config/Windows/Scalability.ini]
[2021.02.05-02.52.43:638][  0]LogConfig: Setting CVar [[r.MotionBlurQuality:4]]
[2021.02.05-02.52.43:638][  0]LogConfig: Setting CVar [[r.AmbientOcclusionMipLevelFactor:0.4]]
[2021.02.05-02.52.43:638][  0]LogConfig: Setting CVar [[r.AmbientOcclusionMaxQuality:100]]
[2021.02.05-02.52.43:638][  0]LogConfig: Setting CVar [[r.AmbientOcclusionLevels:-1]]
[2021.02.05-02.52.43:638][  0]LogConfig: Setting CVar [[r.AmbientOcclusionRadiusScale:1.0]]
[2021.02.05-02.52.43:638][  0]LogConfig: Setting CVar [[r.DepthOfFieldQuality:2]]
[2021.02.05-02.52.43:638][  0]LogConfig: Setting CVar [[r.RenderTargetPoolMin:400]]
[2021.02.05-02.52.43:638][  0]LogConfig: Setting CVar [[r.LensFlareQuality:2]]
[2021.02.05-02.52.43:638][  0]LogConfig: Setting CVar [[r.SceneColorFringeQuality:1]]
[2021.02.05-02.52.43:638][  0]LogConfig: Setting CVar [[r.EyeAdaptationQuality:2]]
[2021.02.05-02.52.43:638][  0]LogConfig: Setting CVar [[r.BloomQuality:5]]
[2021.02.05-02.52.43:638][  0]LogConfig: Setting CVar [[r.FastBlurThreshold:100]]
[2021.02.05-02.52.43:638][  0]LogConfig: Setting CVar [[r.Upscale.Quality:3]]
[2021.02.05-02.52.43:638][  0]LogConfig: Setting CVar [[r.Tonemapper.GrainQuantization:1]]
[2021.02.05-02.52.43:638][  0]LogConfig: Setting CVar [[r.LightShaftQuality:1]]
[2021.02.05-02.52.43:638][  0]LogConfig: Setting CVar [[r.Filter.SizeScale:1]]
[2021.02.05-02.52.43:638][  0]LogConfig: Setting CVar [[r.Tonemapper.Quality:5]]
[2021.02.05-02.52.43:638][  0]LogConfig: Setting CVar [[r.DOF.Gather.AccumulatorQuality:1        ; higher gathering accumulator quality]]
[2021.02.05-02.52.43:638][  0]LogConfig: Setting CVar [[r.DOF.Gather.PostfilterMethod:1          ; Median3x3 postfilering method]]
[2021.02.05-02.52.43:638][  0]LogConfig: Setting CVar [[r.DOF.Gather.EnableBokehSettings:0       ; no bokeh simulation when gathering]]
[2021.02.05-02.52.43:638][  0]LogConfig: Setting CVar [[r.DOF.Gather.RingCount:4                 ; medium number of samples when gathering]]
[2021.02.05-02.52.43:638][  0]LogConfig: Setting CVar [[r.DOF.Scatter.ForegroundCompositing:1    ; additive foreground scattering]]
[2021.02.05-02.52.43:638][  0]LogConfig: Setting CVar [[r.DOF.Scatter.BackgroundCompositing:2    ; additive background scattering]]
[2021.02.05-02.52.43:638][  0]LogConfig: Setting CVar [[r.DOF.Scatter.EnableBokehSettings:1      ; bokeh simulation when scattering]]
[2021.02.05-02.52.43:638][  0]LogConfig: Setting CVar [[r.DOF.Scatter.MaxSpriteRatio:0.1         ; only a maximum of 10% of scattered bokeh]]
[2021.02.05-02.52.43:638][  0]LogConfig: Setting CVar [[r.DOF.Recombine.Quality:1                ; cheap slight out of focus]]
[2021.02.05-02.52.43:638][  0]LogConfig: Setting CVar [[r.DOF.Recombine.EnableBokehSettings:0    ; no bokeh simulation on slight out of focus]]
[2021.02.05-02.52.43:638][  0]LogConfig: Setting CVar [[r.DOF.TemporalAAQuality:1                ; more stable temporal accumulation]]
[2021.02.05-02.52.43:638][  0]LogConfig: Setting CVar [[r.DOF.Kernel.MaxForegroundRadius:0.025]]
[2021.02.05-02.52.43:638][  0]LogConfig: Setting CVar [[r.DOF.Kernel.MaxBackgroundRadius:0.025]]
[2021.02.05-02.52.43:638][  0]LogConfig: Applying CVar settings from Section [TextureQuality@3] File [E:/Game Dev/GAMPRG Repository/P1_Endless_Runner/Saved/Config/Windows/Scalability.ini]
[2021.02.05-02.52.43:638][  0]LogConfig: Setting CVar [[r.Streaming.MipBias:0]]
[2021.02.05-02.52.43:638][  0]LogConfig: Setting CVar [[r.Streaming.AmortizeCPUToGPUCopy:0]]
[2021.02.05-02.52.43:638][  0]LogConfig: Setting CVar [[r.Streaming.MaxNumTexturesToStreamPerFrame:0]]
[2021.02.05-02.52.43:638][  0]LogConfig: Setting CVar [[r.Streaming.Boost:1]]
[2021.02.05-02.52.43:638][  0]LogConfig: Setting CVar [[r.MaxAnisotropy:8]]
[2021.02.05-02.52.43:638][  0]LogConfig: Setting CVar [[r.VT.MaxAnisotropy:8]]
[2021.02.05-02.52.43:638][  0]LogConfig: Setting CVar [[r.Streaming.LimitPoolSizeToVRAM:0]]
[2021.02.05-02.52.43:638][  0]LogConfig: Setting CVar [[r.Streaming.PoolSize:1000]]
[2021.02.05-02.52.43:638][  0]LogConfig: Setting CVar [[r.Streaming.MaxEffectiveScreenSize:0]]
[2021.02.05-02.52.43:638][  0]LogConfig: Applying CVar settings from Section [EffectsQuality@3] File [E:/Game Dev/GAMPRG Repository/P1_Endless_Runner/Saved/Config/Windows/Scalability.ini]
[2021.02.05-02.52.43:639][  0]LogConfig: Setting CVar [[r.TranslucencyLightingVolumeDim:64]]
[2021.02.05-02.52.43:639][  0]LogConfig: Setting CVar [[r.RefractionQuality:2]]
[2021.02.05-02.52.43:639][  0]LogConfig: Setting CVar [[r.SSR.Quality:3]]
[2021.02.05-02.52.43:639][  0]LogConfig: Setting CVar [[r.SSR.HalfResSceneColor:0]]
[2021.02.05-02.52.43:639][  0]LogConfig: Setting CVar [[r.SceneColorFormat:4]]
[2021.02.05-02.52.43:639][  0]LogConfig: Setting CVar [[r.DetailMode:2]]
[2021.02.05-02.52.43:639][  0]LogConfig: Setting CVar [[r.TranslucencyVolumeBlur:1]]
[2021.02.05-02.52.43:639][  0]LogConfig: Setting CVar [[r.MaterialQualityLevel:1 ; High quality]]
[2021.02.05-02.52.43:639][  0]LogConfig: Setting CVar [[r.SSS.Scale:1]]
[2021.02.05-02.52.43:639][  0]LogConfig: Setting CVar [[r.SSS.SampleSet:2]]
[2021.02.05-02.52.43:639][  0]LogConfig: Setting CVar [[r.SSS.Quality:1]]
[2021.02.05-02.52.43:639][  0]LogConfig: Setting CVar [[r.SSS.HalfRes:0]]
[2021.02.05-02.52.43:639][  0]LogConfig: Setting CVar [[r.SSGI.Quality:3]]
[2021.02.05-02.52.43:639][  0]LogConfig: Setting CVar [[r.EmitterSpawnRateScale:1.0]]
[2021.02.05-02.52.43:639][  0]LogConfig: Setting CVar [[r.ParticleLightQuality:2]]
[2021.02.05-02.52.43:639][  0]LogConfig: Setting CVar [[r.SkyAtmosphere.AerialPerspectiveLUT.FastApplyOnOpaque:1 ; Always have FastSkyLUT 1 in this case to avoid wrong sky]]
[2021.02.05-02.52.43:639][  0]LogConfig: Setting CVar [[r.SkyAtmosphere.AerialPerspectiveLUT.SampleCountPerSlice:1]]
[2021.02.05-02.52.43:639][  0]LogConfig: Setting CVar [[r.SkyAtmosphere.AerialPerspectiveLUT.DepthResolution:16.0]]
[2021.02.05-02.52.43:639][  0]LogConfig: Setting CVar [[r.SkyAtmosphere.FastSkyLUT:1]]
[2021.02.05-02.52.43:639][  0]LogConfig: Setting CVar [[r.SkyAtmosphere.FastSkyLUT.SampleCountMin:4.0]]
[2021.02.05-02.52.43:639][  0]LogConfig: Setting CVar [[r.SkyAtmosphere.FastSkyLUT.SampleCountMax:32.0]]
[2021.02.05-02.52.43:639][  0]LogConfig: Setting CVar [[r.SkyAtmosphere.SampleCountMin:4.0]]
[2021.02.05-02.52.43:639][  0]LogConfig: Setting CVar [[r.SkyAtmosphere.SampleCountMax:32.0]]
[2021.02.05-02.52.43:639][  0]LogConfig: Setting CVar [[r.SkyAtmosphere.TransmittanceLUT.UseSmallFormat:0]]
[2021.02.05-02.52.43:639][  0]LogConfig: Setting CVar [[r.SkyAtmosphere.TransmittanceLUT.SampleCount:10.0]]
[2021.02.05-02.52.43:639][  0]LogConfig: Setting CVar [[r.SkyAtmosphere.MultiScatteringLUT.SampleCount:15.0]]
[2021.02.05-02.52.43:639][  0]LogConfig: Applying CVar settings from Section [FoliageQuality@3] File [E:/Game Dev/GAMPRG Repository/P1_Endless_Runner/Saved/Config/Windows/Scalability.ini]
[2021.02.05-02.52.43:639][  0]LogConfig: Setting CVar [[foliage.DensityScale:1.0]]
[2021.02.05-02.52.43:639][  0]LogConfig: Setting CVar [[grass.DensityScale:1.0]]
[2021.02.05-02.52.43:639][  0]LogConfig: Applying CVar settings from Section [ShadingQuality@3] File [E:/Game Dev/GAMPRG Repository/P1_Endless_Runner/Saved/Config/Windows/Scalability.ini]
[2021.02.05-02.52.43:639][  0]LogConfig: Setting CVar [[r.HairStrands.SkyLighting.SampleCount:16]]
[2021.02.05-02.52.43:639][  0]LogConfig: Setting CVar [[r.HairStrands.SkyLighting.JitterIntegration:0]]
[2021.02.05-02.52.43:639][  0]LogConfig: Setting CVar [[r.HairStrands.SkyAO.SampleCount:16]]
[2021.02.05-02.52.43:639][  0]LogConfig: Setting CVar [[r.HairStrands.DeepShadow.SuperSampling:0]]
[2021.02.05-02.52.43:639][  0]LogConfig: Setting CVar [[r.HairStrands.VisibilityPPLL:0]]
[2021.02.05-02.52.43:639][  0]LogConfig: Setting CVar [[r.HairStrands.RasterizationScale:0.5]]
[2021.02.05-02.52.43:639][  0]LogConfig: Setting CVar [[r.HairStrands.VelocityRasterizationScale:1]]
[2021.02.05-02.52.43:639][  0]LogInit: Selected Device Profile: [Windows]
[2021.02.05-02.52.43:639][  0]LogInit: Applying CVar settings loaded from the selected device profile: [Windows]
[2021.02.05-02.52.43:639][  0]LogHAL: Display: Platform has ~ 16 GB [17092726784 / 17179869184 / 16], which maps to Larger [LargestMinGB=32, LargerMinGB=12, DefaultMinGB=8, SmallerMinGB=6, SmallestMinGB=0)
[2021.02.05-02.52.43:639][  0]LogInit: Going up to parent DeviceProfile []
[2021.02.05-02.52.43:639][  0]LogConfig: Applying CVar settings from Section [ViewDistanceQuality@3] File [E:/Game Dev/GAMPRG Repository/P1_Endless_Runner/Saved/Config/Windows/Scalability.ini]
[2021.02.05-02.52.43:639][  0]LogConfig: Setting CVar [[r.SkeletalMeshLODBias:0]]
[2021.02.05-02.52.43:639][  0]LogConfig: Setting CVar [[r.ViewDistanceScale:1.0]]
[2021.02.05-02.52.43:639][  0]LogConfig: Applying CVar settings from Section [AntiAliasingQuality@3] File [E:/Game Dev/GAMPRG Repository/P1_Endless_Runner/Saved/Config/Windows/Scalability.ini]
[2021.02.05-02.52.43:639][  0]LogConfig: Setting CVar [[r.PostProcessAAQuality:4]]
[2021.02.05-02.52.43:639][  0]LogConfig: Applying CVar settings from Section [ShadowQuality@3] File [E:/Game Dev/GAMPRG Repository/P1_Endless_Runner/Saved/Config/Windows/Scalability.ini]
[2021.02.05-02.52.43:639][  0]LogConfig: Setting CVar [[r.LightFunctionQuality:1]]
[2021.02.05-02.52.43:639][  0]LogConfig: Setting CVar [[r.ShadowQuality:5]]
[2021.02.05-02.52.43:639][  0]LogConfig: Setting CVar [[r.Shadow.CSM.MaxCascades:10]]
[2021.02.05-02.52.43:639][  0]LogConfig: Setting CVar [[r.Shadow.MaxResolution:2048]]
[2021.02.05-02.52.43:639][  0]LogConfig: Setting CVar [[r.Shadow.MaxCSMResolution:2048]]
[2021.02.05-02.52.43:639][  0]LogConfig: Setting CVar [[r.Shadow.RadiusThreshold:0.01]]
[2021.02.05-02.52.43:639][  0]LogConfig: Setting CVar [[r.Shadow.DistanceScale:1.0]]
[2021.02.05-02.52.43:639][  0]LogConfig: Setting CVar [[r.Shadow.CSM.TransitionScale:1.0]]
[2021.02.05-02.52.43:639][  0]LogConfig: Setting CVar [[r.Shadow.PreShadowResolutionFactor:1.0]]
[2021.02.05-02.52.43:639][  0]LogConfig: Setting CVar [[r.DistanceFieldShadowing:1]]
[2021.02.05-02.52.43:639][  0]LogConfig: Setting CVar [[r.DistanceFieldAO:1]]
[2021.02.05-02.52.43:639][  0]LogConfig: Setting CVar [[r.AOQuality:2]]
[2021.02.05-02.52.43:639][  0]LogConfig: Setting CVar [[r.VolumetricFog:1]]
[2021.02.05-02.52.43:639][  0]LogConfig: Setting CVar [[r.VolumetricFog.GridPixelSize:8]]
[2021.02.05-02.52.43:639][  0]LogConfig: Setting CVar [[r.VolumetricFog.GridSizeZ:128]]
[2021.02.05-02.52.43:639][  0]LogConfig: Setting CVar [[r.VolumetricFog.HistoryMissSupersampleCount:4]]
[2021.02.05-02.52.43:639][  0]LogConfig: Setting CVar [[r.LightMaxDrawDistanceScale:1]]
[2021.02.05-02.52.43:639][  0]LogConfig: Setting CVar [[r.CapsuleShadows:1]]
[2021.02.05-02.52.43:639][  0]LogConfig: Applying CVar settings from Section [PostProcessQuality@3] File [E:/Game Dev/GAMPRG Repository/P1_Endless_Runner/Saved/Config/Windows/Scalability.ini]
[2021.02.05-02.52.43:639][  0]LogConfig: Setting CVar [[r.MotionBlurQuality:4]]
[2021.02.05-02.52.43:639][  0]LogConfig: Setting CVar [[r.AmbientOcclusionMipLevelFactor:0.4]]
[2021.02.05-02.52.43:639][  0]LogConfig: Setting CVar [[r.AmbientOcclusionMaxQuality:100]]
[2021.02.05-02.52.43:639][  0]LogConfig: Setting CVar [[r.AmbientOcclusionLevels:-1]]
[2021.02.05-02.52.43:639][  0]LogConfig: Setting CVar [[r.AmbientOcclusionRadiusScale:1.0]]
[2021.02.05-02.52.43:639][  0]LogConfig: Setting CVar [[r.DepthOfFieldQuality:2]]
[2021.02.05-02.52.43:639][  0]LogConfig: Setting CVar [[r.RenderTargetPoolMin:400]]
[2021.02.05-02.52.43:639][  0]LogConfig: Setting CVar [[r.LensFlareQuality:2]]
[2021.02.05-02.52.43:639][  0]LogConfig: Setting CVar [[r.SceneColorFringeQuality:1]]
[2021.02.05-02.52.43:639][  0]LogConfig: Setting CVar [[r.EyeAdaptationQuality:2]]
[2021.02.05-02.52.43:639][  0]LogConfig: Setting CVar [[r.BloomQuality:5]]
[2021.02.05-02.52.43:639][  0]LogConfig: Setting CVar [[r.FastBlurThreshold:100]]
[2021.02.05-02.52.43:639][  0]LogConfig: Setting CVar [[r.Upscale.Quality:3]]
[2021.02.05-02.52.43:639][  0]LogConfig: Setting CVar [[r.Tonemapper.GrainQuantization:1]]
[2021.02.05-02.52.43:639][  0]LogConfig: Setting CVar [[r.LightShaftQuality:1]]
[2021.02.05-02.52.43:639][  0]LogConfig: Setting CVar [[r.Filter.SizeScale:1]]
[2021.02.05-02.52.43:639][  0]LogConfig: Setting CVar [[r.Tonemapper.Quality:5]]
[2021.02.05-02.52.43:639][  0]LogConfig: Setting CVar [[r.DOF.Gather.AccumulatorQuality:1        ; higher gathering accumulator quality]]
[2021.02.05-02.52.43:639][  0]LogConfig: Setting CVar [[r.DOF.Gather.PostfilterMethod:1          ; Median3x3 postfilering method]]
[2021.02.05-02.52.43:639][  0]LogConfig: Setting CVar [[r.DOF.Gather.EnableBokehSettings:0       ; no bokeh simulation when gathering]]
[2021.02.05-02.52.43:639][  0]LogConfig: Setting CVar [[r.DOF.Gather.RingCount:4                 ; medium number of samples when gathering]]
[2021.02.05-02.52.43:639][  0]LogConfig: Setting CVar [[r.DOF.Scatter.ForegroundCompositing:1    ; additive foreground scattering]]
[2021.02.05-02.52.43:639][  0]LogConfig: Setting CVar [[r.DOF.Scatter.BackgroundCompositing:2    ; additive background scattering]]
[2021.02.05-02.52.43:639][  0]LogConfig: Setting CVar [[r.DOF.Scatter.EnableBokehSettings:1      ; bokeh simulation when scattering]]
[2021.02.05-02.52.43:639][  0]LogConfig: Setting CVar [[r.DOF.Scatter.MaxSpriteRatio:0.1         ; only a maximum of 10% of scattered bokeh]]
[2021.02.05-02.52.43:639][  0]LogConfig: Setting CVar [[r.DOF.Recombine.Quality:1                ; cheap slight out of focus]]
[2021.02.05-02.52.43:639][  0]LogConfig: Setting CVar [[r.DOF.Recombine.EnableBokehSettings:0    ; no bokeh simulation on slight out of focus]]
[2021.02.05-02.52.43:639][  0]LogConfig: Setting CVar [[r.DOF.TemporalAAQuality:1                ; more stable temporal accumulation]]
[2021.02.05-02.52.43:639][  0]LogConfig: Setting CVar [[r.DOF.Kernel.MaxForegroundRadius:0.025]]
[2021.02.05-02.52.43:639][  0]LogConfig: Setting CVar [[r.DOF.Kernel.MaxBackgroundRadius:0.025]]
[2021.02.05-02.52.43:639][  0]LogConfig: Applying CVar settings from Section [TextureQuality@3] File [E:/Game Dev/GAMPRG Repository/P1_Endless_Runner/Saved/Config/Windows/Scalability.ini]
[2021.02.05-02.52.43:639][  0]LogConfig: Setting CVar [[r.Streaming.MipBias:0]]
[2021.02.05-02.52.43:639][  0]LogConfig: Setting CVar [[r.Streaming.AmortizeCPUToGPUCopy:0]]
[2021.02.05-02.52.43:639][  0]LogConfig: Setting CVar [[r.Streaming.MaxNumTexturesToStreamPerFrame:0]]
[2021.02.05-02.52.43:639][  0]LogConfig: Setting CVar [[r.Streaming.Boost:1]]
[2021.02.05-02.52.43:639][  0]LogConfig: Setting CVar [[r.MaxAnisotropy:8]]
[2021.02.05-02.52.43:639][  0]LogConfig: Setting CVar [[r.VT.MaxAnisotropy:8]]
[2021.02.05-02.52.43:639][  0]LogConfig: Setting CVar [[r.Streaming.LimitPoolSizeToVRAM:0]]
[2021.02.05-02.52.43:639][  0]LogConfig: Setting CVar [[r.Streaming.PoolSize:1000]]
[2021.02.05-02.52.43:639][  0]LogConfig: Setting CVar [[r.Streaming.MaxEffectiveScreenSize:0]]
[2021.02.05-02.52.43:639][  0]LogConfig: Applying CVar settings from Section [EffectsQuality@3] File [E:/Game Dev/GAMPRG Repository/P1_Endless_Runner/Saved/Config/Windows/Scalability.ini]
[2021.02.05-02.52.43:639][  0]LogConfig: Setting CVar [[r.TranslucencyLightingVolumeDim:64]]
[2021.02.05-02.52.43:639][  0]LogConfig: Setting CVar [[r.RefractionQuality:2]]
[2021.02.05-02.52.43:639][  0]LogConfig: Setting CVar [[r.SSR.Quality:3]]
[2021.02.05-02.52.43:639][  0]LogConfig: Setting CVar [[r.SSR.HalfResSceneColor:0]]
[2021.02.05-02.52.43:640][  0]LogConfig: Setting CVar [[r.SceneColorFormat:4]]
[2021.02.05-02.52.43:640][  0]LogConfig: Setting CVar [[r.DetailMode:2]]
[2021.02.05-02.52.43:640][  0]LogConfig: Setting CVar [[r.TranslucencyVolumeBlur:1]]
[2021.02.05-02.52.43:640][  0]LogConfig: Setting CVar [[r.MaterialQualityLevel:1 ; High quality]]
[2021.02.05-02.52.43:640][  0]LogConfig: Setting CVar [[r.SSS.Scale:1]]
[2021.02.05-02.52.43:640][  0]LogConfig: Setting CVar [[r.SSS.SampleSet:2]]
[2021.02.05-02.52.43:640][  0]LogConfig: Setting CVar [[r.SSS.Quality:1]]
[2021.02.05-02.52.43:640][  0]LogConfig: Setting CVar [[r.SSS.HalfRes:0]]
[2021.02.05-02.52.43:640][  0]LogConfig: Setting CVar [[r.SSGI.Quality:3]]
[2021.02.05-02.52.43:640][  0]LogConfig: Setting CVar [[r.EmitterSpawnRateScale:1.0]]
[2021.02.05-02.52.43:640][  0]LogConfig: Setting CVar [[r.ParticleLightQuality:2]]
[2021.02.05-02.52.43:640][  0]LogConfig: Setting CVar [[r.SkyAtmosphere.AerialPerspectiveLUT.FastApplyOnOpaque:1 ; Always have FastSkyLUT 1 in this case to avoid wrong sky]]
[2021.02.05-02.52.43:640][  0]LogConfig: Setting CVar [[r.SkyAtmosphere.AerialPerspectiveLUT.SampleCountPerSlice:1]]
[2021.02.05-02.52.43:640][  0]LogConfig: Setting CVar [[r.SkyAtmosphere.AerialPerspectiveLUT.DepthResolution:16.0]]
[2021.02.05-02.52.43:640][  0]LogConfig: Setting CVar [[r.SkyAtmosphere.FastSkyLUT:1]]
[2021.02.05-02.52.43:640][  0]LogConfig: Setting CVar [[r.SkyAtmosphere.FastSkyLUT.SampleCountMin:4.0]]
[2021.02.05-02.52.43:640][  0]LogConfig: Setting CVar [[r.SkyAtmosphere.FastSkyLUT.SampleCountMax:32.0]]
[2021.02.05-02.52.43:640][  0]LogConfig: Setting CVar [[r.SkyAtmosphere.SampleCountMin:4.0]]
[2021.02.05-02.52.43:640][  0]LogConfig: Setting CVar [[r.SkyAtmosphere.SampleCountMax:32.0]]
[2021.02.05-02.52.43:640][  0]LogConfig: Setting CVar [[r.SkyAtmosphere.TransmittanceLUT.UseSmallFormat:0]]
[2021.02.05-02.52.43:640][  0]LogConfig: Setting CVar [[r.SkyAtmosphere.TransmittanceLUT.SampleCount:10.0]]
[2021.02.05-02.52.43:640][  0]LogConfig: Setting CVar [[r.SkyAtmosphere.MultiScatteringLUT.SampleCount:15.0]]
[2021.02.05-02.52.43:640][  0]LogConfig: Applying CVar settings from Section [FoliageQuality@3] File [E:/Game Dev/GAMPRG Repository/P1_Endless_Runner/Saved/Config/Windows/Scalability.ini]
[2021.02.05-02.52.43:640][  0]LogConfig: Setting CVar [[foliage.DensityScale:1.0]]
[2021.02.05-02.52.43:640][  0]LogConfig: Setting CVar [[grass.DensityScale:1.0]]
[2021.02.05-02.52.43:640][  0]LogConfig: Applying CVar settings from Section [ShadingQuality@3] File [E:/Game Dev/GAMPRG Repository/P1_Endless_Runner/Saved/Config/Windows/Scalability.ini]
[2021.02.05-02.52.43:640][  0]LogConfig: Setting CVar [[r.HairStrands.SkyLighting.SampleCount:16]]
[2021.02.05-02.52.43:640][  0]LogConfig: Setting CVar [[r.HairStrands.SkyLighting.JitterIntegration:0]]
[2021.02.05-02.52.43:640][  0]LogConfig: Setting CVar [[r.HairStrands.SkyAO.SampleCount:16]]
[2021.02.05-02.52.43:640][  0]LogConfig: Setting CVar [[r.HairStrands.DeepShadow.SuperSampling:0]]
[2021.02.05-02.52.43:640][  0]LogConfig: Setting CVar [[r.HairStrands.VisibilityPPLL:0]]
[2021.02.05-02.52.43:640][  0]LogConfig: Setting CVar [[r.HairStrands.RasterizationScale:0.5]]
[2021.02.05-02.52.43:640][  0]LogConfig: Setting CVar [[r.HairStrands.VelocityRasterizationScale:1]]
[2021.02.05-02.52.43:640][  0]LogConfig: Applying CVar settings from Section [Startup] File [../../../Engine/Config/ConsoleVariables.ini]
[2021.02.05-02.52.43:652][  0]LogConfig: Setting CVar [[net.UseAdaptiveNetUpdateFrequency:0]]
[2021.02.05-02.52.43:652][  0]LogConfig: Setting CVar [[p.chaos.AllowCreatePhysxBodies:1]]
[2021.02.05-02.52.43:652][  0]LogConfig: Setting CVar [[fx.SkipVectorVMBackendOptimizations:1]]
[2021.02.05-02.52.43:652][  0]LogConfig: Applying CVar settings from Section [ConsoleVariables] File [E:/Game Dev/GAMPRG Repository/P1_Endless_Runner/Saved/Config/Windows/Engine.ini]
[2021.02.05-02.52.43:652][  0]LogInit: Computer: DESKTOP-DA46KA4
[2021.02.05-02.52.43:652][  0]LogInit: User: Usern
[2021.02.05-02.52.43:652][  0]LogInit: CPU Page size=4096, Cores=8
[2021.02.05-02.52.43:652][  0]LogInit: High frequency timer resolution =10.000000 MHz
[2021.02.05-02.52.43:652][  0]LogMemory: Memory total: Physical=15.9GB (16GB approx)
[2021.02.05-02.52.43:652][  0]LogMemory: Platform Memory Stats for Windows
[2021.02.05-02.52.43:652][  0]LogMemory: Process Physical Memory: 115.42 MB used, 115.43 MB peak
[2021.02.05-02.52.43:652][  0]LogMemory: Process Virtual Memory: 96.21 MB used, 96.21 MB peak
[2021.02.05-02.52.43:652][  0]LogMemory: Physical Memory: 5828.39 MB used,  10472.50 MB free, 16300.89 MB total
[2021.02.05-02.52.43:652][  0]LogMemory: Virtual Memory: 5148.87 MB used,  134212576.00 MB free, 134217728.00 MB total
[2021.02.05-02.52.43:723][  0]LogWindows: WindowsPlatformFeatures enabled
[2021.02.05-02.52.44:703][  0]LogInit: Physics initialised using underlying interface: PhysX
[2021.02.05-02.52.44:721][  0]LogInit: Using OS detected language (en-US).
[2021.02.05-02.52.44:721][  0]LogInit: Using OS detected locale (en-PH).
[2021.02.05-02.52.44:722][  0]LogTextLocalizationManager: No specific localization for 'en-US' exists, so the 'en' localization will be used.
[2021.02.05-02.52.47:490][  0]LogInit: Setting process to per monitor DPI aware
[2021.02.05-02.52.47:586][  0]LogSlate: New Slate User Created.  User Index 0, Is Virtual User: 0
[2021.02.05-02.52.47:586][  0]LogSlate: Slate User Registered.  User Index 0, Is Virtual User: 0
[2021.02.05-02.52.48:042][  0]LogHMD: Failed to initialize OpenVR with code 110
[2021.02.05-02.52.48:042][  0]LogD3D11RHI: D3D11 min allowed feature level: 11_0
[2021.02.05-02.52.48:042][  0]LogD3D11RHI: D3D11 max allowed feature level: 11_0
[2021.02.05-02.52.48:042][  0]LogD3D11RHI: D3D11 adapters:
[2021.02.05-02.52.48:545][  0]LogD3D11RHI:    0. 'NVIDIA GeForce RTX 2060' (Feature Level 11_0)
[2021.02.05-02.52.48:545][  0]LogD3D11RHI:       5980/0/8150 MB DedicatedVideo/DedicatedSystem/SharedSystem, Outputs:2, VendorId:0x10de
[2021.02.05-02.52.48:692][  0]LogD3D11RHI:    1. 'Microsoft Basic Render Driver' (Feature Level 11_0)
[2021.02.05-02.52.48:692][  0]LogD3D11RHI:       0/0/8150 MB DedicatedVideo/DedicatedSystem/SharedSystem, Outputs:0, VendorId:0x1414
[2021.02.05-02.52.48:692][  0]LogD3D11RHI: Chosen D3D11 Adapter: 0
[2021.02.05-02.52.48:695][  0]LogD3D11RHI: Creating new Direct3DDevice
[2021.02.05-02.52.48:695][  0]LogD3D11RHI:     GPU DeviceId: 0x1f08 (for the marketing name, search the web for "GPU Device Id")
[2021.02.05-02.52.48:695][  0]LogWindows: EnumDisplayDevices:
[2021.02.05-02.52.48:695][  0]LogWindows:    0. 'NVIDIA GeForce RTX 2060' (P:1 D:1)
[2021.02.05-02.52.48:695][  0]LogWindows:    1. 'NVIDIA GeForce RTX 2060' (P:0 D:1)
[2021.02.05-02.52.48:695][  0]LogWindows:    2. 'NVIDIA GeForce RTX 2060' (P:0 D:0)
[2021.02.05-02.52.48:696][  0]LogWindows:    3. 'NVIDIA GeForce RTX 2060' (P:0 D:0)
[2021.02.05-02.52.48:696][  0]LogWindows: DebugString: FoundDriverCount:4 
[2021.02.05-02.52.48:696][  0]LogD3D11RHI:     Adapter Name: NVIDIA GeForce RTX 2060
[2021.02.05-02.52.48:696][  0]LogD3D11RHI:   Driver Version: 460.89 (internal:27.21.14.6089, unified:460.89)
[2021.02.05-02.52.48:696][  0]LogD3D11RHI:      Driver Date: 12-11-2020
[2021.02.05-02.52.48:696][  0]LogRHI: Texture pool is 4186 MB (70% of 5980 MB)
[2021.02.05-02.52.48:763][  0]LogD3D11RHI: RHI has support for 64 bit atomics
[2021.02.05-02.52.48:764][  0]LogD3D11RHI: Async texture creation enabled
[2021.02.05-02.52.48:764][  0]LogD3D11RHI: Array index from any shader is supported
[2021.02.05-02.52.48:781][  0]LogD3D11RHI: GPU Timing Frequency: 1000.000000 (Debug: 2 2)
[2021.02.05-02.52.57:512][  0]LogTargetPlatformManager: Display: Loaded TargetPlatform 'AllDesktop'
[2021.02.05-02.52.57:633][  0]LogTargetPlatformManager: Display: Loaded TargetPlatform 'Android'
[2021.02.05-02.52.57:633][  0]LogTargetPlatformManager: Display: Loaded TargetPlatform 'Android_ASTC'
[2021.02.05-02.52.57:633][  0]LogTargetPlatformManager: Display: Loaded TargetPlatform 'Android_DXT'
[2021.02.05-02.52.57:633][  0]LogTargetPlatformManager: Display: Loaded TargetPlatform 'Android_ETC2'
[2021.02.05-02.52.57:633][  0]LogTargetPlatformManager: Display: Loaded TargetPlatform 'AndroidClient'
[2021.02.05-02.52.57:633][  0]LogTargetPlatformManager: Display: Loaded TargetPlatform 'Android_ASTCClient'
[2021.02.05-02.52.57:633][  0]LogTargetPlatformManager: Display: Loaded TargetPlatform 'Android_DXTClient'
[2021.02.05-02.52.57:633][  0]LogTargetPlatformManager: Display: Loaded TargetPlatform 'Android_ETC2Client'
[2021.02.05-02.52.57:633][  0]LogTargetPlatformManager: Display: Loaded TargetPlatform 'Android_Multi'
[2021.02.05-02.52.57:633][  0]LogTargetPlatformManager: Display: Loaded TargetPlatform 'Android_MultiClient'
[2021.02.05-02.52.57:677][  0]LogTargetPlatformManager: Display: Loaded TargetPlatform 'IOSClient'
[2021.02.05-02.52.57:677][  0]LogTargetPlatformManager: Display: Loaded TargetPlatform 'IOS'
[2021.02.05-02.52.57:777][  0]LogTargetPlatformManager: Display: Loaded TargetPlatform 'Linux'
[2021.02.05-02.52.57:783][  0]LogTargetPlatformManager: Display: Loaded TargetPlatform 'LinuxNoEditor'
[2021.02.05-02.52.57:789][  0]LogTargetPlatformManager: Display: Loaded TargetPlatform 'LinuxClient'
[2021.02.05-02.52.57:796][  0]LogTargetPlatformManager: Display: Loaded TargetPlatform 'LinuxServer'
[2021.02.05-02.52.57:802][  0]LogTargetPlatformManager: Display: Loaded TargetPlatform 'LinuxAArch64NoEditor'
[2021.02.05-02.52.57:807][  0]LogTargetPlatformManager: Display: Loaded TargetPlatform 'LinuxAArch64Client'
[2021.02.05-02.52.57:814][  0]LogTargetPlatformManager: Display: Loaded TargetPlatform 'LinuxAArch64Server'
[2021.02.05-02.52.57:833][  0]LogTargetPlatformManager: Display: Loaded TargetPlatform 'Lumin'
[2021.02.05-02.52.57:833][  0]LogTargetPlatformManager: Display: Loaded TargetPlatform 'LuminClient'
[2021.02.05-02.52.57:844][  0]LogTargetPlatformManager: Display: Loaded TargetPlatform 'TVOSClient'
[2021.02.05-02.52.57:844][  0]LogTargetPlatformManager: Display: Loaded TargetPlatform 'TVOS'
[2021.02.05-02.52.57:850][  0]LogTargetPlatformManager: Display: Loaded TargetPlatform 'WindowsNoEditor'
[2021.02.05-02.52.57:864][  0]LogTargetPlatformManager: Display: Loaded TargetPlatform 'Windows'
[2021.02.05-02.52.57:870][  0]LogTargetPlatformManager: Display: Loaded TargetPlatform 'WindowsClient'
[2021.02.05-02.52.57:877][  0]LogTargetPlatformManager: Display: Loaded TargetPlatform 'WindowsServer'
[2021.02.05-02.52.57:877][  0]LogTargetPlatformManager: Display: Building Assets For Windows
[2021.02.05-02.52.57:904][  0]LogAudioDebug: Display: Lib vorbis DLL was dynamically loaded.
[2021.02.05-02.52.58:351][  0]LogShaderCompilers: Guid format shader working directory is -5 characters bigger than the processId version (../../../../../GAMPRG Repository/P1_Endless_Runner/Intermediate/Shaders/WorkingDirectory/13264/).
[2021.02.05-02.52.58:351][  0]LogShaderCompilers: Cleaned the shader compiler working directory 'C:/Users/Usern/AppData/Local/Temp/UnrealShaderWorkingDir/83189ADE4027938E8E2CBAAC1F7FB159/'.
[2021.02.05-02.52.58:352][  0]LogXGEController: Cleaning working directory: C:/Users/Usern/AppData/Local/Temp/UnrealXGEWorkingDir/
[2021.02.05-02.52.58:352][  0]LogXGEController: Cannot use XGE Controller as Incredibuild is not installed on this machine.
[2021.02.05-02.52.58:352][  0]LogShaderCompilers: Cannot use XGE Shader Compiler as Incredibuild is not installed on this machine.
[2021.02.05-02.52.58:352][  0]LogShaderCompilers: Display: Using Local Shader Compiler.
[2021.02.05-02.53.00:457][  0]LogDerivedDataCache: Display: Max Cache Size: 512 MB
[2021.02.05-02.53.01:105][  0]LogDerivedDataCache: Loaded boot cache 0.65s 76MB C:/Users/Usern/AppData/Local/UnrealEngine/4.25/DerivedDataCache/Boot.ddc.
[2021.02.05-02.53.01:105][  0]LogDerivedDataCache: Display: Loaded Boot cache: C:/Users/Usern/AppData/Local/UnrealEngine/4.25/DerivedDataCache/Boot.ddc
[2021.02.05-02.53.01:105][  0]LogDerivedDataCache: FDerivedDataBackendGraph:  Pak pak cache file ../../../../../GAMPRG Repository/P1_Endless_Runner/DerivedDataCache/DDC.ddp not found, will not use a pak cache.
[2021.02.05-02.53.01:105][  0]LogDerivedDataCache: Unable to find inner node Pak for hierarchical cache Hierarchy.
[2021.02.05-02.53.01:105][  0]LogDerivedDataCache: FDerivedDataBackendGraph:  CompressedPak pak cache file ../../../../../GAMPRG Repository/P1_Endless_Runner/DerivedDataCache/Compressed.ddp not found, will not use a pak cache.
[2021.02.05-02.53.01:105][  0]LogDerivedDataCache: Unable to find inner node CompressedPak for hierarchical cache Hierarchy.
[2021.02.05-02.53.01:114][  0]LogDerivedDataCache: Display: Pak cache opened for reading ../../../Engine/DerivedDataCache/Compressed.ddp.
[2021.02.05-02.53.01:114][  0]LogDerivedDataCache: FDerivedDataBackendGraph:  EnterprisePak pak cache file ../../../Enterprise/DerivedDataCache/Compressed.ddp not found, will not use a pak cache.
[2021.02.05-02.53.01:114][  0]LogDerivedDataCache: Unable to find inner node EnterprisePak for hierarchical cache Hierarchy.
[2021.02.05-02.53.01:115][  0]LogDerivedDataCache: Using Local data cache path C:/Users/Usern/AppData/Local/UnrealEngine/Common/DerivedDataCache: Writable
[2021.02.05-02.53.01:115][  0]LogDerivedDataCache: Shared data cache path not found in *engine.ini, will not use an Shared cache.
[2021.02.05-02.53.01:115][  0]LogDerivedDataCache: Unable to find inner node Shared for hierarchical cache Hierarchy.
[2021.02.05-02.53.01:153][  0]LogSlate: Using FreeType 2.10.0
[2021.02.05-02.53.01:154][  0]LogSlate: SlateFontServices - WITH_FREETYPE: 1, WITH_HARFBUZZ: 1
[2021.02.05-02.53.01:289][  0]LogAssetRegistry: FAssetRegistry took 0.0019 seconds to start up
[2021.02.05-02.53.01:719][  0]LogInit: Selected Device Profile: [Windows]
[2021.02.05-02.53.03:595][  0]LogMeshReduction: Using QuadricMeshReduction for automatic static mesh reduction
[2021.02.05-02.53.03:595][  0]LogMeshReduction: Using SimplygonMeshReduction for automatic skeletal mesh reduction
[2021.02.05-02.53.03:595][  0]LogMeshReduction: Using ProxyLODMeshReduction for automatic mesh merging
[2021.02.05-02.53.03:595][  0]LogMeshReduction: No distributed automatic mesh merging module available
[2021.02.05-02.53.03:595][  0]LogMeshMerging: No distributed automatic mesh merging module available
[2021.02.05-02.53.03:627][  0]LogNetVersion: P1_Endless_Runner 1.0.0, NetCL: 13144385, EngineNetVer: 14, GameNetVer: 0 (Checksum: 134560594)
[2021.02.05-02.53.07:225][  0]LogAISub: UAISubsystem::UAISubsystem AISubsystem (0000025D50514CC0), frame # 0
[2021.02.05-02.53.07:225][  0]LogAISub: UAISubsystem::UAISubsystem AIPerceptionSystem (0000025D551E0680), frame # 0
[2021.02.05-02.53.07:226][  0]LogAISub: UAISubsystem::UAISubsystem EnvQueryManager (0000025D551EDC00), frame # 0
[2021.02.05-02.53.07:271][  0]LogPackageLocalizationCache: Processed 19 localized package path(s) for 1 prioritized culture(s) in 0.040791 seconds
[2021.02.05-02.53.07:274][  0]LogUObjectArray: 15917 objects as part of root set at end of initial load.
[2021.02.05-02.53.07:274][  0]LogUObjectAllocator: 3965568 out of 0 bytes used by permanent object pool.
[2021.02.05-02.53.07:275][  0]LogUObjectArray: CloseDisregardForGC: 0/0 objects in disregard for GC pool
[2021.02.05-02.53.14:272][  0]LogTcpMessaging: Initializing TcpMessaging bridge
[2021.02.05-02.53.14:280][  0]LogUdpMessaging: Initializing bridge on interface 0.0.0.0:0 to multicast group 230.0.0.1:6666.
[2021.02.05-02.53.14:651][  0]SourceControl: Source control is disabled
[2021.02.05-02.53.14:652][  0]SourceControl: Source control is disabled
[2021.02.05-02.53.14:671][  0]SourceControl: Source control is disabled
[2021.02.05-02.53.14:682][  0]SourceControl: Source control is disabled
[2021.02.05-02.53.14:760][  0]SourceControl: Source control is disabled
[2021.02.05-02.53.19:422][  0]LogAndroidPermission: UAndroidPermissionCallbackProxy::GetInstance
[2021.02.05-02.53.19:561][  0]LogAudioCaptureCore: Display: No Audio Capture implementations found. Audio input will be silent.
[2021.02.05-02.53.19:561][  0]LogAudioCaptureCore: Display: No Audio Capture implementations found. Audio input will be silent.
[2021.02.05-02.53.19:766][  0]LogOcInput: OculusInput pre-init called
[2021.02.05-02.53.19:822][  0]LogWindows: Failed to load 'OVRPlugin.dll' (GetLastError=126)
[2021.02.05-02.53.19:822][  0]LogWindows: File 'OVRPlugin.dll' does not exist
[2021.02.05-02.53.20:026][  0]LogEngine: Initializing Engine...
[2021.02.05-02.53.20:027][  0]LogHMD: Failed to initialize OpenVR with code 110
[2021.02.05-02.53.20:027][  0]LogMagicLeap: Warning: VR disabled because ZI is not enabled.  To enable, in the editor, Edit -> Project Settings -> Plugins -> Magic Leap Plugin -> Enable Zero Iteration
[2021.02.05-02.53.20:028][  0]LogStats: UGameplayTagsManager::InitializeManager -  0.000 s
[2021.02.05-02.53.20:124][  0]LogInit: Initializing FReadOnlyCVARCache
[2021.02.05-02.53.20:515][  0]LogAIModule: Creating AISystem for world Untitled
[2021.02.05-02.53.20:515][  0]LogAISub: UAISubsystem::UAISubsystem EnvQueryManager (0000025D570B7C00), frame # 0
[2021.02.05-02.53.20:515][  0]LogAISub: UAISubsystem::UAISubsystem AIPerceptionSystem (0000025D5711D580), frame # 0
[2021.02.05-02.53.20:518][  0]LogAudioMixer: Display: Audio Mixer Platform Settings:
[2021.02.05-02.53.20:518][  0]LogAudioMixer: Display: 	Sample Rate:						  48000
[2021.02.05-02.53.20:518][  0]LogAudioMixer: Display: 	Callback Buffer Frame Size Requested: 1024
[2021.02.05-02.53.20:518][  0]LogAudioMixer: Display: 	Callback Buffer Frame Size To Use:	  1024
[2021.02.05-02.53.20:518][  0]LogAudioMixer: Display: 	Number of buffers to queue:			  2
[2021.02.05-02.53.20:518][  0]LogAudioMixer: Display: 	Max Channels (voices):				  32
[2021.02.05-02.53.20:518][  0]LogAudioMixer: Display: 	Number of Async Source Workers:		  0
[2021.02.05-02.53.20:518][  0]LogAudio: Display: AudioDevice MaxSources: 32
[2021.02.05-02.53.20:519][  0]LogAudio: Display: Using built-in audio occlusion.
[2021.02.05-02.53.20:519][  0]LogAudioMixer: Display: Initializing audio mixer.
[2021.02.05-02.53.20:573][  0]LogAudioMixer: Display: 0: FrontLeft
[2021.02.05-02.53.20:573][  0]LogAudioMixer: Display: 1: FrontRight
[2021.02.05-02.53.20:629][  0]LogAudioMixer: Display: Using Audio Device VoiceMeeter Input (VB-Audio VoiceMeeter VAIO)
[2021.02.05-02.53.20:631][  0]LogAudioMixer: Display: Initializing Sound Submixes...
[2021.02.05-02.53.20:632][  0]LogAudioMixer: Display: Creating Master Submix 'MasterSubmixDefault'
[2021.02.05-02.53.20:632][  0]LogAudioMixer: Display: Creating Master Submix 'MasterReverbSubmixDefault'
[2021.02.05-02.53.20:633][  0]LogAudioMixer: Display: Creating Master Submix 'MasterEQSubmixDefault'
[2021.02.05-02.53.20:633][  0]LogInit: FAudioDevice initialized.
[2021.02.05-02.53.20:633][  0]LogNetVersion: Set ProjectVersion to 1.0.0.0. Version Checksum will be recalculated on next use.
[2021.02.05-02.53.21:084][  0]LogDerivedDataCache: Saved boot cache 0.45s 76MB C:/Users/Usern/AppData/Local/UnrealEngine/4.25/DerivedDataCache/Boot.ddc.
[2021.02.05-02.53.21:084][  0]LogInit: Texture streaming: Enabled
[2021.02.05-02.53.22:002][  0]LogEngineSessionManager: EngineSessionManager initialized
[2021.02.05-02.53.22:176][  0]LogEngineSessionManager: EngineSessionManager sent abnormal shutdown report. Type=Crashed, SessionId={B0BC7E8F-40EF-7475-354C-EE8602421027}
[2021.02.05-02.53.22:176][  0]LogEditorSessionSummary: Verbose: Initializing EditorSessionSummaryWriter for editor session tracking
[2021.02.05-02.53.22:799][  0]LogEditorSessionSummary: EditorSessionSummaryWriter initialized
[2021.02.05-02.53.23:912][  0]LogInit: Transaction tracking system initialized
[2021.02.05-02.53.25:598][  0]BlueprintLog: New page: Editor Load
[2021.02.05-02.53.28:265][  0]LocalizationService: Localization service is disabled
[2021.02.05-02.53.32:637][  0]LogCook: Display: Max memory allowance for cook 16384mb min free memory 0mb
[2021.02.05-02.53.32:638][  0]LogCook: Display: Mobile HDR setting 1
[2021.02.05-02.53.33:753][  0]LogFileCache: Scanning file cache for directory 'E:/Game Dev/GAMPRG Repository/P1_Endless_Runner/Content/' took 0.62s
[2021.02.05-02.53.40:875][  0]SourceControl: Source control is disabled
[2021.02.05-02.53.40:883][  0]LogUnrealEdMisc: Loading editor; pre map load, took 90.460
[2021.02.05-02.53.40:920][  0]Cmd: MAP LOAD FILE="../../../../../GAMPRG Repository/P1_Endless_Runner/Content/ThirdPersonBP/Levels/Default.umap" TEMPLATE=0 SHOWPROGRESS=1 FEATURELEVEL=3
[2021.02.05-02.53.41:046][  0]LightingResults: New page: Lighting Build
[2021.02.05-02.53.41:516][  0]LogWorld: UWorld::CleanupWorld for Untitled, bSessionEnded=true, bCleanupResources=true
[2021.02.05-02.53.41:571][  0]LogSlate: InvalidateAllWidgets triggered.  All widgets were invalidated
[2021.02.05-02.53.41:696][  0]MapCheck: New page: Map Check
[2021.02.05-02.53.41:696][  0]LightingResults: New page: Lighting Build
[2021.02.05-02.53.42:646][  0]LogAISub: UAISubsystem::~UAISubsystem EnvQueryManager (0000025D570B7C00), frame # 0
[2021.02.05-02.53.42:660][  0]LogAISub: UAISubsystem::~UAISubsystem AIPerceptionSystem (0000025D5711D580), frame # 0
[2021.02.05-02.53.42:692][  0]LogUObjectHash: Compacting FUObjectHashTables data took   0.51ms
[2021.02.05-02.53.47:781][  0]LogAIModule: Creating AISystem for world Default
[2021.02.05-02.53.47:781][  0]LogAISub: UAISubsystem::UAISubsystem EnvQueryManager (0000025D4728DE00), frame # 0
[2021.02.05-02.53.47:781][  0]LogAISub: UAISubsystem::UAISubsystem AIPerceptionSystem (0000025D472D2840), frame # 0
[2021.02.05-02.53.48:639][  0]LogEditorServer: Finished looking for orphan Actors (0.000 secs)
[2021.02.05-02.53.48:960][  0]LogUObjectHash: Compacting FUObjectHashTables data took   0.60ms
[2021.02.05-02.53.48:961][  0]Cmd: MAP CHECKDEP NOCLEARLOG
[2021.02.05-02.53.48:961][  0]MapCheck: Map check complete: 0 Error(s), 0 Warning(s), took 0.258ms to complete.
[2021.02.05-02.53.48:961][  0]LogFileHelpers: Loading map 'Default' took 8.062
[2021.02.05-02.53.50:805][  0]LogUnrealEdMisc: Total Editor Startup Time, took 100.382
[2021.02.05-02.53.52:377][  0]LogSlate: Updating window title bar state: overlay mode, drag disabled, window buttons hidden, title bar hidden
[2021.02.05-02.53.52:382][  0]LogSlate: Updating window title bar state: overlay mode, drag disabled, window buttons hidden, title bar hidden
[2021.02.05-02.53.52:387][  0]LogSlate: Updating window title bar state: overlay mode, drag disabled, window buttons hidden, title bar hidden
[2021.02.05-02.53.52:392][  0]LogSlate: Updating window title bar state: overlay mode, drag disabled, window buttons hidden, title bar hidden
[2021.02.05-02.53.52:611][  0]LogCollectionManager: Loaded 0 collections in 0.000533 seconds
[2021.02.05-02.53.53:038][  0]LogFileCache: Scanning file cache for directory 'E:/Game Dev/GAMPRG Repository/P1_Endless_Runner/Saved/Collections/' took 0.00s
[2021.02.05-02.53.53:038][  0]LogFileCache: Scanning file cache for directory 'E:/Game Dev/GAMPRG Repository/P1_Endless_Runner/Content/Developers/Usern/Collections/' took 0.00s
[2021.02.05-02.53.53:038][  0]LogFileCache: Scanning file cache for directory 'E:/Game Dev/GAMPRG Repository/P1_Endless_Runner/Content/Collections/' took 0.00s
[2021.02.05-02.53.53:038][  0]LogContentBrowser: Native class hierarchy populated in 0.0093 seconds. Added 3427 classes and 821 folders.
[2021.02.05-02.53.53:340][  0]LogContentBrowser: Native class hierarchy updated for 'WidgetCarousel' in 0.0002 seconds. Added 0 classes and 0 folders.
[2021.02.05-02.53.54:921][  0]LogContentBrowser: Native class hierarchy updated for 'AddContentDialog' in 0.0003 seconds. Added 0 classes and 0 folders.
[2021.02.05-02.53.55:112][  0]LogContentBrowser: Native class hierarchy updated for 'SceneOutliner' in 0.0002 seconds. Added 2 classes and 0 folders.
[2021.02.05-02.53.58:832][  0]LogSlate: Took 0.014030 seconds to synchronously load lazily loaded font '../../../Engine/Content/Slate/Fonts/Roboto-Regular.ttf' (155K)
[2021.02.05-02.53.58:917][  0]LogSlate: Took 0.010636 seconds to synchronously load lazily loaded font '../../../Engine/Content/Slate/Fonts/Roboto-Bold.ttf' (160K)
[2021.02.05-02.53.59:254][  0]LogSlate: Took 0.005841 seconds to synchronously load lazily loaded font '../../../Engine/Content/Editor/Slate/Fonts/FontAwesome.ttf' (139K)
[2021.02.05-02.54.00:785][  0]LogRenderer: Reallocating scene render targets to support 1208x600 Format 10 NumSamples 1 (Frame:1).
[2021.02.05-02.54.05:874][  0]LogContentBrowser: Native class hierarchy updated for 'HierarchicalLODOutliner' in 0.0002 seconds. Added 0 classes and 0 folders.
[2021.02.05-02.54.05:874][  0]LogLoad: (Engine Initialization) Total time: 115.45 seconds
[2021.02.05-02.54.05:874][  0]LogLoad: (Engine Initialization) Total Blueprint compile time: 0.00 seconds
[2021.02.05-02.54.06:780][  0]LogContentStreaming: Texture pool size now 1000 MB
[2021.02.05-02.54.07:085][  0]LogSlate: Took 0.019471 seconds to synchronously load lazily loaded font '../../../Engine/Content/Slate/Fonts/Roboto-Light.ttf' (167K)
[2021.02.05-02.54.07:339][  1]LogAssetRegistry: Asset discovery search completed in 66.0504 seconds
[2021.02.05-02.54.07:457][  1]LogCollectionManager: Fixed up redirectors for 0 collections in 0.000002 seconds (updated 0 objects)
[2021.02.05-02.54.08:904][  2]LogSlate: Took 0.000109 seconds to synchronously load lazily loaded font '../../../Engine/Content/Slate/Fonts/Roboto-Light.ttf' (167K)
[2021.02.05-02.54.16:867][ 26]LogAssetEditorSubsystem: Opening Asset editor for Blueprint /Game/ThirdPersonBP/Controllers/RunCharacterController.RunCharacterController
[2021.02.05-02.54.17:423][ 26]LogContentBrowser: Native class hierarchy updated for 'BlueprintGraph' in 0.0004 seconds. Added 125 classes and 0 folders.
[2021.02.05-02.54.25:927][ 26]LogAssetEditorSubsystem: Opening Asset editor for Blueprint /Game/ThirdPersonBP/Actors/RunCharacter.RunCharacter
[2021.02.05-02.54.27:107][ 26]LogSlate: Took 0.017190 seconds to synchronously load lazily loaded font '../../../Engine/Content/Slate/Fonts/Roboto-BoldCondensed.ttf' (158K)
[2021.02.05-02.54.27:576][ 27]LogSlate: Took 0.011897 seconds to synchronously load lazily loaded font '../../../Engine/Content/Slate/Fonts/Roboto-Italic.ttf' (157K)
[2021.02.05-02.54.49:384][463]LogSlate: Took 0.007785 seconds to synchronously load lazily loaded font '../../../Engine/Content/Slate/Fonts/Roboto-BoldCondensedItalic.ttf' (160K)
[2021.02.05-02.56.46:865][437]BlueprintLog: New page: Compile RunCharacter
[2021.02.05-02.56.46:958][437]LogUObjectHash: Compacting FUObjectHashTables data took   1.67ms
[2021.02.05-02.56.47:061][437]LogSlate: Took 0.043595 seconds to synchronously load lazily loaded font '../../../Engine/Content/Slate/Fonts/DroidSansMono.ttf' (77K)
[2021.02.05-02.56.47:371][464]Cmd: OBJ SAVEPACKAGE PACKAGE="/Game/ThirdPersonBP/Actors/RunCharacter" FILE="../../../../../GAMPRG Repository/P1_Endless_Runner/Content/ThirdPersonBP/Actors/RunCharacter.uasset" SILENT=true
[2021.02.05-02.56.47:599][464]LogSavePackage: Moving '../../../../../GAMPRG Repository/P1_Endless_Runner/Saved/RunCharacter83A5585C40093C51BF9360A4A6884588.tmp' to '../../../../../GAMPRG Repository/P1_Endless_Runner/Content/ThirdPersonBP/Actors/RunCharacter.uasset'
[2021.02.05-02.56.47:621][464]AssetCheck: New page: Asset Save: RunCharacter
[2021.02.05-02.56.47:622][464]LogContentValidation: Display: Validating Blueprint /Game/ThirdPersonBP/Actors/RunCharacter.RunCharacter
[2021.02.05-02.58.20:355][529]BlueprintLog: New page: Compile RunCharacter
[2021.02.05-02.58.20:407][529]LogUObjectHash: Compacting FUObjectHashTables data took   1.67ms
[2021.02.05-02.58.20:794][565]Cmd: OBJ SAVEPACKAGE PACKAGE="/Game/ThirdPersonBP/Actors/RunCharacter" FILE="../../../../../GAMPRG Repository/P1_Endless_Runner/Content/ThirdPersonBP/Actors/RunCharacter.uasset" SILENT=true
[2021.02.05-02.58.20:818][565]LogSavePackage: Moving '../../../../../GAMPRG Repository/P1_Endless_Runner/Saved/RunCharacter538145E84FD22A6D862BC08B15314FF0.tmp' to '../../../../../GAMPRG Repository/P1_Endless_Runner/Content/ThirdPersonBP/Actors/RunCharacter.uasset'
[2021.02.05-02.58.20:825][565]AssetCheck: New page: Asset Save: RunCharacter
[2021.02.05-02.58.20:825][565]LogContentValidation: Display: Validating Blueprint /Game/ThirdPersonBP/Actors/RunCharacter.RunCharacter
[2021.02.05-02.58.31:948][885]Cmd: OBJ SAVEPACKAGE PACKAGE="/Game/ThirdPersonBP/Actors/RunCharacter" FILE="../../../../../GAMPRG Repository/P1_Endless_Runner/Content/ThirdPersonBP/Actors/RunCharacter.uasset" SILENT=true
[2021.02.05-02.58.31:960][885]LogSavePackage: Moving '../../../../../GAMPRG Repository/P1_Endless_Runner/Saved/RunCharacter8033039540F9E020C5CCD68186792D13.tmp' to '../../../../../GAMPRG Repository/P1_Endless_Runner/Content/ThirdPersonBP/Actors/RunCharacter.uasset'
[2021.02.05-02.58.31:967][885]AssetCheck: New page: Asset Save: RunCharacter
[2021.02.05-02.58.31:967][885]LogContentValidation: Display: Validating Blueprint /Game/ThirdPersonBP/Actors/RunCharacter.RunCharacter
[2021.02.05-03.00.16:341][274]LogEditorTransaction: Undo Move Node
[2021.02.05-03.00.16:628][285]LogEditorTransaction: Undo Move Node
[2021.02.05-03.00.17:536][383]LogEditorTransaction: Undo Move Node
[2021.02.05-03.00.17:975][434]LogEditorTransaction: Undo Create Pin Link
[2021.02.05-03.00.18:405][482]LogEditorTransaction: Undo Move Node
[2021.02.05-03.00.18:785][525]LogEditorTransaction: Undo Delete current selection
[2021.02.05-03.00.22:721][993]BlueprintLog: New page: Compile RunCharacterController
[2021.02.05-03.00.22:749][993]LogBlueprint: Error: [Compiler RunCharacterController] This blueprint (self) is not a RunCharacter_C, therefore ' Target ' must have a connection.
[2021.02.05-03.00.22:749][993]LogBlueprint: Error: [Compiler RunCharacterController] This blueprint (self) is not a RunCharacter_C, therefore ' Target ' must have a connection.
[2021.02.05-03.00.22:825][993]LogUObjectHash: Compacting FUObjectHashTables data took   1.69ms
[2021.02.05-03.00.36:967][676]BlueprintLog: New page: Compile RunCharacterController
[2021.02.05-03.00.36:996][676]LogUObjectHash: Compacting FUObjectHashTables data took   1.54ms
[2021.02.05-03.00.37:856][768]LogSavePackage: Moving '../../../../../GAMPRG Repository/P1_Endless_Runner/Saved/RunCharacterController62D7DCFC464E1B1873715BBAA1FBBF18.tmp' to '../../../../../GAMPRG Repository/P1_Endless_Runner/Content/ThirdPersonBP/Controllers/RunCharacterController.uasset'
[2021.02.05-03.00.37:870][768]AssetCheck: New page: Asset Save: RunCharacterController
[2021.02.05-03.00.37:870][768]LogContentValidation: Display: Validating Blueprint /Game/ThirdPersonBP/Controllers/RunCharacterController.RunCharacterController
[2021.02.05-03.00.49:272][963]BlueprintLog: New page: Compile RunCharacter
[2021.02.05-03.00.49:312][963]LogUObjectHash: Compacting FUObjectHashTables data took   2.41ms
[2021.02.05-03.00.50:534][101]LogTemp: Repeating last play command: Selected Viewport
[2021.02.05-03.00.50:677][101]LogPlayLevel: PlayLevel: No blueprints needed recompiling
[2021.02.05-03.00.50:736][101]PIE: New page: PIE session: Default (5 Feb 2021, 7:00:50 pm)
[2021.02.05-03.00.50:822][101]LogOnline: OSS: Creating online subsystem instance for: NULL
[2021.02.05-03.00.50:823][101]LogOnline: OSS: TryLoadSubsystemAndSetDefault: Loaded subsystem for module [NULL]
[2021.02.05-03.00.50:847][101]LogPlayLevel: Creating play world package: /Game/ThirdPersonBP/Levels/UEDPIE_0_Default
[2021.02.05-03.00.50:863][101]LogPlayLevel: PIE: StaticDuplicateObject took: (0.015308s)
[2021.02.05-03.00.50:876][101]LogAIModule: Creating AISystem for world Default
[2021.02.05-03.00.50:876][101]LogAISub: UAISubsystem::UAISubsystem EnvQueryManager (0000025D8D5C4A00), frame # 34101
[2021.02.05-03.00.50:876][101]LogAISub: UAISubsystem::UAISubsystem AIPerceptionSystem (0000025D957DAFC0), frame # 34101
[2021.02.05-03.00.50:876][101]LogPlayLevel: PIE: World Init took: (0.013441s)
[2021.02.05-03.00.50:877][101]LogPlayLevel: PIE: Created PIE world by copying editor world from /Game/ThirdPersonBP/Levels/Default.Default to /Game/ThirdPersonBP/Levels/UEDPIE_0_Default.Default (0.029399s)
[2021.02.05-03.00.50:898][101]LogUObjectHash: Compacting FUObjectHashTables data took   1.55ms
[2021.02.05-03.00.50:900][101]LogAudioMixer: Display: Audio Mixer Platform Settings:
[2021.02.05-03.00.50:900][101]LogAudioMixer: Display: 	Sample Rate:						  48000
[2021.02.05-03.00.50:900][101]LogAudioMixer: Display: 	Callback Buffer Frame Size Requested: 1024
[2021.02.05-03.00.50:900][101]LogAudioMixer: Display: 	Callback Buffer Frame Size To Use:	  1024
[2021.02.05-03.00.50:900][101]LogAudioMixer: Display: 	Number of buffers to queue:			  2
[2021.02.05-03.00.50:900][101]LogAudioMixer: Display: 	Max Channels (voices):				  32
[2021.02.05-03.00.50:900][101]LogAudioMixer: Display: 	Number of Async Source Workers:		  0
[2021.02.05-03.00.50:900][101]LogAudio: Display: AudioDevice MaxSources: 32
[2021.02.05-03.00.50:901][101]LogAudio: Display: Using built-in audio occlusion.
[2021.02.05-03.00.50:901][101]LogAudioMixer: Display: Initializing audio mixer.
[2021.02.05-03.00.50:941][101]LogAudioMixer: Display: 0: FrontLeft
[2021.02.05-03.00.50:941][101]LogAudioMixer: Display: 1: FrontRight
[2021.02.05-03.00.50:953][101]LogAudioMixer: Display: Using Audio Device VoiceMeeter Input (VB-Audio VoiceMeeter VAIO)
[2021.02.05-03.00.50:953][101]LogAudioMixer: Display: Initializing Sound Submixes...
[2021.02.05-03.00.50:953][101]LogAudioMixer: Display: Creating Master Submix 'MasterSubmixDefault'
[2021.02.05-03.00.50:953][101]LogAudioMixer: Display: Creating Master Submix 'MasterReverbSubmixDefault'
[2021.02.05-03.00.50:953][101]LogAudioMixer: Display: Creating Master Submix 'MasterEQSubmixDefault'
[2021.02.05-03.00.50:965][101]LogInit: FAudioDevice initialized.
[2021.02.05-03.00.51:002][101]LogSlate: Updating window title bar state: overlay mode, drag disabled, window buttons hidden, title bar hidden
[2021.02.05-03.00.51:049][101]LogLoad: Game class is 'RunGameMode_C'
[2021.02.05-03.00.51:269][101]LogWorld: Bringing World /Game/ThirdPersonBP/Levels/UEDPIE_0_Default.Default up for play (max tick rate 0) at 2021.02.05-11.00.51
[2021.02.05-03.00.51:274][101]LogWorld: Bringing up level for play took: 0.005006
[2021.02.05-03.00.51:281][101]LogOnline: OSS: Creating online subsystem instance for: :Context_4
[2021.02.05-03.00.51:454][101]LogContentBrowser: Native class hierarchy updated for 'MovieSceneCapture' in 0.0003 seconds. Added 20 classes and 0 folders.
[2021.02.05-03.00.51:582][101]PIE: Server logged in
[2021.02.05-03.00.51:583][101]PIE: Play in editor total start time 1.028 seconds.
[2021.02.05-03.00.51:823][102]LogRenderer: Reallocating scene render targets to support 1280x720 Format 10 NumSamples 1 (Frame:1).
[2021.02.05-03.00.56:840][651]LogSlate: Updating window title bar state: overlay mode, drag disabled, window buttons hidden, title bar hidden
[2021.02.05-03.00.56:840][651]LogWorld: BeginTearingDown for /Game/ThirdPersonBP/Levels/UEDPIE_0_Default
[2021.02.05-03.00.56:859][651]LogSlate: Window 'P1_Endless_Runner Preview [NetMode: Standalone] (64-bit/Windows) ' being destroyed
[2021.02.05-03.00.56:888][651]LogWorld: UWorld::CleanupWorld for Default, bSessionEnded=true, bCleanupResources=true
[2021.02.05-03.00.56:888][651]LogSlate: InvalidateAllWidgets triggered.  All widgets were invalidated
[2021.02.05-03.00.56:912][651]LogPlayLevel: Display: Shutting down PIE online subsystems
[2021.02.05-03.00.56:918][651]LogSlate: InvalidateAllWidgets triggered.  All widgets were invalidated
[2021.02.05-03.00.57:196][651]LogAISub: UAISubsystem::~UAISubsystem AIPerceptionSystem (0000025D957DAFC0), frame # 34651
[2021.02.05-03.00.57:197][651]LogAISub: UAISubsystem::~UAISubsystem EnvQueryManager (0000025D8D5C4A00), frame # 34651
[2021.02.05-03.00.57:227][651]LogUObjectHash: Compacting FUObjectHashTables data took   2.39ms
[2021.02.05-03.00.57:251][652]LogPlayLevel: Display: Destroying online subsystem :Context_4
[2021.02.05-03.01.29:404][929]Cmd: OBJ SAVEPACKAGE PACKAGE="/Game/ThirdPersonBP/Actors/RunCharacter" FILE="../../../../../GAMPRG Repository/P1_Endless_Runner/Content/ThirdPersonBP/Actors/RunCharacter.uasset" SILENT=true
[2021.02.05-03.01.29:419][929]LogSavePackage: Moving '../../../../../GAMPRG Repository/P1_Endless_Runner/Saved/RunCharacter8C498DB647914C35F4E65699257C174D.tmp' to '../../../../../GAMPRG Repository/P1_Endless_Runner/Content/ThirdPersonBP/Actors/RunCharacter.uasset'
[2021.02.05-03.01.29:427][929]AssetCheck: New page: Asset Save: RunCharacter
[2021.02.05-03.01.29:427][929]LogContentValidation: Display: Validating Blueprint /Game/ThirdPersonBP/Actors/RunCharacter.RunCharacter
[2021.02.05-03.01.30:009][999]BlueprintLog: New page: Compile RunCharacter
[2021.02.05-03.01.30:101][999]LogUObjectHash: Compacting FUObjectHashTables data took   2.26ms
[2021.02.05-03.01.30:515][ 42]Cmd: OBJ SAVEPACKAGE PACKAGE="/Game/ThirdPersonBP/Actors/RunCharacter" FILE="../../../../../GAMPRG Repository/P1_Endless_Runner/Content/ThirdPersonBP/Actors/RunCharacter.uasset" SILENT=true
[2021.02.05-03.01.30:530][ 42]LogSavePackage: Moving '../../../../../GAMPRG Repository/P1_Endless_Runner/Saved/RunCharacter31A4C49D46C22025D16311A80D777715.tmp' to '../../../../../GAMPRG Repository/P1_Endless_Runner/Content/ThirdPersonBP/Actors/RunCharacter.uasset'
[2021.02.05-03.01.30:537][ 42]AssetCheck: New page: Asset Save: RunCharacter
[2021.02.05-03.01.30:537][ 42]LogContentValidation: Display: Validating Blueprint /Game/ThirdPersonBP/Actors/RunCharacter.RunCharacter
[2021.02.05-03.01.34:673][220]LogTemp: Repeating last play command: Selected Viewport
[2021.02.05-03.01.34:680][220]LogPlayLevel: PlayLevel: No blueprints needed recompiling
[2021.02.05-03.01.34:680][220]PIE: New page: PIE session: Default (5 Feb 2021, 7:01:34 pm)
[2021.02.05-03.01.34:680][220]LogPlayLevel: Creating play world package: /Game/ThirdPersonBP/Levels/UEDPIE_0_Default
[2021.02.05-03.01.34:682][220]LogPlayLevel: PIE: StaticDuplicateObject took: (0.001722s)
[2021.02.05-03.01.34:683][220]LogAIModule: Creating AISystem for world Default
[2021.02.05-03.01.34:683][220]LogAISub: UAISubsystem::UAISubsystem EnvQueryManager (0000025D7560D200), frame # 37220
[2021.02.05-03.01.34:683][220]LogAISub: UAISubsystem::UAISubsystem AIPerceptionSystem (0000025D102C0CC0), frame # 37220
[2021.02.05-03.01.34:683][220]LogPlayLevel: PIE: World Init took: (0.000933s)
[2021.02.05-03.01.34:683][220]LogPlayLevel: PIE: Created PIE world by copying editor world from /Game/ThirdPersonBP/Levels/Default.Default to /Game/ThirdPersonBP/Levels/UEDPIE_0_Default.Default (0.002730s)
[2021.02.05-03.01.34:706][220]LogUObjectHash: Compacting FUObjectHashTables data took   2.24ms
[2021.02.05-03.01.34:706][220]LogAudioMixer: Display: Audio Mixer Platform Settings:
[2021.02.05-03.01.34:706][220]LogAudioMixer: Display: 	Sample Rate:						  48000
[2021.02.05-03.01.34:706][220]LogAudioMixer: Display: 	Callback Buffer Frame Size Requested: 1024
[2021.02.05-03.01.34:706][220]LogAudioMixer: Display: 	Callback Buffer Frame Size To Use:	  1024
[2021.02.05-03.01.34:706][220]LogAudioMixer: Display: 	Number of buffers to queue:			  2
[2021.02.05-03.01.34:706][220]LogAudioMixer: Display: 	Max Channels (voices):				  32
[2021.02.05-03.01.34:706][220]LogAudioMixer: Display: 	Number of Async Source Workers:		  0
[2021.02.05-03.01.34:706][220]LogAudio: Display: AudioDevice MaxSources: 32
[2021.02.05-03.01.34:707][220]LogAudio: Display: Using built-in audio occlusion.
[2021.02.05-03.01.34:707][220]LogAudioMixer: Display: Initializing audio mixer.
[2021.02.05-03.01.34:709][220]LogAudioMixer: Display: 0: FrontLeft
[2021.02.05-03.01.34:709][220]LogAudioMixer: Display: 1: FrontRight
[2021.02.05-03.01.34:719][220]LogAudioMixer: Display: Using Audio Device VoiceMeeter Input (VB-Audio VoiceMeeter VAIO)
[2021.02.05-03.01.34:719][220]LogAudioMixer: Display: Initializing Sound Submixes...
[2021.02.05-03.01.34:719][220]LogAudioMixer: Display: Creating Master Submix 'MasterSubmixDefault'
[2021.02.05-03.01.34:719][220]LogAudioMixer: Display: Creating Master Submix 'MasterReverbSubmixDefault'
[2021.02.05-03.01.34:719][220]LogAudioMixer: Display: Creating Master Submix 'MasterEQSubmixDefault'
[2021.02.05-03.01.34:730][220]LogInit: FAudioDevice initialized.
[2021.02.05-03.01.34:755][220]LogSlate: Updating window title bar state: overlay mode, drag disabled, window buttons hidden, title bar hidden
[2021.02.05-03.01.34:756][220]LogLoad: Game class is 'RunGameMode_C'
[2021.02.05-03.01.34:756][220]LogWorld: Bringing World /Game/ThirdPersonBP/Levels/UEDPIE_0_Default.Default up for play (max tick rate 0) at 2021.02.05-11.01.34
[2021.02.05-03.01.34:756][220]LogWorld: Bringing up level for play took: 0.000457
[2021.02.05-03.01.34:756][220]LogOnline: OSS: Creating online subsystem instance for: :Context_5
[2021.02.05-03.01.34:760][220]PIE: Server logged in
[2021.02.05-03.01.34:761][220]PIE: Play in editor total start time 0.081 seconds.
[2021.02.05-03.01.38:562][663]LogSlate: Updating window title bar state: overlay mode, drag disabled, window buttons hidden, title bar hidden
[2021.02.05-03.01.38:562][663]LogWorld: BeginTearingDown for /Game/ThirdPersonBP/Levels/UEDPIE_0_Default
[2021.02.05-03.01.38:562][663]LogSlate: Window 'P1_Endless_Runner Preview [NetMode: Standalone] (64-bit/Windows) ' being destroyed
[2021.02.05-03.01.38:565][663]LogWorld: UWorld::CleanupWorld for Default, bSessionEnded=true, bCleanupResources=true
[2021.02.05-03.01.38:565][663]LogSlate: InvalidateAllWidgets triggered.  All widgets were invalidated
[2021.02.05-03.01.38:574][663]LogPlayLevel: Display: Shutting down PIE online subsystems
[2021.02.05-03.01.38:577][663]LogSlate: InvalidateAllWidgets triggered.  All widgets were invalidated
[2021.02.05-03.01.38:611][663]LogAISub: UAISubsystem::~UAISubsystem AIPerceptionSystem (0000025D102C0CC0), frame # 37663
[2021.02.05-03.01.38:611][663]LogAISub: UAISubsystem::~UAISubsystem EnvQueryManager (0000025D7560D200), frame # 37663
[2021.02.05-03.01.38:631][663]LogUObjectHash: Compacting FUObjectHashTables data took   1.73ms
[2021.02.05-03.01.38:646][664]LogPlayLevel: Display: Destroying online subsystem :Context_5
[2021.02.05-03.01.53:848][448]BlueprintLog: New page: Compile RunCharacterController
[2021.02.05-03.01.53:882][448]LogUObjectHash: Compacting FUObjectHashTables data took   1.96ms
[2021.02.05-03.01.54:307][495]LogSavePackage: Moving '../../../../../GAMPRG Repository/P1_Endless_Runner/Saved/RunCharacterControllerA213BE58493B8AAB1827258B1FA504AE.tmp' to '../../../../../GAMPRG Repository/P1_Endless_Runner/Content/ThirdPersonBP/Controllers/RunCharacterController.uasset'
[2021.02.05-03.01.54:315][495]AssetCheck: New page: Asset Save: RunCharacterController
[2021.02.05-03.01.54:315][495]LogContentValidation: Display: Validating Blueprint /Game/ThirdPersonBP/Controllers/RunCharacterController.RunCharacterController
[2021.02.05-03.01.56:505][747]LogTemp: Repeating last play command: Selected Viewport
[2021.02.05-03.01.56:512][747]LogPlayLevel: PlayLevel: No blueprints needed recompiling
[2021.02.05-03.01.56:512][747]PIE: New page: PIE session: Default (5 Feb 2021, 7:01:56 pm)
[2021.02.05-03.01.56:513][747]LogPlayLevel: Creating play world package: /Game/ThirdPersonBP/Levels/UEDPIE_0_Default
[2021.02.05-03.01.56:514][747]LogPlayLevel: PIE: StaticDuplicateObject took: (0.001426s)
[2021.02.05-03.01.56:515][747]LogAIModule: Creating AISystem for world Default
[2021.02.05-03.01.56:515][747]LogAISub: UAISubsystem::UAISubsystem EnvQueryManager (0000025D895BE000), frame # 39747
[2021.02.05-03.01.56:515][747]LogAISub: UAISubsystem::UAISubsystem AIPerceptionSystem (0000025D9B779940), frame # 39747
[2021.02.05-03.01.56:515][747]LogPlayLevel: PIE: World Init took: (0.000906s)
[2021.02.05-03.01.56:515][747]LogPlayLevel: PIE: Created PIE world by copying editor world from /Game/ThirdPersonBP/Levels/Default.Default to /Game/ThirdPersonBP/Levels/UEDPIE_0_Default.Default (0.002405s)
[2021.02.05-03.01.56:538][747]LogUObjectHash: Compacting FUObjectHashTables data took   2.12ms
[2021.02.05-03.01.56:539][747]LogAudioMixer: Display: Audio Mixer Platform Settings:
[2021.02.05-03.01.56:539][747]LogAudioMixer: Display: 	Sample Rate:						  48000
[2021.02.05-03.01.56:539][747]LogAudioMixer: Display: 	Callback Buffer Frame Size Requested: 1024
[2021.02.05-03.01.56:539][747]LogAudioMixer: Display: 	Callback Buffer Frame Size To Use:	  1024
[2021.02.05-03.01.56:539][747]LogAudioMixer: Display: 	Number of buffers to queue:			  2
[2021.02.05-03.01.56:539][747]LogAudioMixer: Display: 	Max Channels (voices):				  32
[2021.02.05-03.01.56:539][747]LogAudioMixer: Display: 	Number of Async Source Workers:		  0
[2021.02.05-03.01.56:539][747]LogAudio: Display: AudioDevice MaxSources: 32
[2021.02.05-03.01.56:539][747]LogAudio: Display: Using built-in audio occlusion.
[2021.02.05-03.01.56:539][747]LogAudioMixer: Display: Initializing audio mixer.
[2021.02.05-03.01.56:542][747]LogAudioMixer: Display: 0: FrontLeft
[2021.02.05-03.01.56:542][747]LogAudioMixer: Display: 1: FrontRight
[2021.02.05-03.01.56:551][747]LogAudioMixer: Display: Using Audio Device VoiceMeeter Input (VB-Audio VoiceMeeter VAIO)
[2021.02.05-03.01.56:551][747]LogAudioMixer: Display: Initializing Sound Submixes...
[2021.02.05-03.01.56:551][747]LogAudioMixer: Display: Creating Master Submix 'MasterSubmixDefault'
[2021.02.05-03.01.56:551][747]LogAudioMixer: Display: Creating Master Submix 'MasterReverbSubmixDefault'
[2021.02.05-03.01.56:551][747]LogAudioMixer: Display: Creating Master Submix 'MasterEQSubmixDefault'
[2021.02.05-03.01.56:562][747]LogInit: FAudioDevice initialized.
[2021.02.05-03.01.56:577][747]LogSlate: Updating window title bar state: overlay mode, drag disabled, window buttons hidden, title bar hidden
[2021.02.05-03.01.56:577][747]LogLoad: Game class is 'RunGameMode_C'
[2021.02.05-03.01.56:578][747]LogWorld: Bringing World /Game/ThirdPersonBP/Levels/UEDPIE_0_Default.Default up for play (max tick rate 0) at 2021.02.05-11.01.56
[2021.02.05-03.01.56:578][747]LogWorld: Bringing up level for play took: 0.000478
[2021.02.05-03.01.56:578][747]LogOnline: OSS: Creating online subsystem instance for: :Context_6
[2021.02.05-03.01.56:582][747]PIE: Server logged in
[2021.02.05-03.01.56:583][747]PIE: Play in editor total start time 0.07 seconds.
[2021.02.05-03.02.01:681][354]LogSlate: Updating window title bar state: overlay mode, drag disabled, window buttons hidden, title bar hidden
[2021.02.05-03.02.01:682][354]LogWorld: BeginTearingDown for /Game/ThirdPersonBP/Levels/UEDPIE_0_Default
[2021.02.05-03.02.01:682][354]LogSlate: Window 'P1_Endless_Runner Preview [NetMode: Standalone] (64-bit/Windows) ' being destroyed
[2021.02.05-03.02.01:685][354]LogWorld: UWorld::CleanupWorld for Default, bSessionEnded=true, bCleanupResources=true
[2021.02.05-03.02.01:685][354]LogSlate: InvalidateAllWidgets triggered.  All widgets were invalidated
[2021.02.05-03.02.01:690][354]LogPlayLevel: Display: Shutting down PIE online subsystems
[2021.02.05-03.02.01:693][354]LogSlate: InvalidateAllWidgets triggered.  All widgets were invalidated
[2021.02.05-03.02.01:727][354]LogAISub: UAISubsystem::~UAISubsystem EnvQueryManager (0000025D895BE000), frame # 40354
[2021.02.05-03.02.01:727][354]LogAISub: UAISubsystem::~UAISubsystem AIPerceptionSystem (0000025D9B779940), frame # 40354
[2021.02.05-03.02.01:729][354]LogUObjectHash: Compacting FUObjectHashTables data took   1.73ms
[2021.02.05-03.02.01:762][357]LogPlayLevel: Display: Destroying online subsystem :Context_6
[2021.02.05-03.02.05:475][797]BlueprintLog: New page: Compile RunCharacter
[2021.02.05-03.02.05:517][797]LogUObjectHash: Compacting FUObjectHashTables data took   1.87ms
[2021.02.05-03.02.05:879][833]Cmd: OBJ SAVEPACKAGE PACKAGE="/Game/ThirdPersonBP/Actors/RunCharacter" FILE="../../../../../GAMPRG Repository/P1_Endless_Runner/Content/ThirdPersonBP/Actors/RunCharacter.uasset" SILENT=true
[2021.02.05-03.02.05:908][833]LogSavePackage: Moving '../../../../../GAMPRG Repository/P1_Endless_Runner/Saved/RunCharacter6818B06B428DAAC6DF71E0A085E39A09.tmp' to '../../../../../GAMPRG Repository/P1_Endless_Runner/Content/ThirdPersonBP/Actors/RunCharacter.uasset'
[2021.02.05-03.02.05:916][833]AssetCheck: New page: Asset Save: RunCharacter
[2021.02.05-03.02.05:916][833]LogContentValidation: Display: Validating Blueprint /Game/ThirdPersonBP/Actors/RunCharacter.RunCharacter
[2021.02.05-03.02.06:545][907]LogTemp: Repeating last play command: Selected Viewport
[2021.02.05-03.02.06:553][907]LogPlayLevel: PlayLevel: No blueprints needed recompiling
[2021.02.05-03.02.06:553][907]PIE: New page: PIE session: Default (5 Feb 2021, 7:02:06 pm)
[2021.02.05-03.02.06:553][907]LogPlayLevel: Creating play world package: /Game/ThirdPersonBP/Levels/UEDPIE_0_Default
[2021.02.05-03.02.06:554][907]LogPlayLevel: PIE: StaticDuplicateObject took: (0.001426s)
[2021.02.05-03.02.06:555][907]LogAIModule: Creating AISystem for world Default
[2021.02.05-03.02.06:555][907]LogAISub: UAISubsystem::UAISubsystem EnvQueryManager (0000025D0F53A800), frame # 40907
[2021.02.05-03.02.06:555][907]LogAISub: UAISubsystem::UAISubsystem AIPerceptionSystem (0000025D9B529440), frame # 40907
[2021.02.05-03.02.06:555][907]LogPlayLevel: PIE: World Init took: (0.001080s)
[2021.02.05-03.02.06:555][907]LogPlayLevel: PIE: Created PIE world by copying editor world from /Game/ThirdPersonBP/Levels/Default.Default to /Game/ThirdPersonBP/Levels/UEDPIE_0_Default.Default (0.002583s)
[2021.02.05-03.02.06:579][907]LogUObjectHash: Compacting FUObjectHashTables data took   2.42ms
[2021.02.05-03.02.06:579][907]LogAudioMixer: Display: Audio Mixer Platform Settings:
[2021.02.05-03.02.06:579][907]LogAudioMixer: Display: 	Sample Rate:						  48000
[2021.02.05-03.02.06:579][907]LogAudioMixer: Display: 	Callback Buffer Frame Size Requested: 1024
[2021.02.05-03.02.06:579][907]LogAudioMixer: Display: 	Callback Buffer Frame Size To Use:	  1024
[2021.02.05-03.02.06:579][907]LogAudioMixer: Display: 	Number of buffers to queue:			  2
[2021.02.05-03.02.06:579][907]LogAudioMixer: Display: 	Max Channels (voices):				  32
[2021.02.05-03.02.06:579][907]LogAudioMixer: Display: 	Number of Async Source Workers:		  0
[2021.02.05-03.02.06:579][907]LogAudio: Display: AudioDevice MaxSources: 32
[2021.02.05-03.02.06:580][907]LogAudio: Display: Using built-in audio occlusion.
[2021.02.05-03.02.06:580][907]LogAudioMixer: Display: Initializing audio mixer.
[2021.02.05-03.02.06:582][907]LogAudioMixer: Display: 0: FrontLeft
[2021.02.05-03.02.06:582][907]LogAudioMixer: Display: 1: FrontRight
[2021.02.05-03.02.06:592][907]LogAudioMixer: Display: Using Audio Device VoiceMeeter Input (VB-Audio VoiceMeeter VAIO)
[2021.02.05-03.02.06:592][907]LogAudioMixer: Display: Initializing Sound Submixes...
[2021.02.05-03.02.06:592][907]LogAudioMixer: Display: Creating Master Submix 'MasterSubmixDefault'
[2021.02.05-03.02.06:592][907]LogAudioMixer: Display: Creating Master Submix 'MasterReverbSubmixDefault'
[2021.02.05-03.02.06:592][907]LogAudioMixer: Display: Creating Master Submix 'MasterEQSubmixDefault'
[2021.02.05-03.02.06:603][907]LogInit: FAudioDevice initialized.
[2021.02.05-03.02.06:620][907]LogSlate: Updating window title bar state: overlay mode, drag disabled, window buttons hidden, title bar hidden
[2021.02.05-03.02.06:620][907]LogLoad: Game class is 'RunGameMode_C'
[2021.02.05-03.02.06:621][907]LogWorld: Bringing World /Game/ThirdPersonBP/Levels/UEDPIE_0_Default.Default up for play (max tick rate 0) at 2021.02.05-11.02.06
[2021.02.05-03.02.06:621][907]LogWorld: Bringing up level for play took: 0.000484
[2021.02.05-03.02.06:621][907]LogOnline: OSS: Creating online subsystem instance for: :Context_7
[2021.02.05-03.02.06:643][907]PIE: Server logged in
[2021.02.05-03.02.06:643][907]PIE: Play in editor total start time 0.091 seconds.
[2021.02.05-03.02.06:718][909]LogRHI: Error: Present Fail Count 1
[2021.02.05-03.02.06:718][909]LogRHI: Error: SyncInterval 0
[2021.02.05-03.02.06:718][909]LogRHI: Error: SwapChainDesc.BufferDesc.Width 1290
[2021.02.05-03.02.06:718][909]LogRHI: Error: SwapChainDesc.BufferDesc.Height 754
[2021.02.05-03.02.06:718][909]LogRHI: Error: SwapChainDesc.BufferDesc.RefreshRate.Numerator 0
[2021.02.05-03.02.06:718][909]LogRHI: Error: SwapChainDesc.BufferDesc.RefreshRate.Denominator 0
[2021.02.05-03.02.06:718][909]LogRHI: Error: SwapChainDesc.BufferDesc.Format 24
[2021.02.05-03.02.06:718][909]LogRHI: Error: SwapChainDesc.BufferDesc.ScanlineOrdering 0
[2021.02.05-03.02.06:718][909]LogRHI: Error: SwapChainDesc.BufferDesc.Scaling 0
[2021.02.05-03.02.06:718][909]LogRHI: Error: SwapChainDesc.SampleDesc.Count 1
[2021.02.05-03.02.06:718][909]LogRHI: Error: SwapChainDesc.SampleDesc.Quality 0
[2021.02.05-03.02.06:718][909]LogRHI: Error: SwapChainDesc.BufferUsage 48
[2021.02.05-03.02.06:718][909]LogRHI: Error: SwapChainDesc.BufferCount 2
[2021.02.05-03.02.06:718][909]LogRHI: Error: SwapChainDesc.OutputWindow 00000000002F0A7C
[2021.02.05-03.02.06:718][909]LogRHI: Error: SwapChainDesc.Windowed true
[2021.02.05-03.02.06:718][909]LogRHI: Error: SwapChainDesc.SwapEffect 4
[2021.02.05-03.02.06:718][909]LogRHI: Error: SwapChainDesc.Flags 2050
[2021.02.05-03.02.06:793][909]LogD3D11RHI: Error: Result failed 
 at D:/Build/++UE4/Sync/Engine/Source/Runtime/Windows/D3D11RHI/Private/D3D11Query.cpp:348 
 with error DXGI_ERROR_DEVICE_REMOVED DXGI_ERROR_DRIVER_INTERNAL_ERROR
[2021.02.05-03.02.06:793][909]LogD3D11RHI: [Aftermath] GDynamicRHI=0000025D335D00C0, GDX11NVAfterMathEnabled=0, Result=0xFFFFFFFF, bDeviceActive=0
[2021.02.05-03.02.06:793][909]LogWindows: Windows GetLastError: The operation completed successfully. (0)
