{
  "id": "anarchy-earthdawn",
  "name": "anarchy-earthdawn",
  "title": "Shadowrun Anarchy Hack -- Earthdawn",
  "description": "Hack to play Earthdawn with Shadowrun Anarchy system",
  "version": "12.0.0",
  "manifest": "https://gitlab.com/vincent.vandeme/anarchy-earthdawn/-/raw/master/module.json",
  "download": "https://gitlab.com/vincent.vandeme/anarchy-earthdawn/-/archive/master/anarchy-earthdawn-master.zip",
  "esmodules": ["module/start.js"],
  "styles": ["styles/earthdawn.css"],
  "languages": [
    {
      "lang": "fr",
      "name": "Français",
      "path": "lang/fr.json",
      "flags": {}
    }
  ],
  "authors": [
    {
      "name": "Vincent VK",
      "flags": {}
    },
    {
      "name": "Pretre",
      "flags": {}
    }
  ],
  "relationships": {
    "systems": [
      {
        "id": "anarchy",
        "type": "system",
        "compatibility": {
          "verified": "12.2.4"
        }
      }
    ]
  },
  "compatibility": {
    "minimum": "11",
    "verified": "12"
  }
}