(kicad_pcb (version 20171130) (host pcbnew "(5.0.2)-1")

  (general
    (thickness 1.6)
    (drawings 12)
    (tracks 86)
    (zones 0)
    (modules 12)
    (nets 34)
  )

  (page A4)
  (layers
    (0 F.Cu signal)
    (31 B.Cu signal)
    (32 B.Adhes user)
    (33 F.Adhes user)
    (34 B.Paste user)
    (35 F.Paste user)
    (36 B.SilkS user)
    (37 F.SilkS user)
    (38 B.Mask user)
    (39 F.Mask user)
    (40 Dwgs.User user)
    (41 Cmts.User user)
    (42 Eco1.User user)
    (43 Eco2.User user)
    (44 Edge.Cuts user)
    (45 Margin user)
    (46 B.CrtYd user)
    (47 F.CrtYd user)
    (48 B.Fab user)
    (49 F.Fab user)
  )

  (setup
    (last_trace_width 1.7)
    (user_trace_width 1.6)
    (user_trace_width 1.7)
    (trace_clearance 0.4)
    (zone_clearance 0.508)
    (zone_45_only no)
    (trace_min 0.2)
    (segment_width 0.2)
    (edge_width 0.15)
    (via_size 0.8)
    (via_drill 0.4)
    (via_min_size 0.4)
    (via_min_drill 0.3)
    (uvia_size 0.3)
    (uvia_drill 0.1)
    (uvias_allowed no)
    (uvia_min_size 0.2)
    (uvia_min_drill 0.1)
    (pcb_text_width 0.3)
    (pcb_text_size 1.5 1.5)
    (mod_edge_width 0.15)
    (mod_text_size 1 1)
    (mod_text_width 0.15)
    (pad_size 1.524 1.524)
    (pad_drill 0.762)
    (pad_to_mask_clearance 0.051)
    (solder_mask_min_width 0.25)
    (aux_axis_origin 0 0)
    (visible_elements 7FFFFFFF)
    (pcbplotparams
      (layerselection 0x01000_7fffffff)
      (usegerberextensions false)
      (usegerberattributes false)
      (usegerberadvancedattributes false)
      (creategerberjobfile false)
      (excludeedgelayer true)
      (linewidth 0.100000)
      (plotframeref false)
      (viasonmask false)
      (mode 1)
      (useauxorigin false)
      (hpglpennumber 1)
      (hpglpenspeed 20)
      (hpglpendiameter 15.000000)
      (psnegative false)
      (psa4output false)
      (plotreference true)
      (plotvalue true)
      (plotinvisibletext false)
      (padsonsilk false)
      (subtractmaskfromsilk false)
      (outputformat 1)
      (mirror false)
      (drillshape 0)
      (scaleselection 1)
      (outputdirectory "Production/"))
  )

  (net 0 "")
  (net 1 5V)
  (net 2 GND)
  (net 3 VIN)
  (net 4 "Net-(J2-Pad2)")
  (net 5 "Net-(J2-Pad1)")
  (net 6 "Net-(J3-Pad6)")
  (net 7 "Net-(J3-Pad5)")
  (net 8 "Net-(J3-Pad4)")
  (net 9 "Net-(J3-Pad3)")
  (net 10 "Net-(J3-Pad2)")
  (net 11 "Net-(J3-Pad1)")
  (net 12 3)
  (net 13 2)
  (net 14 1)
  (net 15 7)
  (net 16 6)
  (net 17 9)
  (net 18 10)
  (net 19 11)
  (net 20 14)
  (net 21 15)
  (net 22 "Net-(J5-Pad8)")
  (net 23 "Net-(J5-Pad7)")
  (net 24 "Net-(J5-Pad3)")
  (net 25 "Net-(J5-Pad2)")
  (net 26 "Net-(J5-Pad1)")
  (net 27 "Net-(J6-Pad1)")
  (net 28 "Net-(J6-Pad2)")
  (net 29 "Net-(J6-Pad3)")
  (net 30 "Net-(J6-Pad4)")
  (net 31 "Net-(J6-Pad5)")
  (net 32 "Net-(J6-Pad6)")
  (net 33 "Net-(J6-Pad8)")

  (net_class Default "Ceci est la Netclass par défaut."
    (clearance 0.4)
    (trace_width 0.25)
    (via_dia 0.8)
    (via_drill 0.4)
    (uvia_dia 0.3)
    (uvia_drill 0.1)
    (add_net 1)
    (add_net 10)
    (add_net 11)
    (add_net 14)
    (add_net 15)
    (add_net 2)
    (add_net 3)
    (add_net 5V)
    (add_net 6)
    (add_net 7)
    (add_net 9)
    (add_net GND)
    (add_net "Net-(J2-Pad1)")
    (add_net "Net-(J2-Pad2)")
    (add_net "Net-(J3-Pad1)")
    (add_net "Net-(J3-Pad2)")
    (add_net "Net-(J3-Pad3)")
    (add_net "Net-(J3-Pad4)")
    (add_net "Net-(J3-Pad5)")
    (add_net "Net-(J3-Pad6)")
    (add_net "Net-(J5-Pad1)")
    (add_net "Net-(J5-Pad2)")
    (add_net "Net-(J5-Pad3)")
    (add_net "Net-(J5-Pad7)")
    (add_net "Net-(J5-Pad8)")
    (add_net "Net-(J6-Pad1)")
    (add_net "Net-(J6-Pad2)")
    (add_net "Net-(J6-Pad3)")
    (add_net "Net-(J6-Pad4)")
    (add_net "Net-(J6-Pad5)")
    (add_net "Net-(J6-Pad6)")
    (add_net "Net-(J6-Pad8)")
    (add_net VIN)
  )

  (module "KiCad_empreintes:ARDUINO SHIELD_degenere" (layer F.Cu) (tedit 5C83E6FB) (tstamp 5C83E50C)
    (at 78.74 106.68)
    (path /5C83C379)
    (fp_text reference SHIELD1 (at 2.54 -57.15) (layer F.SilkS)
      (effects (font (size 1.524 1.524) (thickness 0.3048)))
    )
    (fp_text value ARDUINO_SHIELD (at 5.08 -54.61) (layer F.SilkS) hide
      (effects (font (size 1.524 1.524) (thickness 0.3048)))
    )
    (fp_line (start 66.04 -2.54) (end 66.04 0) (layer F.SilkS) (width 0.381))
    (fp_line (start 68.58 -5.08) (end 66.04 -2.54) (layer F.SilkS) (width 0.381))
    (fp_line (start 68.58 -38.1) (end 68.58 -5.08) (layer F.SilkS) (width 0.381))
    (fp_line (start 66.04 -40.64) (end 68.58 -38.1) (layer F.SilkS) (width 0.381))
    (fp_line (start 66.04 -52.07) (end 64.77 -53.34) (layer F.SilkS) (width 0.381))
    (fp_line (start 66.04 -40.64) (end 66.04 -52.07) (layer F.SilkS) (width 0.381))
    (pad "" thru_hole circle (at 66.04 -35.56 90) (size 3.937 3.937) (drill 3.175) (layers *.Cu *.Mask F.SilkS))
    (pad "" thru_hole circle (at 66.04 -7.62 90) (size 3.937 3.937) (drill 3.175) (layers *.Cu *.Mask F.SilkS))
    (pad 5V thru_hole oval (at 38.1 -2.54 90) (size 2.54 1.524) (drill 0.8128) (layers *.Cu *.Mask F.SilkS)
      (net 1 5V))
    (pad AREF thru_hole oval (at 23.876 -50.8 90) (size 2.54 1.524) (drill 0.8128) (layers *.Cu *.Mask F.SilkS)
      (net 33 "Net-(J6-Pad8)"))
    (pad GND3 thru_hole oval (at 26.416 -50.8 90) (size 2.54 1.524) (drill 0.8128) (layers *.Cu *.Mask F.SilkS)
      (net 2 GND))
    (pad 13 thru_hole oval (at 28.956 -50.8 90) (size 2.54 1.524) (drill 0.8128) (layers *.Cu *.Mask F.SilkS)
      (net 32 "Net-(J6-Pad6)"))
    (pad 12 thru_hole oval (at 31.496 -50.8 90) (size 2.54 1.524) (drill 0.8128) (layers *.Cu *.Mask F.SilkS)
      (net 31 "Net-(J6-Pad5)"))
    (pad 11 thru_hole oval (at 34.036 -50.8 90) (size 2.54 1.524) (drill 0.8128) (layers *.Cu *.Mask F.SilkS)
      (net 30 "Net-(J6-Pad4)"))
    (pad 10 thru_hole oval (at 36.576 -50.8 90) (size 2.54 1.524) (drill 0.8128) (layers *.Cu *.Mask F.SilkS)
      (net 29 "Net-(J6-Pad3)"))
    (pad 9 thru_hole oval (at 39.116 -50.8 90) (size 2.54 1.524) (drill 0.8128) (layers *.Cu *.Mask F.SilkS)
      (net 28 "Net-(J6-Pad2)"))
    (pad 8 thru_hole oval (at 41.656 -50.8 90) (size 2.54 1.524) (drill 0.8128) (layers *.Cu *.Mask F.SilkS)
      (net 27 "Net-(J6-Pad1)"))
    (pad 7 thru_hole oval (at 45.72 -50.8 90) (size 2.54 1.524) (drill 0.8128) (layers *.Cu *.Mask F.SilkS)
      (net 22 "Net-(J5-Pad8)"))
    (pad 6 thru_hole oval (at 48.26 -50.8 90) (size 2.54 1.524) (drill 0.8128) (layers *.Cu *.Mask F.SilkS)
      (net 23 "Net-(J5-Pad7)"))
    (pad 5 thru_hole oval (at 50.8 -50.8 90) (size 2.54 1.524) (drill 0.8128) (layers *.Cu *.Mask F.SilkS)
      (net 21 15))
    (pad 4 thru_hole oval (at 53.34 -50.8 90) (size 2.54 1.524) (drill 0.8128) (layers *.Cu *.Mask F.SilkS)
      (net 18 10))
    (pad 3 thru_hole oval (at 55.88 -50.8 90) (size 2.54 1.524) (drill 0.8128) (layers *.Cu *.Mask F.SilkS)
      (net 17 9))
    (pad 2 thru_hole oval (at 58.42 -50.8 90) (size 2.54 1.524) (drill 0.8128) (layers *.Cu *.Mask F.SilkS)
      (net 24 "Net-(J5-Pad3)"))
    (pad 1 thru_hole oval (at 60.96 -50.8 90) (size 2.54 1.524) (drill 0.8128) (layers *.Cu *.Mask F.SilkS)
      (net 25 "Net-(J5-Pad2)"))
    (pad 0 thru_hole oval (at 63.5 -50.8 90) (size 2.54 1.524) (drill 0.8128) (layers *.Cu *.Mask F.SilkS)
      (net 26 "Net-(J5-Pad1)"))
    (pad RST thru_hole oval (at 33.02 -2.54 90) (size 2.54 1.524) (drill 0.8128) (layers *.Cu *.Mask F.SilkS)
      (net 5 "Net-(J2-Pad1)"))
    (pad 3V3 thru_hole oval (at 35.56 -2.54 90) (size 2.54 1.524) (drill 0.8128) (layers *.Cu *.Mask F.SilkS)
      (net 4 "Net-(J2-Pad2)"))
    (pad GND1 thru_hole oval (at 40.64 -2.54 90) (size 2.54 1.524) (drill 0.8128) (layers *.Cu *.Mask F.SilkS)
      (net 2 GND))
    (pad GND2 thru_hole oval (at 43.18 -2.54 90) (size 2.54 1.524) (drill 0.8128) (layers *.Cu *.Mask F.SilkS)
      (net 2 GND))
    (pad V_IN thru_hole oval (at 45.72 -2.54 90) (size 2.54 1.524) (drill 0.8128) (layers *.Cu *.Mask F.SilkS)
      (net 3 VIN))
    (pad AD2 thru_hole oval (at 55.88 -2.54 90) (size 2.54 1.524) (drill 0.8128) (layers *.Cu *.Mask F.SilkS)
      (net 9 "Net-(J3-Pad3)"))
    (pad AD1 thru_hole oval (at 53.34 -2.54 90) (size 2.54 1.524) (drill 0.8128) (layers *.Cu *.Mask F.SilkS)
      (net 10 "Net-(J3-Pad2)"))
    (pad AD0 thru_hole oval (at 50.8 -2.54 90) (size 2.54 1.524) (drill 0.8128) (layers *.Cu *.Mask F.SilkS)
      (net 11 "Net-(J3-Pad1)"))
    (pad AD3 thru_hole oval (at 58.42 -2.54 90) (size 2.54 1.524) (drill 0.8128) (layers *.Cu *.Mask F.SilkS)
      (net 8 "Net-(J3-Pad4)"))
    (pad AD4 thru_hole oval (at 60.96 -2.54 90) (size 2.54 1.524) (drill 0.8128) (layers *.Cu *.Mask F.SilkS)
      (net 7 "Net-(J3-Pad5)"))
    (pad AD5 thru_hole oval (at 63.5 -2.54 90) (size 2.54 1.524) (drill 0.8128) (layers *.Cu *.Mask F.SilkS)
      (net 6 "Net-(J3-Pad6)"))
  )

  (module Socket_Strips:Socket_Strip_Straight_1x06_Pitch2.54mm (layer F.Cu) (tedit 58CD5446) (tstamp 5C83E43A)
    (at 111.76 101.6 90)
    (descr "Through hole straight socket strip, 1x06, 2.54mm pitch, single row")
    (tags "Through hole socket strip THT 1x06 2.54mm single row")
    (path /5C83F203)
    (fp_text reference J2 (at 0 -2.33 90) (layer F.SilkS)
      (effects (font (size 1 1) (thickness 0.15)))
    )
    (fp_text value Conn_01x06_Female (at 0 15.03 90) (layer F.Fab)
      (effects (font (size 1 1) (thickness 0.15)))
    )
    (fp_line (start -1.27 -1.27) (end -1.27 13.97) (layer F.Fab) (width 0.1))
    (fp_line (start -1.27 13.97) (end 1.27 13.97) (layer F.Fab) (width 0.1))
    (fp_line (start 1.27 13.97) (end 1.27 -1.27) (layer F.Fab) (width 0.1))
    (fp_line (start 1.27 -1.27) (end -1.27 -1.27) (layer F.Fab) (width 0.1))
    (fp_line (start -1.33 1.27) (end -1.33 14.03) (layer F.SilkS) (width 0.12))
    (fp_line (start -1.33 14.03) (end 1.33 14.03) (layer F.SilkS) (width 0.12))
    (fp_line (start 1.33 14.03) (end 1.33 1.27) (layer F.SilkS) (width 0.12))
    (fp_line (start 1.33 1.27) (end -1.33 1.27) (layer F.SilkS) (width 0.12))
    (fp_line (start -1.33 0) (end -1.33 -1.33) (layer F.SilkS) (width 0.12))
    (fp_line (start -1.33 -1.33) (end 0 -1.33) (layer F.SilkS) (width 0.12))
    (fp_line (start -1.8 -1.8) (end -1.8 14.5) (layer F.CrtYd) (width 0.05))
    (fp_line (start -1.8 14.5) (end 1.8 14.5) (layer F.CrtYd) (width 0.05))
    (fp_line (start 1.8 14.5) (end 1.8 -1.8) (layer F.CrtYd) (width 0.05))
    (fp_line (start 1.8 -1.8) (end -1.8 -1.8) (layer F.CrtYd) (width 0.05))
    (fp_text user %R (at 0 -2.33 90) (layer F.Fab)
      (effects (font (size 1 1) (thickness 0.15)))
    )
    (pad 1 thru_hole rect (at 0 0 90) (size 1.7 1.7) (drill 1) (layers *.Cu *.Mask)
      (net 5 "Net-(J2-Pad1)"))
    (pad 2 thru_hole oval (at 0 2.54 90) (size 1.7 1.7) (drill 1) (layers *.Cu *.Mask)
      (net 4 "Net-(J2-Pad2)"))
    (pad 3 thru_hole oval (at 0 5.08 90) (size 1.7 1.7) (drill 1) (layers *.Cu *.Mask)
      (net 1 5V))
    (pad 4 thru_hole oval (at 0 7.62 90) (size 1.7 1.7) (drill 1) (layers *.Cu *.Mask)
      (net 2 GND))
    (pad 5 thru_hole oval (at 0 10.16 90) (size 1.7 1.7) (drill 1) (layers *.Cu *.Mask)
      (net 2 GND))
    (pad 6 thru_hole oval (at 0 12.7 90) (size 1.7 1.7) (drill 1) (layers *.Cu *.Mask)
      (net 3 VIN))
    (model ${KISYS3DMOD}/Socket_Strips.3dshapes/Socket_Strip_Straight_1x06_Pitch2.54mm.wrl
      (offset (xyz 0 -6.349999904632568 0))
      (scale (xyz 1 1 1))
      (rotate (xyz 0 0 270))
    )
  )

  (module Socket_Strips:Socket_Strip_Straight_1x06_Pitch2.54mm (layer F.Cu) (tedit 58CD5446) (tstamp 5C83E453)
    (at 129.54 101.6 90)
    (descr "Through hole straight socket strip, 1x06, 2.54mm pitch, single row")
    (tags "Through hole socket strip THT 1x06 2.54mm single row")
    (path /5C83CA8F)
    (fp_text reference J3 (at 0 -2.33 90) (layer F.SilkS)
      (effects (font (size 1 1) (thickness 0.15)))
    )
    (fp_text value Conn_01x06_Female (at 0 15.03 90) (layer F.Fab)
      (effects (font (size 1 1) (thickness 0.15)))
    )
    (fp_text user %R (at 0 -2.33 90) (layer F.Fab)
      (effects (font (size 1 1) (thickness 0.15)))
    )
    (fp_line (start 1.8 -1.8) (end -1.8 -1.8) (layer F.CrtYd) (width 0.05))
    (fp_line (start 1.8 14.5) (end 1.8 -1.8) (layer F.CrtYd) (width 0.05))
    (fp_line (start -1.8 14.5) (end 1.8 14.5) (layer F.CrtYd) (width 0.05))
    (fp_line (start -1.8 -1.8) (end -1.8 14.5) (layer F.CrtYd) (width 0.05))
    (fp_line (start -1.33 -1.33) (end 0 -1.33) (layer F.SilkS) (width 0.12))
    (fp_line (start -1.33 0) (end -1.33 -1.33) (layer F.SilkS) (width 0.12))
    (fp_line (start 1.33 1.27) (end -1.33 1.27) (layer F.SilkS) (width 0.12))
    (fp_line (start 1.33 14.03) (end 1.33 1.27) (layer F.SilkS) (width 0.12))
    (fp_line (start -1.33 14.03) (end 1.33 14.03) (layer F.SilkS) (width 0.12))
    (fp_line (start -1.33 1.27) (end -1.33 14.03) (layer F.SilkS) (width 0.12))
    (fp_line (start 1.27 -1.27) (end -1.27 -1.27) (layer F.Fab) (width 0.1))
    (fp_line (start 1.27 13.97) (end 1.27 -1.27) (layer F.Fab) (width 0.1))
    (fp_line (start -1.27 13.97) (end 1.27 13.97) (layer F.Fab) (width 0.1))
    (fp_line (start -1.27 -1.27) (end -1.27 13.97) (layer F.Fab) (width 0.1))
    (pad 6 thru_hole oval (at 0 12.7 90) (size 1.7 1.7) (drill 1) (layers *.Cu *.Mask)
      (net 6 "Net-(J3-Pad6)"))
    (pad 5 thru_hole oval (at 0 10.16 90) (size 1.7 1.7) (drill 1) (layers *.Cu *.Mask)
      (net 7 "Net-(J3-Pad5)"))
    (pad 4 thru_hole oval (at 0 7.62 90) (size 1.7 1.7) (drill 1) (layers *.Cu *.Mask)
      (net 8 "Net-(J3-Pad4)"))
    (pad 3 thru_hole oval (at 0 5.08 90) (size 1.7 1.7) (drill 1) (layers *.Cu *.Mask)
      (net 9 "Net-(J3-Pad3)"))
    (pad 2 thru_hole oval (at 0 2.54 90) (size 1.7 1.7) (drill 1) (layers *.Cu *.Mask)
      (net 10 "Net-(J3-Pad2)"))
    (pad 1 thru_hole rect (at 0 0 90) (size 1.7 1.7) (drill 1) (layers *.Cu *.Mask)
      (net 11 "Net-(J3-Pad1)"))
    (model ${KISYS3DMOD}/Socket_Strips.3dshapes/Socket_Strip_Straight_1x06_Pitch2.54mm.wrl
      (offset (xyz 0 -6.349999904632568 0))
      (scale (xyz 1 1 1))
      (rotate (xyz 0 0 270))
    )
  )

  (module Socket_Strips:Socket_Strip_Straight_1x08_Pitch2.54mm (layer F.Cu) (tedit 58CD5446) (tstamp 5C83E46E)
    (at 142.24 58.42 270)
    (descr "Through hole straight socket strip, 1x08, 2.54mm pitch, single row")
    (tags "Through hole socket strip THT 1x08 2.54mm single row")
    (path /5C83C9AE)
    (fp_text reference J5 (at 0 -2.33 270) (layer F.SilkS)
      (effects (font (size 1 1) (thickness 0.15)))
    )
    (fp_text value Conn_01x08_Female (at 0 20.11 270) (layer F.Fab)
      (effects (font (size 1 1) (thickness 0.15)))
    )
    (fp_text user %R (at 0 -2.33 270) (layer F.Fab)
      (effects (font (size 1 1) (thickness 0.15)))
    )
    (fp_line (start 1.8 -1.8) (end -1.8 -1.8) (layer F.CrtYd) (width 0.05))
    (fp_line (start 1.8 19.55) (end 1.8 -1.8) (layer F.CrtYd) (width 0.05))
    (fp_line (start -1.8 19.55) (end 1.8 19.55) (layer F.CrtYd) (width 0.05))
    (fp_line (start -1.8 -1.8) (end -1.8 19.55) (layer F.CrtYd) (width 0.05))
    (fp_line (start -1.33 -1.33) (end 0 -1.33) (layer F.SilkS) (width 0.12))
    (fp_line (start -1.33 0) (end -1.33 -1.33) (layer F.SilkS) (width 0.12))
    (fp_line (start 1.33 1.27) (end -1.33 1.27) (layer F.SilkS) (width 0.12))
    (fp_line (start 1.33 19.11) (end 1.33 1.27) (layer F.SilkS) (width 0.12))
    (fp_line (start -1.33 19.11) (end 1.33 19.11) (layer F.SilkS) (width 0.12))
    (fp_line (start -1.33 1.27) (end -1.33 19.11) (layer F.SilkS) (width 0.12))
    (fp_line (start 1.27 -1.27) (end -1.27 -1.27) (layer F.Fab) (width 0.1))
    (fp_line (start 1.27 19.05) (end 1.27 -1.27) (layer F.Fab) (width 0.1))
    (fp_line (start -1.27 19.05) (end 1.27 19.05) (layer F.Fab) (width 0.1))
    (fp_line (start -1.27 -1.27) (end -1.27 19.05) (layer F.Fab) (width 0.1))
    (pad 8 thru_hole oval (at 0 17.78 270) (size 1.7 1.7) (drill 1) (layers *.Cu *.Mask)
      (net 22 "Net-(J5-Pad8)"))
    (pad 7 thru_hole oval (at 0 15.24 270) (size 1.7 1.7) (drill 1) (layers *.Cu *.Mask)
      (net 23 "Net-(J5-Pad7)"))
    (pad 6 thru_hole oval (at 0 12.7 270) (size 1.7 1.7) (drill 1) (layers *.Cu *.Mask)
      (net 21 15))
    (pad 5 thru_hole oval (at 0 10.16 270) (size 1.7 1.7) (drill 1) (layers *.Cu *.Mask)
      (net 18 10))
    (pad 4 thru_hole oval (at 0 7.62 270) (size 1.7 1.7) (drill 1) (layers *.Cu *.Mask)
      (net 17 9))
    (pad 3 thru_hole oval (at 0 5.08 270) (size 1.7 1.7) (drill 1) (layers *.Cu *.Mask)
      (net 24 "Net-(J5-Pad3)"))
    (pad 2 thru_hole oval (at 0 2.54 270) (size 1.7 1.7) (drill 1) (layers *.Cu *.Mask)
      (net 25 "Net-(J5-Pad2)"))
    (pad 1 thru_hole rect (at 0 0 270) (size 1.7 1.7) (drill 1) (layers *.Cu *.Mask)
      (net 26 "Net-(J5-Pad1)"))
    (model ${KISYS3DMOD}/Socket_Strips.3dshapes/Socket_Strip_Straight_1x08_Pitch2.54mm.wrl
      (offset (xyz 0 -8.889999866485596 0))
      (scale (xyz 1 1 1))
      (rotate (xyz 0 0 270))
    )
  )

  (module Socket_Strips:Socket_Strip_Straight_1x08_Pitch2.54mm (layer F.Cu) (tedit 58CD5446) (tstamp 5C83E489)
    (at 120.396 58.42 270)
    (descr "Through hole straight socket strip, 1x08, 2.54mm pitch, single row")
    (tags "Through hole socket strip THT 1x08 2.54mm single row")
    (path /5C83D0FA)
    (fp_text reference J6 (at 0 -2.33 270) (layer F.SilkS)
      (effects (font (size 1 1) (thickness 0.15)))
    )
    (fp_text value Conn_01x08_Female (at 0 20.11 270) (layer F.Fab)
      (effects (font (size 1 1) (thickness 0.15)))
    )
    (fp_line (start -1.27 -1.27) (end -1.27 19.05) (layer F.Fab) (width 0.1))
    (fp_line (start -1.27 19.05) (end 1.27 19.05) (layer F.Fab) (width 0.1))
    (fp_line (start 1.27 19.05) (end 1.27 -1.27) (layer F.Fab) (width 0.1))
    (fp_line (start 1.27 -1.27) (end -1.27 -1.27) (layer F.Fab) (width 0.1))
    (fp_line (start -1.33 1.27) (end -1.33 19.11) (layer F.SilkS) (width 0.12))
    (fp_line (start -1.33 19.11) (end 1.33 19.11) (layer F.SilkS) (width 0.12))
    (fp_line (start 1.33 19.11) (end 1.33 1.27) (layer F.SilkS) (width 0.12))
    (fp_line (start 1.33 1.27) (end -1.33 1.27) (layer F.SilkS) (width 0.12))
    (fp_line (start -1.33 0) (end -1.33 -1.33) (layer F.SilkS) (width 0.12))
    (fp_line (start -1.33 -1.33) (end 0 -1.33) (layer F.SilkS) (width 0.12))
    (fp_line (start -1.8 -1.8) (end -1.8 19.55) (layer F.CrtYd) (width 0.05))
    (fp_line (start -1.8 19.55) (end 1.8 19.55) (layer F.CrtYd) (width 0.05))
    (fp_line (start 1.8 19.55) (end 1.8 -1.8) (layer F.CrtYd) (width 0.05))
    (fp_line (start 1.8 -1.8) (end -1.8 -1.8) (layer F.CrtYd) (width 0.05))
    (fp_text user %R (at 0 -2.33 270) (layer F.Fab)
      (effects (font (size 1 1) (thickness 0.15)))
    )
    (pad 1 thru_hole rect (at 0 0 270) (size 1.7 1.7) (drill 1) (layers *.Cu *.Mask)
      (net 27 "Net-(J6-Pad1)"))
    (pad 2 thru_hole oval (at 0 2.54 270) (size 1.7 1.7) (drill 1) (layers *.Cu *.Mask)
      (net 28 "Net-(J6-Pad2)"))
    (pad 3 thru_hole oval (at 0 5.08 270) (size 1.7 1.7) (drill 1) (layers *.Cu *.Mask)
      (net 29 "Net-(J6-Pad3)"))
    (pad 4 thru_hole oval (at 0 7.62 270) (size 1.7 1.7) (drill 1) (layers *.Cu *.Mask)
      (net 30 "Net-(J6-Pad4)"))
    (pad 5 thru_hole oval (at 0 10.16 270) (size 1.7 1.7) (drill 1) (layers *.Cu *.Mask)
      (net 31 "Net-(J6-Pad5)"))
    (pad 6 thru_hole oval (at 0 12.7 270) (size 1.7 1.7) (drill 1) (layers *.Cu *.Mask)
      (net 32 "Net-(J6-Pad6)"))
    (pad 7 thru_hole oval (at 0 15.24 270) (size 1.7 1.7) (drill 1) (layers *.Cu *.Mask)
      (net 2 GND))
    (pad 8 thru_hole oval (at 0 17.78 270) (size 1.7 1.7) (drill 1) (layers *.Cu *.Mask)
      (net 33 "Net-(J6-Pad8)"))
    (model ${KISYS3DMOD}/Socket_Strips.3dshapes/Socket_Strip_Straight_1x08_Pitch2.54mm.wrl
      (offset (xyz 0 -8.889999866485596 0))
      (scale (xyz 1 1 1))
      (rotate (xyz 0 0 270))
    )
  )

  (module Socket_Strips:Socket_Strip_Straight_1x03_Pitch2.54mm (layer F.Cu) (tedit 58CD5446) (tstamp 5C83E49F)
    (at 114.427 85.217 90)
    (descr "Through hole straight socket strip, 1x03, 2.54mm pitch, single row")
    (tags "Through hole socket strip THT 1x03 2.54mm single row")
    (path /5C843ADF)
    (fp_text reference J7 (at 0 -2.33 90) (layer F.SilkS)
      (effects (font (size 1 1) (thickness 0.15)))
    )
    (fp_text value Conn_01x03_Female (at 0 7.41 90) (layer F.Fab)
      (effects (font (size 1 1) (thickness 0.15)))
    )
    (fp_line (start -1.27 -1.27) (end -1.27 6.35) (layer F.Fab) (width 0.1))
    (fp_line (start -1.27 6.35) (end 1.27 6.35) (layer F.Fab) (width 0.1))
    (fp_line (start 1.27 6.35) (end 1.27 -1.27) (layer F.Fab) (width 0.1))
    (fp_line (start 1.27 -1.27) (end -1.27 -1.27) (layer F.Fab) (width 0.1))
    (fp_line (start -1.33 1.27) (end -1.33 6.41) (layer F.SilkS) (width 0.12))
    (fp_line (start -1.33 6.41) (end 1.33 6.41) (layer F.SilkS) (width 0.12))
    (fp_line (start 1.33 6.41) (end 1.33 1.27) (layer F.SilkS) (width 0.12))
    (fp_line (start 1.33 1.27) (end -1.33 1.27) (layer F.SilkS) (width 0.12))
    (fp_line (start -1.33 0) (end -1.33 -1.33) (layer F.SilkS) (width 0.12))
    (fp_line (start -1.33 -1.33) (end 0 -1.33) (layer F.SilkS) (width 0.12))
    (fp_line (start -1.8 -1.8) (end -1.8 6.85) (layer F.CrtYd) (width 0.05))
    (fp_line (start -1.8 6.85) (end 1.8 6.85) (layer F.CrtYd) (width 0.05))
    (fp_line (start 1.8 6.85) (end 1.8 -1.8) (layer F.CrtYd) (width 0.05))
    (fp_line (start 1.8 -1.8) (end -1.8 -1.8) (layer F.CrtYd) (width 0.05))
    (fp_text user %R (at 0 -2.33 90) (layer F.Fab)
      (effects (font (size 1 1) (thickness 0.15)))
    )
    (pad 1 thru_hole rect (at 0 0 90) (size 1.7 1.7) (drill 1) (layers *.Cu *.Mask)
      (net 14 1))
    (pad 2 thru_hole oval (at 0 2.54 90) (size 1.7 1.7) (drill 1) (layers *.Cu *.Mask)
      (net 13 2))
    (pad 3 thru_hole oval (at 0 5.08 90) (size 1.7 1.7) (drill 1) (layers *.Cu *.Mask)
      (net 12 3))
    (model ${KISYS3DMOD}/Socket_Strips.3dshapes/Socket_Strip_Straight_1x03_Pitch2.54mm.wrl
      (offset (xyz 0 -2.539999961853027 0))
      (scale (xyz 1 1 1))
      (rotate (xyz 0 0 270))
    )
  )

  (module Socket_Strips:Socket_Strip_Straight_1x02_Pitch2.54mm (layer F.Cu) (tedit 58CD5446) (tstamp 5C83E4B4)
    (at 127.127 85.217 90)
    (descr "Through hole straight socket strip, 1x02, 2.54mm pitch, single row")
    (tags "Through hole socket strip THT 1x02 2.54mm single row")
    (path /5C84593F)
    (fp_text reference J8 (at 0 -2.33 90) (layer F.SilkS)
      (effects (font (size 1 1) (thickness 0.15)))
    )
    (fp_text value Conn_01x02_Female (at 0 4.87 90) (layer F.Fab)
      (effects (font (size 1 1) (thickness 0.15)))
    )
    (fp_line (start -1.27 -1.27) (end -1.27 3.81) (layer F.Fab) (width 0.1))
    (fp_line (start -1.27 3.81) (end 1.27 3.81) (layer F.Fab) (width 0.1))
    (fp_line (start 1.27 3.81) (end 1.27 -1.27) (layer F.Fab) (width 0.1))
    (fp_line (start 1.27 -1.27) (end -1.27 -1.27) (layer F.Fab) (width 0.1))
    (fp_line (start -1.33 1.27) (end -1.33 3.87) (layer F.SilkS) (width 0.12))
    (fp_line (start -1.33 3.87) (end 1.33 3.87) (layer F.SilkS) (width 0.12))
    (fp_line (start 1.33 3.87) (end 1.33 1.27) (layer F.SilkS) (width 0.12))
    (fp_line (start 1.33 1.27) (end -1.33 1.27) (layer F.SilkS) (width 0.12))
    (fp_line (start -1.33 0) (end -1.33 -1.33) (layer F.SilkS) (width 0.12))
    (fp_line (start -1.33 -1.33) (end 0 -1.33) (layer F.SilkS) (width 0.12))
    (fp_line (start -1.8 -1.8) (end -1.8 4.35) (layer F.CrtYd) (width 0.05))
    (fp_line (start -1.8 4.35) (end 1.8 4.35) (layer F.CrtYd) (width 0.05))
    (fp_line (start 1.8 4.35) (end 1.8 -1.8) (layer F.CrtYd) (width 0.05))
    (fp_line (start 1.8 -1.8) (end -1.8 -1.8) (layer F.CrtYd) (width 0.05))
    (fp_text user %R (at 0 -2.33 90) (layer F.Fab)
      (effects (font (size 1 1) (thickness 0.15)))
    )
    (pad 1 thru_hole rect (at 0 0 90) (size 1.7 1.7) (drill 1) (layers *.Cu *.Mask)
      (net 16 6))
    (pad 2 thru_hole oval (at 0 2.54 90) (size 1.7 1.7) (drill 1) (layers *.Cu *.Mask)
      (net 15 7))
    (model ${KISYS3DMOD}/Socket_Strips.3dshapes/Socket_Strip_Straight_1x02_Pitch2.54mm.wrl
      (offset (xyz 0 -1.269999980926514 0))
      (scale (xyz 1 1 1))
      (rotate (xyz 0 0 270))
    )
  )

  (module Socket_Strips:Socket_Strip_Straight_1x03_Pitch2.54mm (layer F.Cu) (tedit 58CD5446) (tstamp 5C83E4CA)
    (at 132.207 70.612 270)
    (descr "Through hole straight socket strip, 1x03, 2.54mm pitch, single row")
    (tags "Through hole socket strip THT 1x03 2.54mm single row")
    (path /5C843B51)
    (fp_text reference J9 (at 0 -2.33 270) (layer F.SilkS)
      (effects (font (size 1 1) (thickness 0.15)))
    )
    (fp_text value Conn_01x03_Female (at 0 7.41 270) (layer F.Fab)
      (effects (font (size 1 1) (thickness 0.15)))
    )
    (fp_text user %R (at 0 -2.33 270) (layer F.Fab)
      (effects (font (size 1 1) (thickness 0.15)))
    )
    (fp_line (start 1.8 -1.8) (end -1.8 -1.8) (layer F.CrtYd) (width 0.05))
    (fp_line (start 1.8 6.85) (end 1.8 -1.8) (layer F.CrtYd) (width 0.05))
    (fp_line (start -1.8 6.85) (end 1.8 6.85) (layer F.CrtYd) (width 0.05))
    (fp_line (start -1.8 -1.8) (end -1.8 6.85) (layer F.CrtYd) (width 0.05))
    (fp_line (start -1.33 -1.33) (end 0 -1.33) (layer F.SilkS) (width 0.12))
    (fp_line (start -1.33 0) (end -1.33 -1.33) (layer F.SilkS) (width 0.12))
    (fp_line (start 1.33 1.27) (end -1.33 1.27) (layer F.SilkS) (width 0.12))
    (fp_line (start 1.33 6.41) (end 1.33 1.27) (layer F.SilkS) (width 0.12))
    (fp_line (start -1.33 6.41) (end 1.33 6.41) (layer F.SilkS) (width 0.12))
    (fp_line (start -1.33 1.27) (end -1.33 6.41) (layer F.SilkS) (width 0.12))
    (fp_line (start 1.27 -1.27) (end -1.27 -1.27) (layer F.Fab) (width 0.1))
    (fp_line (start 1.27 6.35) (end 1.27 -1.27) (layer F.Fab) (width 0.1))
    (fp_line (start -1.27 6.35) (end 1.27 6.35) (layer F.Fab) (width 0.1))
    (fp_line (start -1.27 -1.27) (end -1.27 6.35) (layer F.Fab) (width 0.1))
    (pad 3 thru_hole oval (at 0 5.08 270) (size 1.7 1.7) (drill 1) (layers *.Cu *.Mask)
      (net 19 11))
    (pad 2 thru_hole oval (at 0 2.54 270) (size 1.7 1.7) (drill 1) (layers *.Cu *.Mask)
      (net 18 10))
    (pad 1 thru_hole rect (at 0 0 270) (size 1.7 1.7) (drill 1) (layers *.Cu *.Mask)
      (net 17 9))
    (model ${KISYS3DMOD}/Socket_Strips.3dshapes/Socket_Strip_Straight_1x03_Pitch2.54mm.wrl
      (offset (xyz 0 -2.539999961853027 0))
      (scale (xyz 1 1 1))
      (rotate (xyz 0 0 270))
    )
  )

  (module Socket_Strips:Socket_Strip_Straight_1x02_Pitch2.54mm (layer F.Cu) (tedit 58CD5446) (tstamp 5C83E4DF)
    (at 119.507 70.612 270)
    (descr "Through hole straight socket strip, 1x02, 2.54mm pitch, single row")
    (tags "Through hole socket strip THT 1x02 2.54mm single row")
    (path /5C84597F)
    (fp_text reference J10 (at 0 -2.33 270) (layer F.SilkS)
      (effects (font (size 1 1) (thickness 0.15)))
    )
    (fp_text value Conn_01x02_Female (at 0 4.87 270) (layer F.Fab)
      (effects (font (size 1 1) (thickness 0.15)))
    )
    (fp_text user %R (at 0 -2.33 270) (layer F.Fab)
      (effects (font (size 1 1) (thickness 0.15)))
    )
    (fp_line (start 1.8 -1.8) (end -1.8 -1.8) (layer F.CrtYd) (width 0.05))
    (fp_line (start 1.8 4.35) (end 1.8 -1.8) (layer F.CrtYd) (width 0.05))
    (fp_line (start -1.8 4.35) (end 1.8 4.35) (layer F.CrtYd) (width 0.05))
    (fp_line (start -1.8 -1.8) (end -1.8 4.35) (layer F.CrtYd) (width 0.05))
    (fp_line (start -1.33 -1.33) (end 0 -1.33) (layer F.SilkS) (width 0.12))
    (fp_line (start -1.33 0) (end -1.33 -1.33) (layer F.SilkS) (width 0.12))
    (fp_line (start 1.33 1.27) (end -1.33 1.27) (layer F.SilkS) (width 0.12))
    (fp_line (start 1.33 3.87) (end 1.33 1.27) (layer F.SilkS) (width 0.12))
    (fp_line (start -1.33 3.87) (end 1.33 3.87) (layer F.SilkS) (width 0.12))
    (fp_line (start -1.33 1.27) (end -1.33 3.87) (layer F.SilkS) (width 0.12))
    (fp_line (start 1.27 -1.27) (end -1.27 -1.27) (layer F.Fab) (width 0.1))
    (fp_line (start 1.27 3.81) (end 1.27 -1.27) (layer F.Fab) (width 0.1))
    (fp_line (start -1.27 3.81) (end 1.27 3.81) (layer F.Fab) (width 0.1))
    (fp_line (start -1.27 -1.27) (end -1.27 3.81) (layer F.Fab) (width 0.1))
    (pad 2 thru_hole oval (at 0 2.54 270) (size 1.7 1.7) (drill 1) (layers *.Cu *.Mask)
      (net 21 15))
    (pad 1 thru_hole rect (at 0 0 270) (size 1.7 1.7) (drill 1) (layers *.Cu *.Mask)
      (net 20 14))
    (model ${KISYS3DMOD}/Socket_Strips.3dshapes/Socket_Strip_Straight_1x02_Pitch2.54mm.wrl
      (offset (xyz 0 -1.269999980926514 0))
      (scale (xyz 1 1 1))
      (rotate (xyz 0 0 270))
    )
  )

  (module Housings_DIP:DIP-16_W7.62mm_Socket_LongPads (layer F.Cu) (tedit 59C78D6B) (tstamp 5C83E538)
    (at 114.412 81.697 90)
    (descr "16-lead though-hole mounted DIP package, row spacing 7.62 mm (300 mils), Socket, LongPads")
    (tags "THT DIP DIL PDIP 2.54mm 7.62mm 300mil Socket LongPads")
    (path /5C83C137)
    (fp_text reference U1 (at 3.81 -2.33 90) (layer F.SilkS)
      (effects (font (size 1 1) (thickness 0.15)))
    )
    (fp_text value L293D (at 3.81 20.11 90) (layer F.Fab)
      (effects (font (size 1 1) (thickness 0.15)))
    )
    (fp_arc (start 3.81 -1.33) (end 2.81 -1.33) (angle -180) (layer F.SilkS) (width 0.12))
    (fp_line (start 1.635 -1.27) (end 6.985 -1.27) (layer F.Fab) (width 0.1))
    (fp_line (start 6.985 -1.27) (end 6.985 19.05) (layer F.Fab) (width 0.1))
    (fp_line (start 6.985 19.05) (end 0.635 19.05) (layer F.Fab) (width 0.1))
    (fp_line (start 0.635 19.05) (end 0.635 -0.27) (layer F.Fab) (width 0.1))
    (fp_line (start 0.635 -0.27) (end 1.635 -1.27) (layer F.Fab) (width 0.1))
    (fp_line (start -1.27 -1.33) (end -1.27 19.11) (layer F.Fab) (width 0.1))
    (fp_line (start -1.27 19.11) (end 8.89 19.11) (layer F.Fab) (width 0.1))
    (fp_line (start 8.89 19.11) (end 8.89 -1.33) (layer F.Fab) (width 0.1))
    (fp_line (start 8.89 -1.33) (end -1.27 -1.33) (layer F.Fab) (width 0.1))
    (fp_line (start 2.81 -1.33) (end 1.56 -1.33) (layer F.SilkS) (width 0.12))
    (fp_line (start 1.56 -1.33) (end 1.56 19.11) (layer F.SilkS) (width 0.12))
    (fp_line (start 1.56 19.11) (end 6.06 19.11) (layer F.SilkS) (width 0.12))
    (fp_line (start 6.06 19.11) (end 6.06 -1.33) (layer F.SilkS) (width 0.12))
    (fp_line (start 6.06 -1.33) (end 4.81 -1.33) (layer F.SilkS) (width 0.12))
    (fp_line (start -1.44 -1.39) (end -1.44 19.17) (layer F.SilkS) (width 0.12))
    (fp_line (start -1.44 19.17) (end 9.06 19.17) (layer F.SilkS) (width 0.12))
    (fp_line (start 9.06 19.17) (end 9.06 -1.39) (layer F.SilkS) (width 0.12))
    (fp_line (start 9.06 -1.39) (end -1.44 -1.39) (layer F.SilkS) (width 0.12))
    (fp_line (start -1.55 -1.6) (end -1.55 19.4) (layer F.CrtYd) (width 0.05))
    (fp_line (start -1.55 19.4) (end 9.15 19.4) (layer F.CrtYd) (width 0.05))
    (fp_line (start 9.15 19.4) (end 9.15 -1.6) (layer F.CrtYd) (width 0.05))
    (fp_line (start 9.15 -1.6) (end -1.55 -1.6) (layer F.CrtYd) (width 0.05))
    (fp_text user %R (at 3.81 8.89 90) (layer F.Fab)
      (effects (font (size 1 1) (thickness 0.15)))
    )
    (pad 1 thru_hole rect (at 0 0 90) (size 2.4 1.6) (drill 0.8) (layers *.Cu *.Mask)
      (net 14 1))
    (pad 9 thru_hole oval (at 7.62 17.78 90) (size 2.4 1.6) (drill 0.8) (layers *.Cu *.Mask)
      (net 17 9))
    (pad 2 thru_hole oval (at 0 2.54 90) (size 2.4 1.6) (drill 0.8) (layers *.Cu *.Mask)
      (net 13 2))
    (pad 10 thru_hole oval (at 7.62 15.24 90) (size 2.4 1.6) (drill 0.8) (layers *.Cu *.Mask)
      (net 18 10))
    (pad 3 thru_hole oval (at 0 5.08 90) (size 2.4 1.6) (drill 0.8) (layers *.Cu *.Mask)
      (net 12 3))
    (pad 11 thru_hole oval (at 7.62 12.7 90) (size 2.4 1.6) (drill 0.8) (layers *.Cu *.Mask)
      (net 19 11))
    (pad 4 thru_hole oval (at 0 7.62 90) (size 2.4 1.6) (drill 0.8) (layers *.Cu *.Mask)
      (net 2 GND))
    (pad 12 thru_hole oval (at 7.62 10.16 90) (size 2.4 1.6) (drill 0.8) (layers *.Cu *.Mask)
      (net 2 GND))
    (pad 5 thru_hole oval (at 0 10.16 90) (size 2.4 1.6) (drill 0.8) (layers *.Cu *.Mask)
      (net 2 GND))
    (pad 13 thru_hole oval (at 7.62 7.62 90) (size 2.4 1.6) (drill 0.8) (layers *.Cu *.Mask)
      (net 2 GND))
    (pad 6 thru_hole oval (at 0 12.7 90) (size 2.4 1.6) (drill 0.8) (layers *.Cu *.Mask)
      (net 16 6))
    (pad 14 thru_hole oval (at 7.62 5.08 90) (size 2.4 1.6) (drill 0.8) (layers *.Cu *.Mask)
      (net 20 14))
    (pad 7 thru_hole oval (at 0 15.24 90) (size 2.4 1.6) (drill 0.8) (layers *.Cu *.Mask)
      (net 15 7))
    (pad 15 thru_hole oval (at 7.62 2.54 90) (size 2.4 1.6) (drill 0.8) (layers *.Cu *.Mask)
      (net 21 15))
    (pad 8 thru_hole oval (at 0 17.78 90) (size 2.4 1.6) (drill 0.8) (layers *.Cu *.Mask)
      (net 3 VIN))
    (pad 16 thru_hole oval (at 7.62 0 90) (size 2.4 1.6) (drill 0.8) (layers *.Cu *.Mask)
      (net 1 5V))
    (model ${KISYS3DMOD}/Housings_DIP.3dshapes/DIP-16_W7.62mm_Socket.wrl
      (at (xyz 0 0 0))
      (scale (xyz 1 1 1))
      (rotate (xyz 0 0 0))
    )
  )

  (module Socket_Strips:Socket_Strip_Straight_1x04_Pitch2.54mm (layer F.Cu) (tedit 58CD5446) (tstamp 5C842CFA)
    (at 116.835001 97.954999 90)
    (descr "Through hole straight socket strip, 1x04, 2.54mm pitch, single row")
    (tags "Through hole socket strip THT 1x04 2.54mm single row")
    (path /5C842BA8)
    (fp_text reference J1 (at 0 -2.33 90) (layer F.SilkS)
      (effects (font (size 1 1) (thickness 0.15)))
    )
    (fp_text value Conn_01x04_Female (at 0 9.95 90) (layer F.Fab)
      (effects (font (size 1 1) (thickness 0.15)))
    )
    (fp_text user %R (at 0 -2.33 90) (layer F.Fab)
      (effects (font (size 1 1) (thickness 0.15)))
    )
    (fp_line (start 1.8 -1.8) (end -1.8 -1.8) (layer F.CrtYd) (width 0.05))
    (fp_line (start 1.8 9.4) (end 1.8 -1.8) (layer F.CrtYd) (width 0.05))
    (fp_line (start -1.8 9.4) (end 1.8 9.4) (layer F.CrtYd) (width 0.05))
    (fp_line (start -1.8 -1.8) (end -1.8 9.4) (layer F.CrtYd) (width 0.05))
    (fp_line (start -1.33 -1.33) (end 0 -1.33) (layer F.SilkS) (width 0.12))
    (fp_line (start -1.33 0) (end -1.33 -1.33) (layer F.SilkS) (width 0.12))
    (fp_line (start 1.33 1.27) (end -1.33 1.27) (layer F.SilkS) (width 0.12))
    (fp_line (start 1.33 8.95) (end 1.33 1.27) (layer F.SilkS) (width 0.12))
    (fp_line (start -1.33 8.95) (end 1.33 8.95) (layer F.SilkS) (width 0.12))
    (fp_line (start -1.33 1.27) (end -1.33 8.95) (layer F.SilkS) (width 0.12))
    (fp_line (start 1.27 -1.27) (end -1.27 -1.27) (layer F.Fab) (width 0.1))
    (fp_line (start 1.27 8.89) (end 1.27 -1.27) (layer F.Fab) (width 0.1))
    (fp_line (start -1.27 8.89) (end 1.27 8.89) (layer F.Fab) (width 0.1))
    (fp_line (start -1.27 -1.27) (end -1.27 8.89) (layer F.Fab) (width 0.1))
    (pad 4 thru_hole oval (at 0 7.62 90) (size 1.7 1.7) (drill 1) (layers *.Cu *.Mask)
      (net 3 VIN))
    (pad 3 thru_hole oval (at 0 5.08 90) (size 1.7 1.7) (drill 1) (layers *.Cu *.Mask)
      (net 2 GND))
    (pad 2 thru_hole oval (at 0 2.54 90) (size 1.7 1.7) (drill 1) (layers *.Cu *.Mask)
      (net 2 GND))
    (pad 1 thru_hole rect (at 0 0 90) (size 1.7 1.7) (drill 1) (layers *.Cu *.Mask)
      (net 1 5V))
    (model ${KISYS3DMOD}/Socket_Strips.3dshapes/Socket_Strip_Straight_1x04_Pitch2.54mm.wrl
      (offset (xyz 0 -3.809999942779541 0))
      (scale (xyz 1 1 1))
      (rotate (xyz 0 0 270))
    )
  )

  (module Socket_Strips:Socket_Strip_Straight_1x04_Pitch2.54mm (layer F.Cu) (tedit 58CD5446) (tstamp 5C842D3C)
    (at 116.835001 94.304999 90)
    (descr "Through hole straight socket strip, 1x04, 2.54mm pitch, single row")
    (tags "Through hole socket strip THT 1x04 2.54mm single row")
    (path /5C842BE4)
    (fp_text reference J4 (at 0 -2.33 90) (layer F.SilkS)
      (effects (font (size 1 1) (thickness 0.15)))
    )
    (fp_text value Conn_01x04_Female (at 0 9.95 90) (layer F.Fab)
      (effects (font (size 1 1) (thickness 0.15)))
    )
    (fp_line (start -1.27 -1.27) (end -1.27 8.89) (layer F.Fab) (width 0.1))
    (fp_line (start -1.27 8.89) (end 1.27 8.89) (layer F.Fab) (width 0.1))
    (fp_line (start 1.27 8.89) (end 1.27 -1.27) (layer F.Fab) (width 0.1))
    (fp_line (start 1.27 -1.27) (end -1.27 -1.27) (layer F.Fab) (width 0.1))
    (fp_line (start -1.33 1.27) (end -1.33 8.95) (layer F.SilkS) (width 0.12))
    (fp_line (start -1.33 8.95) (end 1.33 8.95) (layer F.SilkS) (width 0.12))
    (fp_line (start 1.33 8.95) (end 1.33 1.27) (layer F.SilkS) (width 0.12))
    (fp_line (start 1.33 1.27) (end -1.33 1.27) (layer F.SilkS) (width 0.12))
    (fp_line (start -1.33 0) (end -1.33 -1.33) (layer F.SilkS) (width 0.12))
    (fp_line (start -1.33 -1.33) (end 0 -1.33) (layer F.SilkS) (width 0.12))
    (fp_line (start -1.8 -1.8) (end -1.8 9.4) (layer F.CrtYd) (width 0.05))
    (fp_line (start -1.8 9.4) (end 1.8 9.4) (layer F.CrtYd) (width 0.05))
    (fp_line (start 1.8 9.4) (end 1.8 -1.8) (layer F.CrtYd) (width 0.05))
    (fp_line (start 1.8 -1.8) (end -1.8 -1.8) (layer F.CrtYd) (width 0.05))
    (fp_text user %R (at 0 -2.33 90) (layer F.Fab)
      (effects (font (size 1 1) (thickness 0.15)))
    )
    (pad 1 thru_hole rect (at 0 0 90) (size 1.7 1.7) (drill 1) (layers *.Cu *.Mask)
      (net 1 5V))
    (pad 2 thru_hole oval (at 0 2.54 90) (size 1.7 1.7) (drill 1) (layers *.Cu *.Mask)
      (net 2 GND))
    (pad 3 thru_hole oval (at 0 5.08 90) (size 1.7 1.7) (drill 1) (layers *.Cu *.Mask)
      (net 2 GND))
    (pad 4 thru_hole oval (at 0 7.62 90) (size 1.7 1.7) (drill 1) (layers *.Cu *.Mask)
      (net 3 VIN))
    (model ${KISYS3DMOD}/Socket_Strips.3dshapes/Socket_Strip_Straight_1x04_Pitch2.54mm.wrl
      (offset (xyz 0 -3.809999942779541 0))
      (scale (xyz 1 1 1))
      (rotate (xyz 0 0 270))
    )
  )

  (gr_line (start 100.33 106.68) (end 144.78 106.68) (layer F.SilkS) (width 0.15))
  (gr_line (start 100.33 53.34) (end 100.33 106.68) (layer F.SilkS) (width 0.15))
  (gr_line (start 143.51 53.34) (end 100.33 53.34) (layer F.SilkS) (width 0.15))
  (gr_line (start 100.33 53.34) (end 100.33 106.68) (layer Edge.Cuts) (width 0.2))
  (gr_line (start 144.78 106.68) (end 100.33 106.68) (layer Edge.Cuts) (width 0.2))
  (gr_line (start 144.78 104.14) (end 144.78 106.68) (layer Edge.Cuts) (width 0.2))
  (gr_line (start 147.32 101.6) (end 144.78 104.14) (layer Edge.Cuts) (width 0.2))
  (gr_line (start 147.32 68.58) (end 147.32 101.6) (layer Edge.Cuts) (width 0.2))
  (gr_line (start 144.78 66.04) (end 147.32 68.58) (layer Edge.Cuts) (width 0.2))
  (gr_line (start 144.78 54.61) (end 144.78 66.04) (layer Edge.Cuts) (width 0.2))
  (gr_line (start 143.51 53.34) (end 144.78 54.61) (layer Edge.Cuts) (width 0.2))
  (gr_line (start 100.33 53.34) (end 143.51 53.34) (layer Edge.Cuts) (width 0.2))

  (segment (start 116.84 101.6) (end 116.84 104.14) (width 1.7) (layer F.Cu) (net 1))
  (segment (start 114.412 76.977) (end 114.412 74.077) (width 1.7) (layer F.Cu) (net 1))
  (segment (start 110.744 80.645) (end 114.412 76.977) (width 1.7) (layer F.Cu) (net 1))
  (segment (start 110.744 86.504) (end 110.744 80.645) (width 1.7) (layer F.Cu) (net 1))
  (segment (start 116.84 101.6) (end 116.84 92.6) (width 1.7) (layer F.Cu) (net 1))
  (segment (start 116.84 92.6) (end 110.744 86.504) (width 1.7) (layer F.Cu) (net 1))
  (segment (start 119.38 101.6) (end 119.38 104.14) (width 1.7) (layer F.Cu) (net 2))
  (segment (start 121.92 101.6) (end 121.92 104.14) (width 1.7) (layer F.Cu) (net 2))
  (segment (start 105.156 55.88) (end 105.156 58.42) (width 1.7) (layer F.Cu) (net 2))
  (segment (start 121.92 104.14) (end 119.38 104.14) (width 1.7) (layer F.Cu) (net 2))
  (segment (start 119.38 101.6) (end 121.92 101.6) (width 1.7) (layer F.Cu) (net 2))
  (segment (start 105.156 58.42) (end 105.156 64.516) (width 1.7) (layer F.Cu) (net 2))
  (segment (start 122.032 74.077) (end 124.572 74.077) (width 1.7) (layer F.Cu) (net 2))
  (segment (start 124.572 74.077) (end 124.572 81.697) (width 1.7) (layer F.Cu) (net 2))
  (segment (start 122.032 71.177) (end 121.92 71.065) (width 1.7) (layer F.Cu) (net 2))
  (segment (start 122.032 74.077) (end 122.032 71.177) (width 1.7) (layer F.Cu) (net 2))
  (segment (start 121.92 71.065) (end 121.92 69.85) (width 1.7) (layer F.Cu) (net 2))
  (segment (start 124.572 71.177) (end 124.46 71.065) (width 1.7) (layer F.Cu) (net 2))
  (segment (start 124.572 74.077) (end 124.572 71.177) (width 1.7) (layer F.Cu) (net 2))
  (segment (start 122.032 81.697) (end 124.572 81.697) (width 1.7) (layer F.Cu) (net 2))
  (segment (start 122.032 81.697) (end 122.032 74.077) (width 1.7) (layer F.Cu) (net 2))
  (segment (start 122.032 81.697) (end 122.032 84.978) (width 1.7) (layer F.Cu) (net 2))
  (segment (start 124.572 81.697) (end 124.572 84.978) (width 1.7) (layer F.Cu) (net 2))
  (segment (start 119.38 101.6) (end 119.38 90.78) (width 1.7) (layer F.Cu) (net 2))
  (segment (start 121.92 90.92) (end 121.91 90.91) (width 1.7) (layer F.Cu) (net 2))
  (segment (start 121.92 101.6) (end 121.92 90.92) (width 1.7) (layer F.Cu) (net 2))
  (segment (start 119.375001 94.304999) (end 121.915001 94.304999) (width 1.7) (layer F.Cu) (net 2))
  (segment (start 119.375001 97.954999) (end 121.915001 97.954999) (width 1.7) (layer F.Cu) (net 2))
  (segment (start 124.46 101.6) (end 124.46 104.14) (width 1.7) (layer F.Cu) (net 3))
  (segment (start 132.192 86.078) (end 132.192 81.697) (width 1.7) (layer F.Cu) (net 3))
  (segment (start 124.46 101.6) (end 124.46 93.81) (width 1.7) (layer F.Cu) (net 3))
  (segment (start 124.46 93.81) (end 132.192 86.078) (width 1.7) (layer F.Cu) (net 3))
  (segment (start 114.3 101.6) (end 114.3 104.14) (width 1.7) (layer F.Cu) (net 4))
  (segment (start 111.76 101.6) (end 111.76 104.14) (width 1.7) (layer F.Cu) (net 5))
  (segment (start 142.24 101.6) (end 142.24 104.14) (width 1.7) (layer F.Cu) (net 6))
  (segment (start 139.7 101.6) (end 139.7 104.14) (width 1.7) (layer F.Cu) (net 7))
  (segment (start 137.16 101.6) (end 137.16 104.14) (width 1.7) (layer F.Cu) (net 8))
  (segment (start 134.62 101.6) (end 134.62 104.14) (width 1.7) (layer F.Cu) (net 9))
  (segment (start 132.08 101.6) (end 132.08 104.14) (width 1.7) (layer F.Cu) (net 10))
  (segment (start 129.54 101.6) (end 129.54 104.14) (width 1.7) (layer F.Cu) (net 11))
  (segment (start 119.492 85.202) (end 119.507 85.217) (width 1.6) (layer F.Cu) (net 12))
  (segment (start 119.492 81.697) (end 119.492 85.202) (width 1.6) (layer F.Cu) (net 12))
  (segment (start 116.952 85.202) (end 116.967 85.217) (width 1.6) (layer F.Cu) (net 13))
  (segment (start 116.952 81.697) (end 116.952 85.202) (width 1.6) (layer F.Cu) (net 13))
  (segment (start 114.412 85.202) (end 114.427 85.217) (width 1.6) (layer F.Cu) (net 14))
  (segment (start 114.412 81.697) (end 114.412 85.202) (width 1.6) (layer F.Cu) (net 14))
  (segment (start 129.652 85.202) (end 129.667 85.217) (width 1.6) (layer F.Cu) (net 15))
  (segment (start 129.652 81.697) (end 129.652 85.202) (width 1.6) (layer F.Cu) (net 15))
  (segment (start 127.112 85.202) (end 127.127 85.217) (width 1.6) (layer F.Cu) (net 16))
  (segment (start 127.112 81.697) (end 127.112 85.202) (width 1.6) (layer F.Cu) (net 16))
  (segment (start 132.207 74.062) (end 132.192 74.077) (width 1.6) (layer F.Cu) (net 17))
  (segment (start 132.207 70.612) (end 132.207 74.062) (width 1.6) (layer F.Cu) (net 17))
  (segment (start 129.667 74.062) (end 129.652 74.077) (width 1.6) (layer F.Cu) (net 18))
  (segment (start 129.667 70.612) (end 129.667 74.062) (width 1.6) (layer F.Cu) (net 18))
  (segment (start 127.127 74.062) (end 127.112 74.077) (width 1.6) (layer F.Cu) (net 19))
  (segment (start 127.127 70.612) (end 127.127 74.062) (width 1.6) (layer F.Cu) (net 19))
  (segment (start 119.507 74.062) (end 119.492 74.077) (width 1.6) (layer F.Cu) (net 20))
  (segment (start 119.507 70.612) (end 119.507 74.062) (width 1.6) (layer F.Cu) (net 20))
  (segment (start 116.967 74.062) (end 116.952 74.077) (width 1.6) (layer F.Cu) (net 21))
  (segment (start 116.967 70.612) (end 116.967 74.062) (width 1.6) (layer F.Cu) (net 21))
  (segment (start 124.46 55.88) (end 124.46 58.42) (width 1.7) (layer F.Cu) (net 22))
  (segment (start 127 55.88) (end 127 58.42) (width 1.7) (layer F.Cu) (net 23))
  (segment (start 129.54 55.88) (end 129.54 58.42) (width 1.7) (layer F.Cu) (net 21))
  (segment (start 132.08 55.88) (end 132.08 58.42) (width 1.7) (layer F.Cu) (net 18))
  (segment (start 134.62 55.88) (end 134.62 58.42) (width 1.7) (layer F.Cu) (net 17))
  (segment (start 134.62 68.199) (end 134.62 58.42) (width 1.7) (layer F.Cu) (net 17))
  (segment (start 132.207 70.612) (end 134.62 68.199) (width 1.7) (layer F.Cu) (net 17))
  (segment (start 129.667 69.409919) (end 129.667 70.612) (width 1.7) (layer F.Cu) (net 18))
  (segment (start 129.667 69.201998) (end 129.667 69.409919) (width 1.7) (layer F.Cu) (net 18))
  (segment (start 132.08 66.788998) (end 129.667 69.201998) (width 1.7) (layer F.Cu) (net 18))
  (segment (start 132.08 58.42) (end 132.08 66.788998) (width 1.7) (layer F.Cu) (net 18))
  (segment (start 129.54 65.56) (end 129.54 58.42) (width 1.7) (layer F.Cu) (net 21))
  (segment (start 128 67.1) (end 129.54 65.56) (width 1.7) (layer F.Cu) (net 21))
  (segment (start 119.276919 67.1) (end 128 67.1) (width 1.7) (layer F.Cu) (net 21))
  (segment (start 116.967 70.612) (end 116.967 69.409919) (width 1.7) (layer F.Cu) (net 21))
  (segment (start 116.967 69.409919) (end 119.276919 67.1) (width 1.7) (layer F.Cu) (net 21))
  (segment (start 137.16 55.88) (end 137.16 58.42) (width 1.7) (layer F.Cu) (net 24))
  (segment (start 139.7 55.88) (end 139.7 58.42) (width 1.7) (layer F.Cu) (net 25))
  (segment (start 142.24 55.88) (end 142.24 58.42) (width 1.7) (layer F.Cu) (net 26))
  (segment (start 120.396 55.88) (end 120.396 58.42) (width 1.7) (layer F.Cu) (net 27))
  (segment (start 117.856 55.88) (end 117.856 58.42) (width 1.7) (layer F.Cu) (net 28))
  (segment (start 115.316 55.88) (end 115.316 58.42) (width 1.7) (layer F.Cu) (net 29))
  (segment (start 112.776 55.88) (end 112.776 58.42) (width 1.7) (layer F.Cu) (net 30))
  (segment (start 110.236 55.88) (end 110.236 58.42) (width 1.7) (layer F.Cu) (net 31))
  (segment (start 107.696 55.88) (end 107.696 58.42) (width 1.7) (layer F.Cu) (net 32))
  (segment (start 102.616 55.88) (end 102.616 58.42) (width 1.7) (layer F.Cu) (net 33))

  (zone (net 2) (net_name GND) (layer F.Cu) (tstamp 5C842FBE) (hatch edge 0.508)
    (connect_pads (clearance 0.508))
    (min_thickness 0.254)
    (fill yes (arc_segments 16) (thermal_gap 0.508) (thermal_bridge_width 0.508))
    (polygon
      (pts
        (xy 76.2 50.8) (xy 149.86 50.8) (xy 149.86 109.22) (xy 76.2 109.22)
      )
    )
    (filled_polygon
      (pts
        (xy 144.045 54.914447) (xy 144.045001 65.967611) (xy 144.030602 66.04) (xy 144.087646 66.326782) (xy 144.087647 66.326783)
        (xy 144.250096 66.569905) (xy 144.311463 66.610909) (xy 146.585 68.884447) (xy 146.585 69.243094) (xy 146.254765 68.912859)
        (xy 145.297868 68.5165) (xy 144.262132 68.5165) (xy 143.305235 68.912859) (xy 142.572859 69.645235) (xy 142.1765 70.602132)
        (xy 142.1765 71.637868) (xy 142.572859 72.594765) (xy 143.305235 73.327141) (xy 144.262132 73.7235) (xy 145.297868 73.7235)
        (xy 146.254765 73.327141) (xy 146.585 72.996906) (xy 146.585001 97.183095) (xy 146.254765 96.852859) (xy 145.297868 96.4565)
        (xy 144.262132 96.4565) (xy 143.305235 96.852859) (xy 142.572859 97.585235) (xy 142.1765 98.542132) (xy 142.1765 99.577868)
        (xy 142.40013 100.11776) (xy 142.386256 100.115) (xy 142.24 100.085908) (xy 142.093744 100.115) (xy 141.660582 100.201161)
        (xy 141.169375 100.529375) (xy 140.97 100.827761) (xy 140.770625 100.529375) (xy 140.279418 100.201161) (xy 139.846256 100.115)
        (xy 139.7 100.085908) (xy 139.553744 100.115) (xy 139.120582 100.201161) (xy 138.629375 100.529375) (xy 138.43 100.827761)
        (xy 138.230625 100.529375) (xy 137.739418 100.201161) (xy 137.306256 100.115) (xy 137.16 100.085908) (xy 137.013744 100.115)
        (xy 136.580582 100.201161) (xy 136.089375 100.529375) (xy 135.89 100.827761) (xy 135.690625 100.529375) (xy 135.199418 100.201161)
        (xy 134.766256 100.115) (xy 134.62 100.085908) (xy 134.473744 100.115) (xy 134.040582 100.201161) (xy 133.549375 100.529375)
        (xy 133.35 100.827761) (xy 133.150625 100.529375) (xy 132.659418 100.201161) (xy 132.226256 100.115) (xy 132.08 100.085908)
        (xy 131.933744 100.115) (xy 131.500582 100.201161) (xy 131.009375 100.529375) (xy 130.997184 100.547619) (xy 130.988157 100.502235)
        (xy 130.847809 100.292191) (xy 130.637765 100.151843) (xy 130.39 100.10256) (xy 129.623715 100.10256) (xy 129.54 100.085908)
        (xy 129.456284 100.10256) (xy 128.69 100.10256) (xy 128.442235 100.151843) (xy 128.232191 100.292191) (xy 128.091843 100.502235)
        (xy 128.04256 100.75) (xy 128.04256 102.45) (xy 128.055 102.512543) (xy 128.055001 104.286256) (xy 128.141162 104.719418)
        (xy 128.143 104.722169) (xy 128.143 104.785588) (xy 128.224056 105.193082) (xy 128.532821 105.65518) (xy 128.966567 105.945)
        (xy 125.033434 105.945) (xy 125.46718 105.65518) (xy 125.775944 105.193082) (xy 125.857 104.785588) (xy 125.857 104.72217)
        (xy 125.858839 104.719418) (xy 125.945 104.286256) (xy 125.945 101.746255) (xy 125.974092 101.6) (xy 125.945 101.453744)
        (xy 125.945 98.076123) (xy 125.969093 97.954999) (xy 125.945 97.833875) (xy 125.945 94.426123) (xy 125.945253 94.424854)
        (xy 133.138634 87.231473) (xy 133.262625 87.148625) (xy 133.590839 86.657418) (xy 133.677 86.224256) (xy 133.677 86.224255)
        (xy 133.706092 86.078001) (xy 133.677 85.931746) (xy 133.677 81.550744) (xy 133.627 81.299376) (xy 133.627 81.155667)
        (xy 133.54374 80.737091) (xy 133.226576 80.262423) (xy 132.751908 79.94526) (xy 132.192 79.833887) (xy 131.632091 79.94526)
        (xy 131.157423 80.262424) (xy 130.922 80.614759) (xy 130.686576 80.262423) (xy 130.211908 79.94526) (xy 129.652 79.833887)
        (xy 129.092091 79.94526) (xy 128.617423 80.262424) (xy 128.382 80.614759) (xy 128.146576 80.262423) (xy 127.671908 79.94526)
        (xy 127.112 79.833887) (xy 126.552091 79.94526) (xy 126.077423 80.262424) (xy 125.839501 80.618499) (xy 125.496896 80.1925)
        (xy 125.003819 79.922633) (xy 124.921039 79.905096) (xy 124.699 80.027085) (xy 124.699 81.57) (xy 124.719 81.57)
        (xy 124.719 81.824) (xy 124.699 81.824) (xy 124.699 83.366915) (xy 124.921039 83.488904) (xy 125.003819 83.471367)
        (xy 125.496896 83.2015) (xy 125.677 82.977556) (xy 125.677001 84.128497) (xy 125.62956 84.367) (xy 125.62956 86.067)
        (xy 125.678843 86.314765) (xy 125.819191 86.524809) (xy 126.029235 86.665157) (xy 126.277 86.71444) (xy 127.977 86.71444)
        (xy 128.224765 86.665157) (xy 128.434809 86.524809) (xy 128.575157 86.314765) (xy 128.584184 86.269381) (xy 128.596375 86.287625)
        (xy 129.087582 86.615839) (xy 129.476662 86.693232) (xy 123.513367 92.656527) (xy 123.389376 92.739375) (xy 123.306528 92.863366)
        (xy 123.061162 93.230582) (xy 123.036176 93.356195) (xy 122.681925 93.033354) (xy 122.271891 92.863523) (xy 122.042001 92.984844)
        (xy 122.042001 94.177999) (xy 122.062001 94.177999) (xy 122.062001 94.431999) (xy 122.042001 94.431999) (xy 122.042001 95.625154)
        (xy 122.271891 95.746475) (xy 122.681925 95.576644) (xy 122.975001 95.309554) (xy 122.975001 96.950444) (xy 122.681925 96.683354)
        (xy 122.271891 96.513523) (xy 122.042001 96.634844) (xy 122.042001 97.827999) (xy 122.062001 97.827999) (xy 122.062001 98.081999)
        (xy 122.042001 98.081999) (xy 122.042001 99.275154) (xy 122.271891 99.396475) (xy 122.681925 99.226644) (xy 122.975 98.959554)
        (xy 122.975 100.590889) (xy 122.686924 100.328355) (xy 122.27689 100.158524) (xy 122.047 100.279845) (xy 122.047 101.473)
        (xy 122.067 101.473) (xy 122.067 101.727) (xy 122.047 101.727) (xy 122.047 104.013) (xy 122.067 104.013)
        (xy 122.067 104.267) (xy 122.047 104.267) (xy 122.047 104.287) (xy 121.793 104.287) (xy 121.793 104.267)
        (xy 119.507 104.267) (xy 119.507 104.287) (xy 119.253 104.287) (xy 119.253 104.267) (xy 119.233 104.267)
        (xy 119.233 104.013) (xy 119.253 104.013) (xy 119.253 101.727) (xy 119.507 101.727) (xy 119.507 104.013)
        (xy 121.793 104.013) (xy 121.793 101.727) (xy 119.507 101.727) (xy 119.253 101.727) (xy 119.233 101.727)
        (xy 119.233 101.473) (xy 119.253 101.473) (xy 119.253 100.279845) (xy 119.507 100.279845) (xy 119.507 101.473)
        (xy 121.793 101.473) (xy 121.793 100.279845) (xy 121.56311 100.158524) (xy 121.153076 100.328355) (xy 120.724817 100.718642)
        (xy 120.65 100.877954) (xy 120.575183 100.718642) (xy 120.146924 100.328355) (xy 119.73689 100.158524) (xy 119.507 100.279845)
        (xy 119.253 100.279845) (xy 119.02311 100.158524) (xy 118.613076 100.328355) (xy 118.325 100.590888) (xy 118.325 98.968666)
        (xy 118.608077 99.226644) (xy 119.018111 99.396475) (xy 119.248001 99.275154) (xy 119.248001 98.081999) (xy 119.502001 98.081999)
        (xy 119.502001 99.275154) (xy 119.731891 99.396475) (xy 120.141925 99.226644) (xy 120.570184 98.836357) (xy 120.645001 98.677045)
        (xy 120.719818 98.836357) (xy 121.148077 99.226644) (xy 121.558111 99.396475) (xy 121.788001 99.275154) (xy 121.788001 98.081999)
        (xy 119.502001 98.081999) (xy 119.248001 98.081999) (xy 119.228001 98.081999) (xy 119.228001 97.827999) (xy 119.248001 97.827999)
        (xy 119.248001 96.634844) (xy 119.502001 96.634844) (xy 119.502001 97.827999) (xy 121.788001 97.827999) (xy 121.788001 96.634844)
        (xy 121.558111 96.513523) (xy 121.148077 96.683354) (xy 120.719818 97.073641) (xy 120.645001 97.232953) (xy 120.570184 97.073641)
        (xy 120.141925 96.683354) (xy 119.731891 96.513523) (xy 119.502001 96.634844) (xy 119.248001 96.634844) (xy 119.018111 96.513523)
        (xy 118.608077 96.683354) (xy 118.325 96.941332) (xy 118.325 95.318666) (xy 118.608077 95.576644) (xy 119.018111 95.746475)
        (xy 119.248001 95.625154) (xy 119.248001 94.431999) (xy 119.502001 94.431999) (xy 119.502001 95.625154) (xy 119.731891 95.746475)
        (xy 120.141925 95.576644) (xy 120.570184 95.186357) (xy 120.645001 95.027045) (xy 120.719818 95.186357) (xy 121.148077 95.576644)
        (xy 121.558111 95.746475) (xy 121.788001 95.625154) (xy 121.788001 94.431999) (xy 119.502001 94.431999) (xy 119.248001 94.431999)
        (xy 119.228001 94.431999) (xy 119.228001 94.177999) (xy 119.248001 94.177999) (xy 119.248001 92.984844) (xy 119.502001 92.984844)
        (xy 119.502001 94.177999) (xy 121.788001 94.177999) (xy 121.788001 92.984844) (xy 121.558111 92.863523) (xy 121.148077 93.033354)
        (xy 120.719818 93.423641) (xy 120.645001 93.582953) (xy 120.570184 93.423641) (xy 120.141925 93.033354) (xy 119.731891 92.863523)
        (xy 119.502001 92.984844) (xy 119.248001 92.984844) (xy 119.018111 92.863523) (xy 118.608077 93.033354) (xy 118.325 93.291332)
        (xy 118.325 92.746256) (xy 118.354092 92.6) (xy 118.238839 92.020581) (xy 117.993472 91.653365) (xy 117.910625 91.529375)
        (xy 117.786634 91.446527) (xy 112.229 85.888894) (xy 112.229 81.260106) (xy 112.96456 80.524546) (xy 112.96456 82.897)
        (xy 112.977 82.959543) (xy 112.977001 84.128497) (xy 112.92956 84.367) (xy 112.92956 86.067) (xy 112.978843 86.314765)
        (xy 113.119191 86.524809) (xy 113.329235 86.665157) (xy 113.577 86.71444) (xy 115.277 86.71444) (xy 115.524765 86.665157)
        (xy 115.734809 86.524809) (xy 115.875157 86.314765) (xy 115.884184 86.269381) (xy 115.896375 86.287625) (xy 116.387582 86.615839)
        (xy 116.820744 86.702) (xy 117.113256 86.702) (xy 117.546418 86.615839) (xy 118.037625 86.287625) (xy 118.237 85.989239)
        (xy 118.436375 86.287625) (xy 118.927582 86.615839) (xy 119.360744 86.702) (xy 119.653256 86.702) (xy 120.086418 86.615839)
        (xy 120.577625 86.287625) (xy 120.905839 85.796418) (xy 121.021092 85.217) (xy 120.927 84.743966) (xy 120.927 82.977556)
        (xy 121.107104 83.2015) (xy 121.600181 83.471367) (xy 121.682961 83.488904) (xy 121.905 83.366915) (xy 121.905 81.824)
        (xy 122.159 81.824) (xy 122.159 83.366915) (xy 122.381039 83.488904) (xy 122.463819 83.471367) (xy 122.956896 83.2015)
        (xy 123.302 82.772393) (xy 123.647104 83.2015) (xy 124.140181 83.471367) (xy 124.222961 83.488904) (xy 124.445 83.366915)
        (xy 124.445 81.824) (xy 122.159 81.824) (xy 121.905 81.824) (xy 121.885 81.824) (xy 121.885 81.57)
        (xy 121.905 81.57) (xy 121.905 80.027085) (xy 122.159 80.027085) (xy 122.159 81.57) (xy 124.445 81.57)
        (xy 124.445 80.027085) (xy 124.222961 79.905096) (xy 124.140181 79.922633) (xy 123.647104 80.1925) (xy 123.302 80.621607)
        (xy 122.956896 80.1925) (xy 122.463819 79.922633) (xy 122.381039 79.905096) (xy 122.159 80.027085) (xy 121.905 80.027085)
        (xy 121.682961 79.905096) (xy 121.600181 79.922633) (xy 121.107104 80.1925) (xy 120.764499 80.618499) (xy 120.526576 80.262423)
        (xy 120.051908 79.94526) (xy 119.492 79.833887) (xy 118.932091 79.94526) (xy 118.457423 80.262424) (xy 118.222 80.614759)
        (xy 117.986576 80.262423) (xy 117.511908 79.94526) (xy 116.952 79.833887) (xy 116.392091 79.94526) (xy 115.917423 80.262424)
        (xy 115.836785 80.383107) (xy 115.810157 80.249235) (xy 115.669809 80.039191) (xy 115.459765 79.898843) (xy 115.212 79.84956)
        (xy 113.639547 79.84956) (xy 115.358634 78.130473) (xy 115.482625 78.047625) (xy 115.810839 77.556418) (xy 115.897 77.123256)
        (xy 115.897 77.123255) (xy 115.926092 76.977001) (xy 115.897 76.830746) (xy 115.897 75.48101) (xy 115.917424 75.511577)
        (xy 116.392092 75.82874) (xy 116.952 75.940113) (xy 117.511909 75.82874) (xy 117.986577 75.511577) (xy 118.222 75.159241)
        (xy 118.457424 75.511577) (xy 118.932092 75.82874) (xy 119.492 75.940113) (xy 120.051909 75.82874) (xy 120.526577 75.511577)
        (xy 120.764499 75.155501) (xy 121.107104 75.5815) (xy 121.600181 75.851367) (xy 121.682961 75.868904) (xy 121.905 75.746915)
        (xy 121.905 74.204) (xy 122.159 74.204) (xy 122.159 75.746915) (xy 122.381039 75.868904) (xy 122.463819 75.851367)
        (xy 122.956896 75.5815) (xy 123.302 75.152393) (xy 123.647104 75.5815) (xy 124.140181 75.851367) (xy 124.222961 75.868904)
        (xy 124.445 75.746915) (xy 124.445 74.204) (xy 122.159 74.204) (xy 121.905 74.204) (xy 121.885 74.204)
        (xy 121.885 73.95) (xy 121.905 73.95) (xy 121.905 72.407085) (xy 122.159 72.407085) (xy 122.159 73.95)
        (xy 124.445 73.95) (xy 124.445 72.407085) (xy 124.222961 72.285096) (xy 124.140181 72.302633) (xy 123.647104 72.5725)
        (xy 123.302 73.001607) (xy 122.956896 72.5725) (xy 122.463819 72.302633) (xy 122.381039 72.285096) (xy 122.159 72.407085)
        (xy 121.905 72.407085) (xy 121.682961 72.285096) (xy 121.600181 72.302633) (xy 121.107104 72.5725) (xy 120.942 72.777792)
        (xy 120.942 71.729456) (xy 120.955157 71.709765) (xy 121.00444 71.462) (xy 121.00444 69.762) (xy 120.955157 69.514235)
        (xy 120.814809 69.304191) (xy 120.604765 69.163843) (xy 120.357 69.11456) (xy 119.362466 69.11456) (xy 119.892026 68.585)
        (xy 127.853745 68.585) (xy 128 68.614092) (xy 128.146255 68.585) (xy 128.146256 68.585) (xy 128.315806 68.551274)
        (xy 128.268161 68.622581) (xy 128.182 69.055742) (xy 128.152908 69.201998) (xy 128.182 69.348253) (xy 128.182 69.530935)
        (xy 127.706418 69.213161) (xy 127.273256 69.127) (xy 126.980744 69.127) (xy 126.547582 69.213161) (xy 126.056375 69.541375)
        (xy 125.728161 70.032582) (xy 125.612908 70.612) (xy 125.692 71.009624) (xy 125.692001 72.815096) (xy 125.496896 72.5725)
        (xy 125.003819 72.302633) (xy 124.921039 72.285096) (xy 124.699 72.407085) (xy 124.699 73.95) (xy 124.719 73.95)
        (xy 124.719 74.204) (xy 124.699 74.204) (xy 124.699 75.746915) (xy 124.921039 75.868904) (xy 125.003819 75.851367)
        (xy 125.496896 75.5815) (xy 125.839501 75.155501) (xy 126.077424 75.511577) (xy 126.552092 75.82874) (xy 127.112 75.940113)
        (xy 127.671909 75.82874) (xy 128.146577 75.511577) (xy 128.382 75.159241) (xy 128.617424 75.511577) (xy 129.092092 75.82874)
        (xy 129.652 75.940113) (xy 130.211909 75.82874) (xy 130.686577 75.511577) (xy 130.922 75.159241) (xy 131.157424 75.511577)
        (xy 131.632092 75.82874) (xy 132.192 75.940113) (xy 132.751909 75.82874) (xy 133.226577 75.511577) (xy 133.54374 75.036909)
        (xy 133.627 74.618332) (xy 133.627 74.278743) (xy 133.642 74.203333) (xy 133.642 74.203329) (xy 133.670112 74.062001)
        (xy 133.642 73.920673) (xy 133.642 71.729456) (xy 133.655157 71.709765) (xy 133.70444 71.462) (xy 133.70444 71.214666)
        (xy 135.566634 69.352473) (xy 135.690625 69.269625) (xy 136.018839 68.778418) (xy 136.105 68.345256) (xy 136.105 68.345255)
        (xy 136.134092 68.199001) (xy 136.105 68.052746) (xy 136.105 59.501065) (xy 136.580582 59.818839) (xy 137.013744 59.905)
        (xy 137.16 59.934092) (xy 137.739418 59.818839) (xy 138.230625 59.490625) (xy 138.43 59.192239) (xy 138.629375 59.490625)
        (xy 139.120582 59.818839) (xy 139.553744 59.905) (xy 139.7 59.934092) (xy 140.279418 59.818839) (xy 140.770625 59.490625)
        (xy 140.782816 59.472381) (xy 140.791843 59.517765) (xy 140.932191 59.727809) (xy 141.142235 59.868157) (xy 141.39 59.91744)
        (xy 142.156285 59.91744) (xy 142.24 59.934092) (xy 142.323716 59.91744) (xy 143.09 59.91744) (xy 143.337765 59.868157)
        (xy 143.547809 59.727809) (xy 143.688157 59.517765) (xy 143.73744 59.27) (xy 143.73744 57.57) (xy 143.725 57.507459)
        (xy 143.725 55.733744) (xy 143.638839 55.300582) (xy 143.637 55.29783) (xy 143.637 55.234412) (xy 143.555944 54.826918)
        (xy 143.247179 54.36482) (xy 142.813433 54.075) (xy 143.205554 54.075)
      )
    )
    (filled_polygon
      (pts
        (xy 101.60882 54.364821) (xy 101.300056 54.826919) (xy 101.219 55.234413) (xy 101.219 55.297831) (xy 101.217161 55.300583)
        (xy 101.131 55.733745) (xy 101.131001 58.27374) (xy 101.101908 58.42) (xy 101.217161 58.999418) (xy 101.545375 59.490625)
        (xy 102.036582 59.818839) (xy 102.469744 59.905) (xy 102.616 59.934092) (xy 103.195418 59.818839) (xy 103.686625 59.490625)
        (xy 103.899843 59.171522) (xy 103.960817 59.301358) (xy 104.389076 59.691645) (xy 104.79911 59.861476) (xy 105.029 59.740155)
        (xy 105.029 58.547) (xy 105.009 58.547) (xy 105.009 58.293) (xy 105.029 58.293) (xy 105.029 56.007)
        (xy 105.009 56.007) (xy 105.009 55.753) (xy 105.029 55.753) (xy 105.029 55.733) (xy 105.283 55.733)
        (xy 105.283 55.753) (xy 105.303 55.753) (xy 105.303 56.007) (xy 105.283 56.007) (xy 105.283 58.293)
        (xy 105.303 58.293) (xy 105.303 58.547) (xy 105.283 58.547) (xy 105.283 59.740155) (xy 105.51289 59.861476)
        (xy 105.922924 59.691645) (xy 106.351183 59.301358) (xy 106.412157 59.171522) (xy 106.625375 59.490625) (xy 107.116582 59.818839)
        (xy 107.549744 59.905) (xy 107.696 59.934092) (xy 108.275418 59.818839) (xy 108.766625 59.490625) (xy 108.966 59.192239)
        (xy 109.165375 59.490625) (xy 109.656582 59.818839) (xy 110.089744 59.905) (xy 110.236 59.934092) (xy 110.815418 59.818839)
        (xy 111.306625 59.490625) (xy 111.506 59.192239) (xy 111.705375 59.490625) (xy 112.196582 59.818839) (xy 112.629744 59.905)
        (xy 112.776 59.934092) (xy 113.355418 59.818839) (xy 113.846625 59.490625) (xy 114.046 59.192239) (xy 114.245375 59.490625)
        (xy 114.736582 59.818839) (xy 115.169744 59.905) (xy 115.316 59.934092) (xy 115.895418 59.818839) (xy 116.386625 59.490625)
        (xy 116.586 59.192239) (xy 116.785375 59.490625) (xy 117.276582 59.818839) (xy 117.709744 59.905) (xy 117.856 59.934092)
        (xy 118.435418 59.818839) (xy 118.926625 59.490625) (xy 118.938816 59.472381) (xy 118.947843 59.517765) (xy 119.088191 59.727809)
        (xy 119.298235 59.868157) (xy 119.546 59.91744) (xy 120.312285 59.91744) (xy 120.396 59.934092) (xy 120.479716 59.91744)
        (xy 121.246 59.91744) (xy 121.493765 59.868157) (xy 121.703809 59.727809) (xy 121.844157 59.517765) (xy 121.89344 59.27)
        (xy 121.89344 57.57) (xy 121.881 57.507459) (xy 121.881 55.733744) (xy 121.794839 55.300582) (xy 121.793 55.29783)
        (xy 121.793 55.234412) (xy 121.711944 54.826918) (xy 121.403179 54.36482) (xy 120.969433 54.075) (xy 123.886566 54.075)
        (xy 123.45282 54.364821) (xy 123.144056 54.826919) (xy 123.063 55.234413) (xy 123.063 55.297831) (xy 123.061161 55.300583)
        (xy 122.975 55.733745) (xy 122.975001 58.27374) (xy 122.945908 58.42) (xy 123.061161 58.999418) (xy 123.389375 59.490625)
        (xy 123.880582 59.818839) (xy 124.313744 59.905) (xy 124.46 59.934092) (xy 125.039418 59.818839) (xy 125.530625 59.490625)
        (xy 125.73 59.192239) (xy 125.929375 59.490625) (xy 126.420582 59.818839) (xy 126.853744 59.905) (xy 127 59.934092)
        (xy 127.579418 59.818839) (xy 128.055001 59.501065) (xy 128.055 64.944893) (xy 127.384894 65.615) (xy 119.423175 65.615)
        (xy 119.276919 65.585908) (xy 119.130663 65.615) (xy 118.697501 65.701161) (xy 118.206294 66.029375) (xy 118.123446 66.153366)
        (xy 116.020367 68.256446) (xy 115.896376 68.339294) (xy 115.568161 68.830501) (xy 115.482677 69.26026) (xy 115.452908 69.409919)
        (xy 115.482 69.556174) (xy 115.482 70.465744) (xy 115.452908 70.612) (xy 115.532 71.009624) (xy 115.532001 72.77027)
        (xy 115.446576 72.642423) (xy 114.971908 72.32526) (xy 114.412 72.213887) (xy 113.852091 72.32526) (xy 113.377423 72.642424)
        (xy 113.06026 73.117092) (xy 112.977 73.535668) (xy 112.977 73.679381) (xy 112.927001 73.930744) (xy 112.927 76.361893)
        (xy 109.797367 79.491527) (xy 109.673376 79.574375) (xy 109.425559 79.94526) (xy 109.345162 80.065582) (xy 109.229908 80.645)
        (xy 109.259001 80.791259) (xy 109.259 86.357745) (xy 109.229908 86.504) (xy 109.259 86.650255) (xy 109.345161 87.083417)
        (xy 109.673375 87.574625) (xy 109.797369 87.657475) (xy 115.355001 93.215108) (xy 115.355001 93.367322) (xy 115.337561 93.454999)
        (xy 115.337561 95.154999) (xy 115.355001 95.242675) (xy 115.355001 97.017324) (xy 115.337561 97.104999) (xy 115.337561 98.804999)
        (xy 115.355 98.892673) (xy 115.355 100.518935) (xy 114.879418 100.201161) (xy 114.446256 100.115) (xy 114.3 100.085908)
        (xy 114.153744 100.115) (xy 113.720582 100.201161) (xy 113.229375 100.529375) (xy 113.217184 100.547619) (xy 113.208157 100.502235)
        (xy 113.067809 100.292191) (xy 112.857765 100.151843) (xy 112.61 100.10256) (xy 111.843715 100.10256) (xy 111.76 100.085908)
        (xy 111.676284 100.10256) (xy 110.91 100.10256) (xy 110.662235 100.151843) (xy 110.452191 100.292191) (xy 110.311843 100.502235)
        (xy 110.26256 100.75) (xy 110.26256 102.45) (xy 110.275 102.512543) (xy 110.275001 104.286256) (xy 110.361162 104.719418)
        (xy 110.363 104.722169) (xy 110.363 104.785588) (xy 110.444056 105.193082) (xy 110.752821 105.65518) (xy 111.186567 105.945)
        (xy 101.065 105.945) (xy 101.065 54.075) (xy 102.042566 54.075)
      )
    )
  )
)
