EESchema Schematic File Version 4
EELAYER 26 0
EELAYER END
$Descr A4 11693 8268
encoding utf-8
Sheet 1 1
Title ""
Date ""
Rev ""
Comp ""
Comment1 ""
Comment2 ""
Comment3 ""
Comment4 ""
$EndDescr
$Comp
L Device:Q_NPN_BCEC Q?
U 1 1 5C694E06
P 2000 2100
F 0 "Q?" H 2288 2146 50  0000 L CNN
F 1 "MJD31 DPAK" H 2288 2055 50  0000 L CNN
F 2 "TO_SOT_Packages_SMD:TO-252-3_TabPin4" H 2200 2200 50  0001 C CNN
F 3 "~" H 2000 2100 50  0001 C CNN
	1    2000 2100
	1    0    0    -1  
$EndComp
$Comp
L Device:Q_PNP_BCEC Q?
U 1 1 5C694EAA
P 2000 1400
F 0 "Q?" H 2288 1354 50  0000 L CNN
F 1 "MJD32 DPAK" H 2288 1445 50  0000 L CNN
F 2 "TO_SOT_Packages_SMD:TO-252-3_TabPin4" H 2200 1500 50  0001 C CNN
F 3 "~" H 2000 1400 50  0001 C CNN
	1    2000 1400
	1    0    0    1   
$EndComp
NoConn ~ 2100 1600
NoConn ~ 2100 1900
$Comp
L Transistor_BJT:BC847 Q?
U 1 1 5C694FA8
P 1600 1700
F 0 "Q?" H 1791 1746 50  0000 L CNN
F 1 "BC847" H 1791 1655 50  0000 L CNN
F 2 "Package_TO_SOT_SMD:SOT-23" H 1800 1625 50  0001 L CIN
F 3 "http://www.infineon.com/dgdl/Infineon-BC847SERIES_BC848SERIES_BC849SERIES_BC850SERIES-DS-v01_01-en.pdf?fileId=db3a304314dca389011541d4630a1657" H 1600 1700 50  0001 L CNN
	1    1600 1700
	1    0    0    -1  
$EndComp
$Comp
L Transistor_BJT:BC847 Q?
U 1 1 5C694FF9
P 1600 2400
F 0 "Q?" H 1791 2446 50  0000 L CNN
F 1 "BC847" H 1791 2355 50  0000 L CNN
F 2 "Package_TO_SOT_SMD:SOT-23" H 1800 2325 50  0001 L CIN
F 3 "http://www.infineon.com/dgdl/Infineon-BC847SERIES_BC848SERIES_BC849SERIES_BC850SERIES-DS-v01_01-en.pdf?fileId=db3a304314dca389011541d4630a1657" H 1600 2400 50  0001 L CNN
	1    1600 2400
	1    0    0    -1  
$EndComp
Wire Wire Line
	1700 2200 1700 2100
Wire Wire Line
	1700 2100 1800 2100
Wire Wire Line
	1700 1500 1700 1400
Wire Wire Line
	1700 1400 1800 1400
Wire Wire Line
	2200 1600 2200 1750
Wire Wire Line
	1700 2600 1700 2700
Wire Wire Line
	1700 2700 2100 2700
Wire Wire Line
	2100 2700 2100 2300
$Comp
L Device:R_Small R?
U 1 1 5C695277
P 1900 1100
F 0 "R?" V 1704 1100 50  0000 C CNN
F 1 "R_Small" V 1795 1100 50  0000 C CNN
F 2 "Resistors_SMD:R_1210_HandSoldering" H 1900 1100 50  0001 C CNN
F 3 "~" H 1900 1100 50  0001 C CNN
	1    1900 1100
	0    1    1    0   
$EndComp
$Comp
L Device:R_Small R?
U 1 1 5C6952CD
P 1200 2400
F 0 "R?" V 1004 2400 50  0000 C CNN
F 1 "R_Small" V 1095 2400 50  0000 C CNN
F 2 "Resistors_SMD:R_1210_HandSoldering" H 1200 2400 50  0001 C CNN
F 3 "~" H 1200 2400 50  0001 C CNN
	1    1200 2400
	0    1    1    0   
$EndComp
$Comp
L Device:R_Small R?
U 1 1 5C69530B
P 1500 2100
F 0 "R?" V 1304 2100 50  0000 C CNN
F 1 "R_Small" V 1395 2100 50  0000 C CNN
F 2 "Resistors_SMD:R_1210_HandSoldering" H 1500 2100 50  0001 C CNN
F 3 "~" H 1500 2100 50  0001 C CNN
	1    1500 2100
	0    1    1    0   
$EndComp
Wire Wire Line
	1400 2400 1300 2400
Wire Wire Line
	1600 2100 1700 2100
Connection ~ 1700 2100
Wire Wire Line
	1100 2400 1000 2400
Wire Wire Line
	1000 2400 1000 2150
Wire Wire Line
	1000 2150 1500 2150
Wire Wire Line
	1500 2150 1500 2050
Wire Wire Line
	1500 2050 1700 2050
Wire Wire Line
	1700 2050 1700 1900
Wire Wire Line
	1700 1400 1700 1100
Wire Wire Line
	1700 1100 1800 1100
Connection ~ 1700 1400
Wire Wire Line
	2000 1100 2100 1100
Wire Wire Line
	2100 1100 2100 1200
$Comp
L Device:Q_NPN_BCEC Q?
U 1 1 5C6965BF
P 3650 2100
F 0 "Q?" H 3938 2146 50  0000 L CNN
F 1 "MJD31 DPAK" H 3938 2055 50  0000 L CNN
F 2 "TO_SOT_Packages_SMD:TO-252-3_TabPin4" H 3850 2200 50  0001 C CNN
F 3 "~" H 3650 2100 50  0001 C CNN
	1    3650 2100
	-1   0    0    -1  
$EndComp
$Comp
L Device:Q_PNP_BCEC Q?
U 1 1 5C6965C5
P 3650 1400
F 0 "Q?" H 3938 1354 50  0000 L CNN
F 1 "MJD32 DPAK" H 3938 1445 50  0000 L CNN
F 2 "TO_SOT_Packages_SMD:TO-252-3_TabPin4" H 3850 1500 50  0001 C CNN
F 3 "~" H 3650 1400 50  0001 C CNN
	1    3650 1400
	-1   0    0    1   
$EndComp
NoConn ~ 3550 1600
NoConn ~ 3550 1900
$Comp
L Transistor_BJT:BC847 Q?
U 1 1 5C6965D3
P 4050 2400
F 0 "Q?" H 4241 2446 50  0000 L CNN
F 1 "BC847" H 4241 2355 50  0000 L CNN
F 2 "Package_TO_SOT_SMD:SOT-23" H 4250 2325 50  0001 L CIN
F 3 "http://www.infineon.com/dgdl/Infineon-BC847SERIES_BC848SERIES_BC849SERIES_BC850SERIES-DS-v01_01-en.pdf?fileId=db3a304314dca389011541d4630a1657" H 4050 2400 50  0001 L CNN
	1    4050 2400
	-1   0    0    -1  
$EndComp
Wire Wire Line
	3950 2200 3950 2100
Wire Wire Line
	3950 2100 3850 2100
Wire Wire Line
	3950 1500 3950 1400
Wire Wire Line
	3950 1400 3850 1400
Wire Wire Line
	3450 1600 3450 1750
Wire Wire Line
	3950 2600 3950 2700
Wire Wire Line
	3950 2700 3550 2700
Wire Wire Line
	3550 2700 3550 2300
$Comp
L Device:R_Small R?
U 1 1 5C6965E1
P 3750 1100
F 0 "R?" V 3554 1100 50  0000 C CNN
F 1 "R_Small" V 3645 1100 50  0000 C CNN
F 2 "Resistors_SMD:R_1210_HandSoldering" H 3750 1100 50  0001 C CNN
F 3 "~" H 3750 1100 50  0001 C CNN
	1    3750 1100
	0    -1   1    0   
$EndComp
$Comp
L Device:R_Small R?
U 1 1 5C6965E7
P 4450 2400
F 0 "R?" V 4254 2400 50  0000 C CNN
F 1 "R_Small" V 4345 2400 50  0000 C CNN
F 2 "Resistors_SMD:R_1210_HandSoldering" H 4450 2400 50  0001 C CNN
F 3 "~" H 4450 2400 50  0001 C CNN
	1    4450 2400
	0    -1   1    0   
$EndComp
$Comp
L Device:R_Small R?
U 1 1 5C6965ED
P 4150 2100
F 0 "R?" V 3954 2100 50  0000 C CNN
F 1 "R_Small" V 4045 2100 50  0000 C CNN
F 2 "Resistors_SMD:R_1210_HandSoldering" H 4150 2100 50  0001 C CNN
F 3 "~" H 4150 2100 50  0001 C CNN
	1    4150 2100
	0    -1   1    0   
$EndComp
Wire Wire Line
	4250 2400 4350 2400
Wire Wire Line
	4050 2100 3950 2100
Connection ~ 3950 2100
Wire Wire Line
	4550 2400 4650 2400
Wire Wire Line
	4650 2400 4650 2150
Wire Wire Line
	4650 2150 4150 2150
Wire Wire Line
	4150 2150 4150 2050
Wire Wire Line
	4150 2050 3950 2050
Wire Wire Line
	3950 2050 3950 1900
Wire Wire Line
	3950 1400 3950 1100
Wire Wire Line
	3950 1100 3850 1100
Connection ~ 3950 1400
Wire Wire Line
	3650 1100 3550 1100
Wire Wire Line
	3550 1100 3550 1200
Wire Wire Line
	2100 1100 2850 1100
Connection ~ 2100 1100
Connection ~ 3550 1100
Connection ~ 3550 2700
Connection ~ 2100 2700
$Comp
L power:GNDPWR #PWR?
U 1 1 5C69940A
P 2850 2850
F 0 "#PWR?" H 2850 2650 50  0001 C CNN
F 1 "GNDPWR" H 2854 2696 50  0000 C CNN
F 2 "" H 2850 2800 50  0001 C CNN
F 3 "" H 2850 2800 50  0001 C CNN
	1    2850 2850
	1    0    0    -1  
$EndComp
$Comp
L power:VCC #PWR?
U 1 1 5C69945D
P 2850 1000
F 0 "#PWR?" H 2850 850 50  0001 C CNN
F 1 "VCC" H 2867 1173 50  0000 C CNN
F 2 "" H 2850 1000 50  0001 C CNN
F 3 "" H 2850 1000 50  0001 C CNN
	1    2850 1000
	1    0    0    -1  
$EndComp
Wire Wire Line
	2850 1000 2850 1100
Connection ~ 2850 1100
Wire Wire Line
	2850 1100 3550 1100
Wire Wire Line
	4250 1700 4350 1700
Wire Wire Line
	1400 1700 1300 1700
Text GLabel 1300 1700 0    50   Input ~ 0
A1
$Comp
L Transistor_BJT:BC847 Q?
U 1 1 5C6965CD
P 4050 1700
F 0 "Q?" H 4241 1746 50  0000 L CNN
F 1 "BC847" H 4241 1655 50  0000 L CNN
F 2 "Package_TO_SOT_SMD:SOT-23" H 4250 1625 50  0001 L CIN
F 3 "http://www.infineon.com/dgdl/Infineon-BC847SERIES_BC848SERIES_BC849SERIES_BC850SERIES-DS-v01_01-en.pdf?fileId=db3a304314dca389011541d4630a1657" H 4050 1700 50  0001 L CNN
	1    4050 1700
	-1   0    0    -1  
$EndComp
Text GLabel 4350 1700 2    50   Input ~ 0
B1
Wire Wire Line
	2200 1750 2300 1750
Connection ~ 2200 1750
Wire Wire Line
	2200 1750 2200 1900
Wire Wire Line
	3450 1750 3350 1750
Connection ~ 3450 1750
Wire Wire Line
	3450 1750 3450 1900
Text GLabel 2300 1750 2    50   Input ~ 0
Ma1
Text GLabel 3350 1750 0    50   Input ~ 0
Mb1
Wire Wire Line
	1000 2400 1000 2750
Wire Wire Line
	1000 2750 4700 2750
Wire Wire Line
	4700 2750 4700 2100
Wire Wire Line
	4700 2100 4250 2100
Connection ~ 1000 2400
Wire Wire Line
	1400 2100 950  2100
Wire Wire Line
	950  2100 950  2800
Wire Wire Line
	4650 2800 4650 2400
Connection ~ 4650 2400
Wire Wire Line
	950  2800 4650 2800
Wire Wire Line
	2100 2700 2850 2700
Wire Wire Line
	2850 2850 2850 2700
Connection ~ 2850 2700
Wire Wire Line
	2850 2700 3550 2700
$Comp
L Device:Q_NPN_BCEC Q?
U 1 1 5C6A2038
P 2000 4650
F 0 "Q?" H 2288 4696 50  0000 L CNN
F 1 "MJD31 DPAK" H 2288 4605 50  0000 L CNN
F 2 "TO_SOT_Packages_SMD:TO-252-3_TabPin4" H 2200 4750 50  0001 C CNN
F 3 "~" H 2000 4650 50  0001 C CNN
	1    2000 4650
	1    0    0    -1  
$EndComp
$Comp
L Device:Q_PNP_BCEC Q?
U 1 1 5C6A203E
P 2000 3950
F 0 "Q?" H 2288 3904 50  0000 L CNN
F 1 "MJD32 DPAK" H 2288 3995 50  0000 L CNN
F 2 "TO_SOT_Packages_SMD:TO-252-3_TabPin4" H 2200 4050 50  0001 C CNN
F 3 "~" H 2000 3950 50  0001 C CNN
	1    2000 3950
	1    0    0    1   
$EndComp
NoConn ~ 2100 4150
NoConn ~ 2100 4450
$Comp
L Transistor_BJT:BC847 Q?
U 1 1 5C6A2046
P 1600 4250
F 0 "Q?" H 1791 4296 50  0000 L CNN
F 1 "BC847" H 1791 4205 50  0000 L CNN
F 2 "Package_TO_SOT_SMD:SOT-23" H 1800 4175 50  0001 L CIN
F 3 "http://www.infineon.com/dgdl/Infineon-BC847SERIES_BC848SERIES_BC849SERIES_BC850SERIES-DS-v01_01-en.pdf?fileId=db3a304314dca389011541d4630a1657" H 1600 4250 50  0001 L CNN
	1    1600 4250
	1    0    0    -1  
$EndComp
$Comp
L Transistor_BJT:BC847 Q?
U 1 1 5C6A204C
P 1600 4950
F 0 "Q?" H 1791 4996 50  0000 L CNN
F 1 "BC847" H 1791 4905 50  0000 L CNN
F 2 "Package_TO_SOT_SMD:SOT-23" H 1800 4875 50  0001 L CIN
F 3 "http://www.infineon.com/dgdl/Infineon-BC847SERIES_BC848SERIES_BC849SERIES_BC850SERIES-DS-v01_01-en.pdf?fileId=db3a304314dca389011541d4630a1657" H 1600 4950 50  0001 L CNN
	1    1600 4950
	1    0    0    -1  
$EndComp
Wire Wire Line
	1700 4750 1700 4650
Wire Wire Line
	1700 4650 1800 4650
Wire Wire Line
	1700 4050 1700 3950
Wire Wire Line
	1700 3950 1800 3950
Wire Wire Line
	2200 4150 2200 4300
Wire Wire Line
	1700 5150 1700 5250
Wire Wire Line
	1700 5250 2100 5250
Wire Wire Line
	2100 5250 2100 4850
$Comp
L Device:R_Small R?
U 1 1 5C6A205A
P 1900 3650
F 0 "R?" V 1704 3650 50  0000 C CNN
F 1 "R_Small" V 1795 3650 50  0000 C CNN
F 2 "Resistors_SMD:R_1210_HandSoldering" H 1900 3650 50  0001 C CNN
F 3 "~" H 1900 3650 50  0001 C CNN
	1    1900 3650
	0    1    1    0   
$EndComp
$Comp
L Device:R_Small R?
U 1 1 5C6A2060
P 1200 4950
F 0 "R?" V 1004 4950 50  0000 C CNN
F 1 "R_Small" V 1095 4950 50  0000 C CNN
F 2 "Resistors_SMD:R_1210_HandSoldering" H 1200 4950 50  0001 C CNN
F 3 "~" H 1200 4950 50  0001 C CNN
	1    1200 4950
	0    1    1    0   
$EndComp
$Comp
L Device:R_Small R?
U 1 1 5C6A2066
P 1500 4650
F 0 "R?" V 1304 4650 50  0000 C CNN
F 1 "R_Small" V 1395 4650 50  0000 C CNN
F 2 "Resistors_SMD:R_1210_HandSoldering" H 1500 4650 50  0001 C CNN
F 3 "~" H 1500 4650 50  0001 C CNN
	1    1500 4650
	0    1    1    0   
$EndComp
Wire Wire Line
	1400 4950 1300 4950
Wire Wire Line
	1600 4650 1700 4650
Connection ~ 1700 4650
Wire Wire Line
	1100 4950 1000 4950
Wire Wire Line
	1000 4950 1000 4700
Wire Wire Line
	1000 4700 1500 4700
Wire Wire Line
	1500 4700 1500 4600
Wire Wire Line
	1500 4600 1700 4600
Wire Wire Line
	1700 4600 1700 4450
Wire Wire Line
	1700 3950 1700 3650
Wire Wire Line
	1700 3650 1800 3650
Connection ~ 1700 3950
Wire Wire Line
	2000 3650 2100 3650
Wire Wire Line
	2100 3650 2100 3750
$Comp
L Device:Q_NPN_BCEC Q?
U 1 1 5C6A207A
P 3650 4650
F 0 "Q?" H 3938 4696 50  0000 L CNN
F 1 "MJD31 DPAK" H 3938 4605 50  0000 L CNN
F 2 "TO_SOT_Packages_SMD:TO-252-3_TabPin4" H 3850 4750 50  0001 C CNN
F 3 "~" H 3650 4650 50  0001 C CNN
	1    3650 4650
	-1   0    0    -1  
$EndComp
$Comp
L Device:Q_PNP_BCEC Q?
U 1 1 5C6A2080
P 3650 3950
F 0 "Q?" H 3938 3904 50  0000 L CNN
F 1 "MJD32 DPAK" H 3938 3995 50  0000 L CNN
F 2 "TO_SOT_Packages_SMD:TO-252-3_TabPin4" H 3850 4050 50  0001 C CNN
F 3 "~" H 3650 3950 50  0001 C CNN
	1    3650 3950
	-1   0    0    1   
$EndComp
NoConn ~ 3550 4150
NoConn ~ 3550 4450
$Comp
L Transistor_BJT:BC847 Q?
U 1 1 5C6A2088
P 4050 4950
F 0 "Q?" H 4241 4996 50  0000 L CNN
F 1 "BC847" H 4241 4905 50  0000 L CNN
F 2 "Package_TO_SOT_SMD:SOT-23" H 4250 4875 50  0001 L CIN
F 3 "http://www.infineon.com/dgdl/Infineon-BC847SERIES_BC848SERIES_BC849SERIES_BC850SERIES-DS-v01_01-en.pdf?fileId=db3a304314dca389011541d4630a1657" H 4050 4950 50  0001 L CNN
	1    4050 4950
	-1   0    0    -1  
$EndComp
Wire Wire Line
	3950 4750 3950 4650
Wire Wire Line
	3950 4650 3850 4650
Wire Wire Line
	3950 4050 3950 3950
Wire Wire Line
	3950 3950 3850 3950
Wire Wire Line
	3450 4150 3450 4300
Wire Wire Line
	3950 5150 3950 5250
Wire Wire Line
	3950 5250 3550 5250
Wire Wire Line
	3550 5250 3550 4850
$Comp
L Device:R_Small R?
U 1 1 5C6A2096
P 3750 3650
F 0 "R?" V 3554 3650 50  0000 C CNN
F 1 "R_Small" V 3645 3650 50  0000 C CNN
F 2 "Resistors_SMD:R_1210_HandSoldering" H 3750 3650 50  0001 C CNN
F 3 "~" H 3750 3650 50  0001 C CNN
	1    3750 3650
	0    -1   1    0   
$EndComp
$Comp
L Device:R_Small R?
U 1 1 5C6A209C
P 4450 4950
F 0 "R?" V 4254 4950 50  0000 C CNN
F 1 "R_Small" V 4345 4950 50  0000 C CNN
F 2 "Resistors_SMD:R_1210_HandSoldering" H 4450 4950 50  0001 C CNN
F 3 "~" H 4450 4950 50  0001 C CNN
	1    4450 4950
	0    -1   1    0   
$EndComp
$Comp
L Device:R_Small R?
U 1 1 5C6A20A2
P 4150 4650
F 0 "R?" V 3954 4650 50  0000 C CNN
F 1 "R_Small" V 4045 4650 50  0000 C CNN
F 2 "Resistors_SMD:R_1210_HandSoldering" H 4150 4650 50  0001 C CNN
F 3 "~" H 4150 4650 50  0001 C CNN
	1    4150 4650
	0    -1   1    0   
$EndComp
Wire Wire Line
	4250 4950 4350 4950
Wire Wire Line
	4050 4650 3950 4650
Connection ~ 3950 4650
Wire Wire Line
	4550 4950 4650 4950
Wire Wire Line
	4650 4950 4650 4700
Wire Wire Line
	4650 4700 4150 4700
Wire Wire Line
	4150 4700 4150 4600
Wire Wire Line
	4150 4600 3950 4600
Wire Wire Line
	3950 4600 3950 4450
Wire Wire Line
	3950 3950 3950 3650
Wire Wire Line
	3950 3650 3850 3650
Connection ~ 3950 3950
Wire Wire Line
	3650 3650 3550 3650
Wire Wire Line
	3550 3650 3550 3750
Wire Wire Line
	2100 3650 2850 3650
Connection ~ 2100 3650
Connection ~ 3550 3650
Connection ~ 3550 5250
Connection ~ 2100 5250
$Comp
L power:GNDPWR #PWR?
U 1 1 5C6A20BB
P 2850 5400
F 0 "#PWR?" H 2850 5200 50  0001 C CNN
F 1 "GNDPWR" H 2854 5246 50  0000 C CNN
F 2 "" H 2850 5350 50  0001 C CNN
F 3 "" H 2850 5350 50  0001 C CNN
	1    2850 5400
	1    0    0    -1  
$EndComp
$Comp
L power:VCC #PWR?
U 1 1 5C6A20C1
P 2850 3550
F 0 "#PWR?" H 2850 3400 50  0001 C CNN
F 1 "VCC" H 2867 3723 50  0000 C CNN
F 2 "" H 2850 3550 50  0001 C CNN
F 3 "" H 2850 3550 50  0001 C CNN
	1    2850 3550
	1    0    0    -1  
$EndComp
Wire Wire Line
	2850 3550 2850 3650
Connection ~ 2850 3650
Wire Wire Line
	2850 3650 3550 3650
Wire Wire Line
	4250 4250 4350 4250
Wire Wire Line
	1400 4250 1300 4250
Text GLabel 1300 4250 0    50   Input ~ 0
A2
$Comp
L Transistor_BJT:BC847 Q?
U 1 1 5C6A20CD
P 4050 4250
F 0 "Q?" H 4241 4296 50  0000 L CNN
F 1 "BC847" H 4241 4205 50  0000 L CNN
F 2 "Package_TO_SOT_SMD:SOT-23" H 4250 4175 50  0001 L CIN
F 3 "http://www.infineon.com/dgdl/Infineon-BC847SERIES_BC848SERIES_BC849SERIES_BC850SERIES-DS-v01_01-en.pdf?fileId=db3a304314dca389011541d4630a1657" H 4050 4250 50  0001 L CNN
	1    4050 4250
	-1   0    0    -1  
$EndComp
Text GLabel 4350 4250 2    50   Input ~ 0
B2
Wire Wire Line
	2200 4300 2300 4300
Connection ~ 2200 4300
Wire Wire Line
	2200 4300 2200 4450
Wire Wire Line
	3450 4300 3350 4300
Connection ~ 3450 4300
Wire Wire Line
	3450 4300 3450 4450
Text GLabel 2300 4300 2    50   Input ~ 0
Ma2
Text GLabel 3350 4300 0    50   Input ~ 0
Mb2
Wire Wire Line
	1000 4950 1000 5300
Wire Wire Line
	1000 5300 4700 5300
Wire Wire Line
	4700 5300 4700 4650
Wire Wire Line
	4700 4650 4250 4650
Connection ~ 1000 4950
Wire Wire Line
	1400 4650 950  4650
Wire Wire Line
	950  4650 950  5350
Wire Wire Line
	4650 5350 4650 4950
Connection ~ 4650 4950
Wire Wire Line
	950  5350 4650 5350
Wire Wire Line
	2100 5250 2850 5250
Wire Wire Line
	2850 5400 2850 5250
Connection ~ 2850 5250
Wire Wire Line
	2850 5250 3550 5250
$EndSCHEMATC
