Version 4
SHEET 1 2140 680
WIRE 1120 -368 1120 -400
WIRE 1216 -368 1216 -400
WIRE 1312 -368 1312 -400
WIRE 1120 -272 1120 -288
WIRE 1216 -272 1216 -288
WIRE 1216 -272 1120 -272
WIRE 1312 -272 1312 -288
WIRE 1312 -272 1216 -272
WIRE 1120 -256 1120 -272
WIRE 336 -160 208 -160
WIRE 496 -160 496 -192
WIRE 496 -160 336 -160
WIRE 656 -160 496 -160
WIRE 784 -160 656 -160
WIRE 208 -144 208 -160
WIRE 784 -144 784 -160
WIRE 336 -96 336 -160
WIRE 656 -96 656 -160
WIRE 208 -48 208 -64
WIRE 272 -48 208 -48
WIRE 784 -48 784 -64
WIRE 784 -48 720 -48
WIRE 208 16 208 -48
WIRE 784 16 784 -48
WIRE 336 64 336 0
WIRE 400 64 336 64
WIRE 512 64 480 64
WIRE 656 64 656 0
WIRE 656 64 592 64
WIRE 160 80 128 80
WIRE 864 80 832 80
WIRE 336 128 336 64
WIRE 656 128 656 64
WIRE 208 144 208 112
WIRE 208 144 144 144
WIRE 784 144 784 112
WIRE 848 144 784 144
WIRE 112 176 -16 176
WIRE 208 176 192 176
WIRE 272 176 208 176
WIRE 784 176 720 176
WIRE 800 176 784 176
WIRE 1008 176 880 176
WIRE 144 224 144 144
WIRE 144 224 16 224
WIRE 848 224 848 144
WIRE 976 224 848 224
WIRE 208 240 208 176
WIRE 784 240 784 176
WIRE 16 288 16 224
WIRE 48 288 16 288
WIRE 144 288 128 288
WIRE 864 288 848 288
WIRE 976 288 976 224
WIRE 976 288 944 288
WIRE 144 304 144 288
WIRE 160 304 144 304
WIRE 848 304 848 288
WIRE 848 304 832 304
WIRE 336 336 336 224
WIRE 336 336 208 336
WIRE 496 336 336 336
WIRE 656 336 656 224
WIRE 656 336 496 336
WIRE 784 336 656 336
WIRE 16 368 16 288
WIRE 1008 368 1008 176
WIRE 1008 368 16 368
WIRE -16 400 -16 176
WIRE 976 400 976 288
WIRE 976 400 -16 400
WIRE 496 432 496 336
FLAG 128 80 A
FLAG 864 80 B
FLAG 496 432 0
FLAG 496 -192 Vcc
FLAG 1120 -400 Vcc
FLAG 1120 -256 0
FLAG 1216 -400 A
FLAG 1312 -400 B
SYMBOL pnp 720 0 R180
SYMATTR InstName Q1
SYMATTR Value MJD32T4
SYMBOL npn 720 128 M0
SYMATTR InstName Q3
SYMATTR Value MJD31T4
SYMBOL npn 272 128 R0
SYMATTR InstName Q6
SYMATTR Value MJD31T4
SYMBOL res 768 -160 R0
SYMATTR InstName R1
SYMATTR Value 1k
SYMBOL res 896 160 R90
WINDOW 0 0 56 VBottom 2
WINDOW 3 32 56 VTop 2
SYMATTR InstName R2
SYMATTR Value 47
SYMBOL res 960 272 R90
WINDOW 0 0 56 VBottom 2
WINDOW 3 32 56 VTop 2
SYMATTR InstName R3
SYMATTR Value 1k
SYMBOL res 144 272 R90
WINDOW 0 0 56 VBottom 2
WINDOW 3 32 56 VTop 2
SYMATTR InstName R4
SYMATTR Value 1k
SYMBOL res 208 160 R90
WINDOW 0 0 56 VBottom 2
WINDOW 3 32 56 VTop 2
SYMATTR InstName R5
SYMATTR Value 47
SYMBOL res 224 -48 R180
WINDOW 0 36 76 Left 2
WINDOW 3 36 40 Left 2
SYMATTR InstName R6
SYMATTR Value 1k
SYMBOL res 496 48 R90
WINDOW 0 0 56 VBottom 2
WINDOW 3 32 56 VTop 2
SYMATTR InstName R7
SYMATTR Value 10
SYMBOL ind 608 48 R90
WINDOW 0 5 56 VBottom 2
WINDOW 3 32 56 VTop 2
SYMATTR InstName L1
SYMATTR Value 10m
SYMBOL voltage 1120 -384 R0
WINDOW 123 0 0 Left 0
WINDOW 39 0 0 Left 0
SYMATTR InstName V1
SYMATTR Value 6
SYMBOL voltage 1216 -384 R0
SYMATTR InstName V2
SYMATTR Value 0
SYMBOL voltage 1312 -384 R0
WINDOW 123 0 0 Left 0
WINDOW 39 0 0 Left 0
SYMATTR InstName V3
SYMATTR Value PULSE(0 3.3 0.01 1e-10 1e-10 0.01 0.02 1e10)
SYMBOL pnp 272 0 M180
SYMATTR InstName Q8
SYMATTR Value MJD32T4
SYMBOL njf 832 16 M0
SYMATTR InstName J1
SYMATTR Value MMBFJ310
SYMBOL njf 832 240 M0
SYMATTR InstName J2
SYMATTR Value MMBFJ310
SYMBOL njf 160 16 R0
SYMATTR InstName J3
SYMATTR Value MMBFJ310
SYMBOL njf 160 240 R0
SYMATTR InstName J4
SYMATTR Value MMBFJ310
TEXT -16 456 Left 2 !.tran 0.1 startup
TEXT 1256 88 Left 2 !.lib MJD31T4.SP3\n.lib MJD32T4.SP3
TEXT 1256 144 Left 2 !.lib MMBFJ310.lib
