[
  {
    "id": 1,
    "name": "Corsair 8GB DDR4",
    "category": "hardwares",
    "status": true,
    "createdAt": "2021-01-01T00:00:00.000Z"
  },
  {
    "id": 3,
    "name": "Corsair 4GB DDR3",
    "category": "hardwares",
    "status": true,
    "createdAt": "2021-01-01T00:00:00.000Z"
  },
  {
    "id": 5,
    "name": "i5-7500x",
    "category": "processors",
    "status": true,
    "createdAt": "2021-01-01T00:00:00.000Z"
  },
  {
    "id": 7,
    "name": "SSD",
    "category": "storage",
    "status": true,
    "createdAt": "2020-09-15T03:16:02.042Z"
  },
  {
    "id": 8,
    "name": "Ryzen 5 3500U",
    "category": "processors",
    "status": true,
    "createdAt": "2020-09-15T03:34:49.265Z"
  },
  {
    "id": 9,
    "name": "HDD 1Tb",
    "category": "storage",
    "status": true,
    "createdAt": "2020-09-15T03:36:01.353Z"
  },
  {
    "id": 10,
    "name": "PC",
    "category": "cpu",
    "status": true,
    "createdAt": "2020-09-15T04:28:38.567Z"
  }
]