{
  "id": "banner_with_cta",
  "type": "SharedSlice",
  "name": "BannerWithCta",
  "description": "BannerWithCta",
  "variations": [
    {
      "id": "default",
      "name": "Default",
      "docURL": "...",
      "version": "sktwi1xtmkfgx8626",
      "description": "BannerWithCta",
      "primary": {
        "title": {
          "type": "StructuredText",
          "config": {
            "label": "Title",
            "placeholder": "This is where it all begins...",
            "allowTargetBlank": true,
            "single": "heading1,heading2"
          }
        },
        "description": {
          "type": "StructuredText",
          "config": {
            "single": "paragraph",
            "label": "Description",
            "placeholder": "A nice description of your feature"
          }
        },
        "calltoaction": {
          "type": "Link",
          "config": {
            "label": "CallToAction",
            "placeholder": "",
            "select": null
          }
        },
        "labellink": {
          "type": "Text",
          "config": {
            "label": "labelLink",
            "placeholder": ""
          }
        }
      },
      "items": {},
      "imageUrl": "https://images.prismic.io/slice-machine/621a5ec4-0387-4bc5-9860-2dd46cbc07cd_default_ss.png?auto=compress,format"
    },
    {
      "id": "withImage",
      "name": "WithImage",
      "docURL": "...",
      "version": "sktwi1xtmkfgx8626",
      "description": "BannerWithCta",
      "primary": {
        "title": {
          "type": "StructuredText",
          "config": {
            "label": "Title",
            "placeholder": "This is where it all begins...",
            "allowTargetBlank": true,
            "single": "heading1,heading2"
          }
        },
        "description": {
          "type": "StructuredText",
          "config": {
            "single": "paragraph",
            "label": "Description",
            "placeholder": "A nice description of your feature"
          }
        },
        "calltoaction": {
          "type": "Link",
          "config": {
            "label": "CallToAction",
            "placeholder": "",
            "select": null
          }
        },
        "labellink": {
          "type": "Text",
          "config": {
            "label": "labelLink",
            "placeholder": ""
          }
        },
        "image": {
          "type": "Image",
          "config": {
            "label": "image",
            "constraint": {},
            "thumbnails": []
          }
        }
      },
      "items": {},
      "imageUrl": "https://images.prismic.io/slice-machine/621a5ec4-0387-4bc5-9860-2dd46cbc07cd_default_ss.png?auto=compress,format"
    }
  ]
}