// =============================================================================
// Scilab ( https://www.scilab.org/ ) - This file is part of Scilab
// Copyright (C) 2016 - Scilab Enterprises
//
//  This file is distributed under the same license as the Scilab package.
// =============================================================================
// <-- Non-regression test for bug 14568 -->
//
// <-- GitLab URL -->
// https://gitlab.com/scilab/scilab/-/issues/14568
//
// <-- Short Description -->
// strtod() fails in some locale conditions
// No way to set locale for the current test => run another test with a modified locale
setenv("LC_ALL", "fr_FR.UTF-8");
status = test_run("string", "bug_14568_test", ["no_check_error_output", "no_check_ref", "short_summary"]);
   001/001 - [string] bug_14568_test............................passed
   --------------------------------------------------------------------------
   Tests:    1,    Passed:    1,    Failed:    0,    Skipped:    0
   --------------------------------------------------------------------------
assert_checktrue(status);
