// =============================================================================
// Scilab ( https://www.scilab.org/ ) - This file is part of Scilab
// Copyright (C) 2010 - INRIA - Serge Steer
//
//  This file is distributed under the same license as the Scilab package.
// =============================================================================
// <-- CLI SHELL MODE -->
// <-- Non-regression test for bug 7236 -->
//
// <-- GitLab URL -->
// https://gitlab.com/scilab/scilab/-/issues/7236
//
// <-- Short Description -->
// sci2exp(-%inf) return a wrong value -nf and not -%inf,
// a consequence of bug 1371 fix
if sci2exp(%inf)<>"%inf" then bugmes();quit;end
if sci2exp(-%inf)<>"-%inf" then bugmes();quit;end
if sci2exp(%nan)<>"%nan" then bugmes();quit;end
if string(%inf)<>"Inf"  then bugmes();quit;end
if string(-%inf)<>"-Inf"  then bugmes();quit;end
if string(1-imult(%inf))<>"1-%i*Inf"  then bugmes();quit;end
if string(1+imult(%inf))<>"1+%i*Inf"  then bugmes();quit;end
if sci2exp(1-imult(%inf))<>"1-%i*%inf"  then bugmes();quit;end
if sci2exp(1+imult(%inf))<>"1+%i*%inf"  then bugmes();quit;end
