// =============================================================================
// Scilab ( https://www.scilab.org/ ) - This file is part of Scilab
// Copyright (C) 2014 - Scilab Enterprises - Vladislav TRUBKIN
//
// This file is distributed under the same license as the Scilab package.
// =============================================================================
// <-- XCOS TEST -->
//
// <-- ENGLISH IMPOSED -->
//
// <-- Non-regression test for bug 12751 -->
//
// <-- GitLab URL -->
// https://gitlab.com/scilab/scilab/-/issues/12751
//
// <-- Short Description -->
// cdummy_ entry point not found when using Code Generation
//
assert_checktrue(importXcosDiagram(SCI + "/modules/xcos/tests/nonreg_tests/bug_12751.zcos"));
xcos_simulate(scs_m, 4);
prot = funcprot();
funcprot(0);
function str = x_mdialog(desc, labels, ini)
    str = ["bug_12751"; TMPDIR+"/bug_12751/"; ""];
endfunction
funcprot(prot);
[ok, XX] = do_compile_superblock42(scs_m.objs(1), [], [], %f);
   Generate a loader file
   Generate a Makefile
   ilib_gen_Make: Copy compilation files (Makefile*, libtool...) to TMPDIR
   ilib_gen_Make: Did not copy bug_12751.c: Source and target directories are the same (TMPDIR/bug_12751).
   ilib_gen_Make: Did not copy bug_12751_void_io.c: Source and target directories are the same (TMPDIR/bug_12751).
   ilib_gen_Make: Did not copy bug_12751_Cblocks.c: Source and target directories are the same (TMPDIR/bug_12751).
   ilib_gen_Make: configure : Generate Makefile.
   ilib_gen_Make: Modification of the Makefile in TMPDIR.
   Running the Makefile
   Generate a cleaner file
Shared archive loaded.
Link done.
assert_checktrue(ok);
rmdir(TMPDIR+"/bug_12751/","s");
