{"EntryDate":"2016-12-03 00:08:13 -05:00","Time":"00:08:13","Level":"WARN","Message":[{"Rule":"pageview","REMOTE_HOST":"82.80.230.228","URL":"/destinations/north-america/greenland.html","HTTP_REFERER":"http://www.mypinnacletravel.com/cruises/10-night-arctic-cruise-2.html","HTTPS":"off","HTTP_USER_AGENT":"Mozilla/5.0 (Macintosh; Intel Mac OS X 10_6_8) AppleWebKit/537.36 (KHTML, like Gecko) Chrome/31.0.1650.63 Safari/537.36","QUERY_STRING":"","HTTP_CONNECTION":"","REQUEST_METHOD":"GET","HTTP_HOST":"www.mypinnacletravel.com"}]},
{"EntryDate":"2016-12-03 00:13:31 -05:00","Time":"00:13:31","Level":"WARN","Message":[{"Rule":"pageview","REMOTE_HOST":"82.80.230.228","URL":"/request-quote.html","HTTP_REFERER":"http://www.mypinnacletravel.com/cruises/29-night-alaska-cruise-2.html","HTTPS":"off","HTTP_USER_AGENT":"Mozilla/5.0 (Windows NT 6.1; WOW64) AppleWebKit/537.36 (KHTML, like Gecko) Chrome/41.0.2227.0 Safari/537.36","QUERY_STRING":"DealURL=29-night-alaska-cruise-2&DealType=Cruise","HTTP_CONNECTION":"","REQUEST_METHOD":"GET","HTTP_HOST":"www.mypinnacletravel.com"}]},
{"EntryDate":"2016-12-03 00:24:24 -05:00","Time":"00:24:24","Level":"WARN","Message":[{"Rule":"bots_hotels_forms","REMOTE_HOST":"207.46.13.30","URL":"/request-quote.html","HTTP_REFERER":"","HTTPS":"off","HTTP_USER_AGENT":"Mozilla/5.0 (compatible; bingbot/2.0; +http://www.bing.com/bingbot.htm)","QUERY_STRING":"DealURL=fall-packages-to-europe-starting-at-only-949&DealType=Promotion","HTTP_CONNECTION":"Keep-Alive","REQUEST_METHOD":"GET","HTTP_HOST":"bluesunshinetravel.com"}]},
{"EntryDate":"2016-12-03 00:49:09 -05:00","Time":"00:49:09","Level":"WARN","Message":[{"Rule":"bots_hotels_forms","REMOTE_HOST":"207.46.13.163","URL":"/request-quote.html","HTTP_REFERER":"","HTTPS":"off","HTTP_USER_AGENT":"Mozilla/5.0 (compatible; bingbot/2.0; +http://www.bing.com/bingbot.htm)","QUERY_STRING":"DealURL=cape-dunes-discoverer-2&DealType=Tour&Dates=1/6/17-1/17/17&Starting=1899.00","HTTP_CONNECTION":"Keep-Alive","REQUEST_METHOD":"GET","HTTP_HOST":"bluesunshinetravel.com"}]},
{"EntryDate":"2016-12-03 00:54:57 -05:00","Time":"00:54:57","Level":"WARN","Message":[{"Rule":"pageview","REMOTE_HOST":"82.80.249.137","URL":"/destinations/south-america/brazil.html","HTTP_REFERER":"http://www.jetravelconcepts.com/cruises/18-night-south-america-cruise-2.html","HTTPS":"off","HTTP_USER_AGENT":"Mozilla/5.0 (compatible; MSIE 10.0; Windows NT 6.2; WOW64; Trident/6.0)","QUERY_STRING":"","HTTP_CONNECTION":"","REQUEST_METHOD":"GET","HTTP_HOST":"jetravelconcepts.com"}]},
{"EntryDate":"2016-12-03 01:02:31 -05:00","Time":"01:02:31","Level":"WARN","Message":[{"Rule":"bots_hotels_forms","REMOTE_HOST":"40.77.167.59","URL":"/request-quote.html","HTTP_REFERER":"","HTTPS":"off","HTTP_USER_AGENT":"Mozilla/5.0 (compatible; bingbot/2.0; +http://www.bing.com/bingbot.htm)","QUERY_STRING":"DealURL=bhutan-adventure&DealType=Tour","HTTP_CONNECTION":"Keep-Alive","REQUEST_METHOD":"GET","HTTP_HOST":"affluentluxurytravel.agentstudio.com"}]},
{"EntryDate":"2016-12-03 01:02:46 -05:00","Time":"01:02:46","Level":"WARN","Message":[{"Rule":"bots_hotels_forms","REMOTE_HOST":"157.55.39.154","URL":"/request-quote.html","HTTP_REFERER":"","HTTPS":"off","HTTP_USER_AGENT":"Mozilla/5.0 (compatible; bingbot/2.0; +http://www.bing.com/bingbot.htm)","QUERY_STRING":"DealURL=europe&DealType=Destination","HTTP_CONNECTION":"Keep-Alive","REQUEST_METHOD":"GET","HTTP_HOST":"affluentluxurytravel.agentstudio.com"}]},
{"EntryDate":"2016-12-03 01:03:01 -05:00","Time":"01:03:01","Level":"WARN","Message":[{"Rule":"bots_hotels_forms","REMOTE_HOST":"157.55.39.210","URL":"/request-quote.html","HTTP_REFERER":"","HTTPS":"off","HTTP_USER_AGENT":"Mozilla/5.0 (compatible; bingbot/2.0; +http://www.bing.com/bingbot.htm)","QUERY_STRING":"DealURL=tanzania-zanzibar-adventure&DealType=Tour&Dates=7/29/16-8/7/16&Starting=2399.00","HTTP_CONNECTION":"Keep-Alive","REQUEST_METHOD":"GET","HTTP_HOST":"affluentluxurytravel.agentstudio.com"}]},
{"EntryDate":"2016-12-03 01:03:23 -05:00","Time":"01:03:23","Level":"WARN","Message":[{"Rule":"bots_hotels_forms","REMOTE_HOST":"40.77.167.16","URL":"/request-quote.html","HTTP_REFERER":"","HTTPS":"off","HTTP_USER_AGENT":"Mozilla/5.0 (compatible; bingbot/2.0; +http://www.bing.com/bingbot.htm)","QUERY_STRING":"DealURL=resorts-credits-more-in-vegas&DealType=promotion","HTTP_CONNECTION":"Keep-Alive","REQUEST_METHOD":"GET","HTTP_HOST":"affluentluxurytravel.agentstudio.com"}]},
{"EntryDate":"2016-12-03 01:13:00 -05:00","Time":"01:13:00","Level":"WARN","Message":[{"Rule":"bots_hotels_forms","REMOTE_HOST":"208.43.225.84","URL":"/request-quote.html","HTTP_REFERER":"","HTTPS":"off","HTTP_USER_AGENT":"Mozilla/5.0 (compatible; SiteExplorer/1.1b; +http://siteexplorer.info/Backlink-Checker-Spider/)","QUERY_STRING":"Starting=3199","HTTP_CONNECTION":"Keep-Alive","REQUEST_METHOD":"GET","HTTP_HOST":"infinitygetaways.net"}]},
{"EntryDate":"2016-12-03 01:44:20 -05:00","Time":"01:44:20","Level":"WARN","Message":[{"Rule":"bots_hotels_forms","REMOTE_HOST":"157.55.39.154","URL":"/common/sign-in.html","HTTP_REFERER":"","HTTPS":"off","HTTP_USER_AGENT":"Mozilla/5.0 (compatible; bingbot/2.0; +http://www.bing.com/bingbot.htm)","QUERY_STRING":"","HTTP_CONNECTION":"Keep-Alive","REQUEST_METHOD":"GET","HTTP_HOST":"nashtravels.agentstudio.com"}]},
{"EntryDate":"2016-12-03 01:55:19 -05:00","Time":"01:55:19","Level":"WARN","Message":[{"Rule":"bots_hotels_forms","REMOTE_HOST":"184.154.36.179","URL":"/send-to-a-friend.html","HTTP_REFERER":"","HTTPS":"off","HTTP_USER_AGENT":"SiteLockSpider [en] (WinNT; I ;Nav)","QUERY_STRING":"seourl=10-day-baja-peninsula-sea-of-cortez&DealType=Promotion","HTTP_CONNECTION":"TE, close","REQUEST_METHOD":"GET","HTTP_HOST":"martincruisesandtravel.com"}]},
{"EntryDate":"2016-12-03 01:56:08 -05:00","Time":"01:56:08","Level":"WARN","Message":[{"Rule":"bots_hotels_forms","REMOTE_HOST":"184.154.36.167","URL":"/send-to-a-friend.html","HTTP_REFERER":"","HTTPS":"off","HTTP_USER_AGENT":"SiteLockSpider [en] (WinNT; I ;Nav)","QUERY_STRING":"seourl=11-night-alaska-cruise-8&DealType=Cruise","HTTP_CONNECTION":"TE, close","REQUEST_METHOD":"GET","HTTP_HOST":"oldworldflavors.com"}]},
{"EntryDate":"2016-12-03 02:18:19 -05:00","Time":"02:18:19","Level":"WARN","Message":[{"Rule":"bots_hotels_forms","REMOTE_HOST":"40.77.167.16","URL":"/common/sign-in.html","HTTP_REFERER":"","HTTPS":"off","HTTP_USER_AGENT":"Mozilla/5.0 (compatible; bingbot/2.0; +http://www.bing.com/bingbot.htm)","QUERY_STRING":"","HTTP_CONNECTION":"Keep-Alive","REQUEST_METHOD":"GET","HTTP_HOST":"pulaskitravel.agentstudio.com"}]},
{"EntryDate":"2016-12-03 02:42:41 -05:00","Time":"02:42:41","Level":"WARN","Message":[{"Rule":"pageview","REMOTE_HOST":"82.80.230.228","URL":"/destinations/europe/italy/florence.html","HTTP_REFERER":"http://www.timeless-adventures.com/cruises/chattanooga-to-clarksville-nashville.html","HTTPS":"off","HTTP_USER_AGENT":"Mozilla/5.0 (Macintosh; Intel Mac OS X 10.9; rv:26.0) Gecko/20100101 Firefox/26.0","QUERY_STRING":"","HTTP_CONNECTION":"","REQUEST_METHOD":"GET","HTTP_HOST":"www.timeless-adventures.com"}]},
{"EntryDate":"2016-12-03 02:48:24 -05:00","Time":"02:48:24","Level":"WARN","Message":[{"Rule":"pageview","REMOTE_HOST":"82.80.230.228","URL":"/news/16-fictional-airlines-to-tickle-your-pop-culture-fancy.html","HTTP_REFERER":"http://timeless-adventures.com/destinations/south-pacific.html","HTTPS":"off","HTTP_USER_AGENT":"Mozilla/5.0 (Macintosh; Intel Mac OS X 10_9_0) AppleWebKit/537.36 (KHTML, like Gecko) Chrome/31.0.1650.57 Safari/537.36","QUERY_STRING":"","HTTP_CONNECTION":"","REQUEST_METHOD":"GET","HTTP_HOST":"timeless-adventures.com"}]},
{"EntryDate":"2016-12-03 02:54:08 -05:00","Time":"02:54:08","Level":"WARN","Message":[{"Rule":"pageview","REMOTE_HOST":"82.80.230.228","URL":"/destinations/africa/south-africa/cape-town.html","HTTP_REFERER":"http://timeless-adventures.com/cruises/84-nights-grand-continental-odysseys.html","HTTPS":"off","HTTP_USER_AGENT":"Mozilla/5.0 (Windows NT 6.1) AppleWebKit/537.36 (KHTML, like Gecko) Chrome/32.0.1700.72 Safari/537.36","QUERY_STRING":"","HTTP_CONNECTION":"","REQUEST_METHOD":"GET","HTTP_HOST":"timeless-adventures.com"}]},
{"EntryDate":"2016-12-03 03:01:17 -05:00","Time":"03:01:17","Level":"WARN","Message":[{"Rule":"bots_hotels_forms","REMOTE_HOST":"184.154.139.22","URL":"/send-to-a-friend.html","HTTP_REFERER":"","HTTPS":"off","HTTP_USER_AGENT":"SiteLockSpider [en] (WinNT; I ;Nav)","QUERY_STRING":"seourl=real-britain-winter-20162018&DealType=Tour","HTTP_CONNECTION":"TE, close","REQUEST_METHOD":"GET","HTTP_HOST":"coupdetattravelconsulting.com"}]},
{"EntryDate":"2016-12-03 03:11:51 -05:00","Time":"03:11:51","Level":"WARN","Message":[{"Rule":"bots_hotels_forms","REMOTE_HOST":"208.43.225.84","URL":"/request-quote.html","HTTP_REFERER":"","HTTPS":"off","HTTP_USER_AGENT":"Mozilla/5.0 (compatible; SiteExplorer/1.1b; +http://siteexplorer.info/Backlink-Checker-Spider/)","QUERY_STRING":"DealType=Tour","HTTP_CONNECTION":"Keep-Alive","REQUEST_METHOD":"GET","HTTP_HOST":"floridacanuck.com"}]},
{"EntryDate":"2016-12-03 03:57:08 -05:00","Time":"03:57:08","Level":"WARN","Message":[{"Rule":"bots_hotels_forms","REMOTE_HOST":"184.154.36.179","URL":"/common/sign-in.html","HTTP_REFERER":"","HTTPS":"off","HTTP_USER_AGENT":"SiteLockSpider [en] (WinNT; I ;Nav)","QUERY_STRING":"","HTTP_CONNECTION":"TE, close","REQUEST_METHOD":"GET","HTTP_HOST":"afsgetaways.com"}]},
{"EntryDate":"2016-12-03 04:47:43 -05:00","Time":"04:47:43","Level":"WARN","Message":[{"Rule":"bots_hotels_forms","REMOTE_HOST":"207.46.13.163","URL":"/request-quote.html","HTTP_REFERER":"","HTTPS":"off","HTTP_USER_AGENT":"Mozilla/5.0 (compatible; bingbot/2.0; +http://www.bing.com/bingbot.htm)","QUERY_STRING":"DealURL=colombia-express&DealType=Tour&Dates=9/9/17-9/17/17&Starting=1749.00","HTTP_CONNECTION":"Keep-Alive","REQUEST_METHOD":"GET","HTTP_HOST":"bluesunshinetravel.com"}]},
{"EntryDate":"2016-12-03 04:49:58 -05:00","Time":"04:49:58","Level":"WARN","Message":[{"Rule":"bots_hotels_forms","REMOTE_HOST":"184.154.139.20","URL":"/send-to-a-friend.html","HTTP_REFERER":"","HTTPS":"off","HTTP_USER_AGENT":"SiteLockSpider [en] (WinNT; I ;Nav)","QUERY_STRING":"seourl=german-christmas-markets-winter-20162018&DealType=Tour","HTTP_CONNECTION":"TE, close","REQUEST_METHOD":"GET","HTTP_HOST":"havebagwilltravelagency.com"}]},
{"EntryDate":"2016-12-03 04:55:34 -05:00","Time":"04:55:34","Level":"WARN","Message":[{"Rule":"bots_hotels_forms","REMOTE_HOST":"184.154.139.24","URL":"/common/sign-in.html","HTTP_REFERER":"","HTTPS":"off","HTTP_USER_AGENT":"SiteLockSpider [en] (WinNT; I ;Nav)","QUERY_STRING":"","HTTP_CONNECTION":"TE, close","REQUEST_METHOD":"GET","HTTP_HOST":"travelzagency.com"}]},
{"EntryDate":"2016-12-03 05:05:27 -05:00","Time":"05:05:27","Level":"WARN","Message":[{"Rule":"bots_hotels_forms","REMOTE_HOST":"157.55.39.103","URL":"/send-to-a-friend.html","HTTP_REFERER":"","HTTPS":"off","HTTP_USER_AGENT":"Mozilla/5.0 (compatible; bingbot/2.0; +http://www.bing.com/bingbot.htm)","QUERY_STRING":"seourl=colorados-historic-trains","HTTP_CONNECTION":"Keep-Alive","REQUEST_METHOD":"GET","HTTP_HOST":"bluesunshinetravel.com"}]},
{"EntryDate":"2016-12-03 05:14:41 -05:00","Time":"05:14:41","Level":"WARN","Message":[{"Rule":"pageview","REMOTE_HOST":"82.80.249.156","URL":"/cruises/13-nights-island-rhythms-big-easy-jazz.html","HTTP_REFERER":"http://www.toptripsandtours.com/tours/the-old-south-florida-with-mardi-gras-in-new-orleans-2.html","HTTPS":"off","HTTP_USER_AGENT":"Mozilla/5.0 (Windows NT 6.1; rv:25.0) Gecko/20100101 Firefox/25.0","QUERY_STRING":"","HTTP_CONNECTION":"","REQUEST_METHOD":"GET","HTTP_HOST":"www.toptripsandtours.com"}]},
{"EntryDate":"2016-12-03 05:17:48 -05:00","Time":"05:17:48","Level":"WARN","Message":[{"Rule":"bots_hotels_forms","REMOTE_HOST":"207.46.13.163","URL":"/request-quote.html","HTTP_REFERER":"","HTTPS":"off","HTTP_USER_AGENT":"Mozilla/5.0 (compatible; bingbot/2.0; +http://www.bing.com/bingbot.htm)","QUERY_STRING":"DealURL=curacao-marriott-beach-resort-emerald-casino-272182&DealType=Promotion&Dates=9/6/15-9/13/15&Starting=293","HTTP_CONNECTION":"Keep-Alive","REQUEST_METHOD":"GET","HTTP_HOST":"bluesunshinetravel.com"}]},
{"EntryDate":"2016-12-03 05:28:23 -05:00","Time":"05:28:23","Level":"WARN","Message":[{"Rule":"bots_hotels_forms","REMOTE_HOST":"207.46.13.30","URL":"/request-quote.html","HTTP_REFERER":"","HTTPS":"off","HTTP_USER_AGENT":"Mozilla/5.0 (compatible; bingbot/2.0; +http://www.bing.com/bingbot.htm)","QUERY_STRING":"DealURL=northern-india-rajasthan-to-goa-by-rail&DealType=Tour","HTTP_CONNECTION":"Keep-Alive","REQUEST_METHOD":"GET","HTTP_HOST":"bluesunshinetravel.com"}]},
{"EntryDate":"2016-12-03 06:55:10 -05:00","Time":"06:55:10","Level":"WARN","Message":[{"Rule":"bots_hotels_forms","REMOTE_HOST":"40.77.167.59","URL":"/request-quote.html","HTTP_REFERER":"","HTTPS":"off","HTTP_USER_AGENT":"Mozilla/5.0 (compatible; bingbot/2.0; +http://www.bing.com/bingbot.htm)","QUERY_STRING":"DealURL=northern-morocco-on-a-shoestring&DealType=Tour&Dates=8/19/17-8/26/17&Starting=849.00","HTTP_CONNECTION":"Keep-Alive","REQUEST_METHOD":"GET","HTTP_HOST":"vitatravel.agentstudio.com"}]},
{"EntryDate":"2016-12-03 06:57:32 -05:00","Time":"06:57:32","Level":"WARN","Message":[{"Rule":"bots_hotels_forms","REMOTE_HOST":"40.77.167.7","URL":"/request-quote.html","HTTP_REFERER":"","HTTPS":"off","HTTP_USER_AGENT":"Mozilla/5.0 (compatible; bingbot/2.0; +http://www.bing.com/bingbot.htm)","QUERY_STRING":"DealURL=ecuador-its-galpagos-islands-with-the-amazon&DealType=Cruise&Dates=7/21/17-8/2/17&Starting=6199","HTTP_CONNECTION":"Keep-Alive","REQUEST_METHOD":"GET","HTTP_HOST":"bluesunshinetravel.com"}]},
{"EntryDate":"2016-12-03 07:25:58 -05:00","Time":"07:25:58","Level":"WARN","Message":[{"Rule":"bots_hotels_forms","REMOTE_HOST":"207.46.13.163","URL":"/request-quote.html","HTTP_REFERER":"","HTTPS":"off","HTTP_USER_AGENT":"Mozilla/5.0 (compatible; bingbot/2.0; +http://www.bing.com/bingbot.htm)","QUERY_STRING":"DealURL=cape-dunes-discoverer-2&DealType=Tour&Dates=10/7/16-10/18/16&Starting=1999.00","HTTP_CONNECTION":"Keep-Alive","REQUEST_METHOD":"GET","HTTP_HOST":"bluesunshinetravel.com"}]},
{"EntryDate":"2016-12-03 07:28:34 -05:00","Time":"07:28:34","Level":"WARN","Message":[{"Rule":"bots_hotels_forms","REMOTE_HOST":"157.55.39.154","URL":"/request-quote.html","HTTP_REFERER":"","HTTPS":"off","HTTP_USER_AGENT":"Mozilla/5.0 (compatible; bingbot/2.0; +http://www.bing.com/bingbot.htm)","QUERY_STRING":"DealURL=north-america/mexico/cancun&DealType=Destination","HTTP_CONNECTION":"Keep-Alive","REQUEST_METHOD":"GET","HTTP_HOST":"2sisterstt.agentstudio.com"}]},
{"EntryDate":"2016-12-03 07:29:05 -05:00","Time":"07:29:05","Level":"WARN","Message":[{"Rule":"bots_hotels_forms","REMOTE_HOST":"157.55.39.210","URL":"/send-to-a-friend.html","HTTP_REFERER":"","HTTPS":"off","HTTP_USER_AGENT":"Mozilla/5.0 (compatible; bingbot/2.0; +http://www.bing.com/bingbot.htm)","QUERY_STRING":"seourl=8-night-western-europe-cruise-11","HTTP_CONNECTION":"Keep-Alive","REQUEST_METHOD":"GET","HTTP_HOST":"2sisterstt.agentstudio.com"}]},
{"EntryDate":"2016-12-03 07:29:39 -05:00","Time":"07:29:39","Level":"WARN","Message":[{"Rule":"bots_hotels_forms","REMOTE_HOST":"40.77.167.59","URL":"/request-quote.html","HTTP_REFERER":"","HTTPS":"off","HTTP_USER_AGENT":"Mozilla/5.0 (compatible; bingbot/2.0; +http://www.bing.com/bingbot.htm)","QUERY_STRING":"DealURL=north-america/united-states&DealType=Destination","HTTP_CONNECTION":"Keep-Alive","REQUEST_METHOD":"GET","HTTP_HOST":"2sisterstt.agentstudio.com"}]},
{"EntryDate":"2016-12-03 07:30:11 -05:00","Time":"07:30:11","Level":"WARN","Message":[{"Rule":"bots_hotels_forms","REMOTE_HOST":"40.77.167.16","URL":"/request-quote.html","HTTP_REFERER":"","HTTPS":"off","HTTP_USER_AGENT":"Mozilla/5.0 (compatible; bingbot/2.0; +http://www.bing.com/bingbot.htm)","QUERY_STRING":"DealURL=wales-ireland&DealType=Tour&Dates=8/13/16-8/21/16&Starting=1499","HTTP_CONNECTION":"Keep-Alive","REQUEST_METHOD":"GET","HTTP_HOST":"2sisterstt.agentstudio.com"}]},
{"EntryDate":"2016-12-03 07:34:05 -05:00","Time":"07:34:05","Level":"WARN","Message":[{"Rule":"bots_hotels_forms","REMOTE_HOST":"157.55.39.103","URL":"/request-quote.html","HTTP_REFERER":"","HTTPS":"off","HTTP_USER_AGENT":"Mozilla/5.0 (compatible; bingbot/2.0; +http://www.bing.com/bingbot.htm)","QUERY_STRING":"DealURL=season-3-early-booking-bonus-3&DealType=Tour","HTTP_CONNECTION":"Keep-Alive","REQUEST_METHOD":"GET","HTTP_HOST":"bluesunshinetravel.com"}]},
{"EntryDate":"2016-12-03 07:51:16 -05:00","Time":"07:51:16","Level":"WARN","Message":[{"Rule":"bots_hotels_forms","REMOTE_HOST":"69.175.59.187","URL":"/request-quote.html","HTTP_REFERER":"","HTTPS":"off","HTTP_USER_AGENT":"SiteLockSpider [en] (WinNT; I ;Nav)","QUERY_STRING":"DealURL=tasteful-luxury-for-adults-only&DealType=Promotion","HTTP_CONNECTION":"TE, close","REQUEST_METHOD":"GET","HTTP_HOST":"www.echevarriatravel.com"}]},
{"EntryDate":"2016-12-03 07:53:12 -05:00","Time":"07:53:12","Level":"WARN","Message":[{"Rule":"bots_hotels_forms","REMOTE_HOST":"184.154.139.20","URL":"/common/sign-in.html","HTTP_REFERER":"","HTTPS":"off","HTTP_USER_AGENT":"SiteLockSpider [en] (WinNT; I ;Nav)","QUERY_STRING":"","HTTP_CONNECTION":"TE, close","REQUEST_METHOD":"GET","HTTP_HOST":"exploretheseven.com"}]},
{"EntryDate":"2016-12-03 07:54:12 -05:00","Time":"07:54:12","Level":"WARN","Message":[{"Rule":"bots_hotels_forms","REMOTE_HOST":"184.154.139.16","URL":"/common/sign-in.html","HTTP_REFERER":"","HTTPS":"off","HTTP_USER_AGENT":"SiteLockSpider [en] (WinNT; I ;Nav)","QUERY_STRING":"","HTTP_CONNECTION":"TE, close","REQUEST_METHOD":"GET","HTTP_HOST":"trandalltravel.com"}]},
{"EntryDate":"2016-12-03 07:55:39 -05:00","Time":"07:55:39","Level":"WARN","Message":[{"Rule":"bots_hotels_forms","REMOTE_HOST":"40.77.167.7","URL":"/request-quote.html","HTTP_REFERER":"","HTTPS":"off","HTTP_USER_AGENT":"Mozilla/5.0 (compatible; bingbot/2.0; +http://www.bing.com/bingbot.htm)","QUERY_STRING":"DealURL=12-night-expedition-cruising-cruise-2&DealType=Cruise","HTTP_CONNECTION":"Keep-Alive","REQUEST_METHOD":"GET","HTTP_HOST":"bluesunshinetravel.com"}]},
{"EntryDate":"2016-12-03 08:06:47 -05:00","Time":"08:06:47","Level":"WARN","Message":[{"Rule":"bots_hotels_forms","REMOTE_HOST":"184.154.139.20","URL":"/common/sign-in.html","HTTP_REFERER":"","HTTPS":"off","HTTP_USER_AGENT":"SiteLockSpider [en] (WinNT; I ;Nav)","QUERY_STRING":"","HTTP_CONNECTION":"TE, close","REQUEST_METHOD":"GET","HTTP_HOST":"quailridgetravel.com"}]},
{"EntryDate":"2016-12-03 08:19:45 -05:00","Time":"08:19:45","Level":"WARN","Message":[{"Rule":"bots_hotels_forms","REMOTE_HOST":"157.55.39.154","URL":"/send-to-a-friend.html","HTTP_REFERER":"","HTTPS":"off","HTTP_USER_AGENT":"Mozilla/5.0 (compatible; bingbot/2.0; +http://www.bing.com/bingbot.htm)","QUERY_STRING":"seourl=coco-beach-resort","HTTP_CONNECTION":"Keep-Alive","REQUEST_METHOD":"GET","HTTP_HOST":"travelbeevacations.agentstudio.com"}]},
{"EntryDate":"2016-12-03 08:20:14 -05:00","Time":"08:20:14","Level":"WARN","Message":[{"Rule":"bots_hotels_forms","REMOTE_HOST":"157.55.39.210","URL":"/send-to-a-friend.html","HTTP_REFERER":"","HTTPS":"off","HTTP_USER_AGENT":"Mozilla/5.0 (compatible; bingbot/2.0; +http://www.bing.com/bingbot.htm)","QUERY_STRING":"seourl=sights-sounds-of-the-south","HTTP_CONNECTION":"Keep-Alive","REQUEST_METHOD":"GET","HTTP_HOST":"travelbeevacations.agentstudio.com"}]},
{"EntryDate":"2016-12-03 08:22:25 -05:00","Time":"08:22:25","Level":"WARN","Message":[{"Rule":"bots_hotels_forms","REMOTE_HOST":"40.77.167.59","URL":"/send-to-a-friend.html","HTTP_REFERER":"","HTTPS":"off","HTTP_USER_AGENT":"Mozilla/5.0 (compatible; bingbot/2.0; +http://www.bing.com/bingbot.htm)","QUERY_STRING":"seourl=mayan-adventure","HTTP_CONNECTION":"Keep-Alive","REQUEST_METHOD":"GET","HTTP_HOST":"travelbeevacations.agentstudio.com"}]},
{"EntryDate":"2016-12-03 08:26:04 -05:00","Time":"08:26:04","Level":"WARN","Message":[{"Rule":"bots_hotels_forms","REMOTE_HOST":"207.46.13.163","URL":"/request-quote.html","HTTP_REFERER":"","HTTPS":"off","HTTP_USER_AGENT":"Mozilla/5.0 (compatible; bingbot/2.0; +http://www.bing.com/bingbot.htm)","QUERY_STRING":"DealURL=southeast-asia-in-depth&DealType=Tour&Dates=5/30/16-7/9/16&Starting=4749.00","HTTP_CONNECTION":"Keep-Alive","REQUEST_METHOD":"GET","HTTP_HOST":"bluesunshinetravel.com"}]},
{"EntryDate":"2016-12-03 08:26:33 -05:00","Time":"08:26:33","Level":"WARN","Message":[{"Rule":"bots_hotels_forms","REMOTE_HOST":"40.77.167.16","URL":"/send-to-a-friend.html","HTTP_REFERER":"","HTTPS":"off","HTTP_USER_AGENT":"Mozilla/5.0 (compatible; bingbot/2.0; +http://www.bing.com/bingbot.htm)","QUERY_STRING":"seourl=north-india-highlights","HTTP_CONNECTION":"Keep-Alive","REQUEST_METHOD":"GET","HTTP_HOST":"travelbeevacations.agentstudio.com"}]},
{"EntryDate":"2016-12-03 08:35:44 -05:00","Time":"08:35:44","Level":"WARN","Message":[{"Rule":"bots_hotels_forms","REMOTE_HOST":"184.154.139.50","URL":"/request-quote.html","HTTP_REFERER":"","HTTPS":"off","HTTP_USER_AGENT":"SiteLockSpider [en] (WinNT; I ;Nav)","QUERY_STRING":"DealURL=bocas-del-toro-2n3d&DealType=Tour","HTTP_CONNECTION":"TE, close","REQUEST_METHOD":"GET","HTTP_HOST":"travelexplorerelax.com"}]},
{"EntryDate":"2016-12-03 08:55:33 -05:00","Time":"08:55:33","Level":"WARN","Message":[{"Rule":"bots_hotels_forms","REMOTE_HOST":"207.46.13.30","URL":"/request-quote.html","HTTP_REFERER":"","HTTPS":"off","HTTP_USER_AGENT":"Mozilla/5.0 (compatible; bingbot/2.0; +http://www.bing.com/bingbot.htm)","QUERY_STRING":"DealURL=galpagos-west-central-east-islands-aboard-the-estrella&DealType=Tour&Dates=5/8/16-5/17/16&Starting=4299.00","HTTP_CONNECTION":"Keep-Alive","REQUEST_METHOD":"GET","HTTP_HOST":"bluesunshinetravel.com"}]},
{"EntryDate":"2016-12-03 08:55:37 -05:00","Time":"08:55:37","Level":"WARN","Message":[{"Rule":"bots_hotels_forms","REMOTE_HOST":"207.46.13.163","URL":"/request-quote.html","HTTP_REFERER":"","HTTPS":"off","HTTP_USER_AGENT":"Mozilla/5.0 (compatible; bingbot/2.0; +http://www.bing.com/bingbot.htm)","QUERY_STRING":"DealURL=cape-dunes-discoverer-2&DealType=Tour&Dates=3/10/17-3/21/17&Starting=1899.00","HTTP_CONNECTION":"Keep-Alive","REQUEST_METHOD":"GET","HTTP_HOST":"bluesunshinetravel.com"}]},
{"EntryDate":"2016-12-03 09:13:58 -05:00","Time":"09:13:58","Level":"WARN","Message":[{"Rule":"bots_hotels_forms","REMOTE_HOST":"40.77.167.7","URL":"/request-quote.html","HTTP_REFERER":"","HTTPS":"off","HTTP_USER_AGENT":"Mozilla/5.0 (compatible; bingbot/2.0; +http://www.bing.com/bingbot.htm)","QUERY_STRING":"DealURL=the-best-of-switzerland-2&DealType=Tour&Dates=5/7/17-5/14/17&Starting=2549","HTTP_CONNECTION":"Keep-Alive","REQUEST_METHOD":"GET","HTTP_HOST":"bluesunshinetravel.com"}]},
{"EntryDate":"2016-12-03 09:23:11 -05:00","Time":"09:23:11","Level":"WARN","Message":[{"Rule":"bots_hotels_forms","REMOTE_HOST":"208.43.225.84","URL":"/request-quote.html","HTTP_REFERER":"","HTTPS":"off","HTTP_USER_AGENT":"Mozilla/5.0 (compatible; SiteExplorer/1.1b; +http://siteexplorer.info/Backlink-Checker-Spider/)","QUERY_STRING":"Starting=649","HTTP_CONNECTION":"Keep-Alive","REQUEST_METHOD":"GET","HTTP_HOST":"luxurytropicalvacations.com"}]},
{"EntryDate":"2016-12-03 09:34:01 -05:00","Time":"09:34:01","Level":"WARN","Message":[{"Rule":"bots_hotels_forms","REMOTE_HOST":"157.55.39.103","URL":"/request-quote.html","HTTP_REFERER":"","HTTPS":"off","HTTP_USER_AGENT":"Mozilla/5.0 (compatible; bingbot/2.0; +http://www.bing.com/bingbot.htm)","QUERY_STRING":"DealURL=oman-the-united-arab-emirates&DealType=Tour&Dates=10/29/16-11/7/16&Starting=2299","HTTP_CONNECTION":"Keep-Alive","REQUEST_METHOD":"GET","HTTP_HOST":"bluesunshinetravel.com"}]},
{"EntryDate":"2016-12-03 09:34:22 -05:00","Time":"09:34:22","Level":"WARN","Message":[{"Rule":"bots_hotels_forms","REMOTE_HOST":"207.46.13.30","URL":"/request-quote.html","HTTP_REFERER":"","HTTPS":"off","HTTP_USER_AGENT":"Mozilla/5.0 (compatible; bingbot/2.0; +http://www.bing.com/bingbot.htm)","QUERY_STRING":"DealURL=bali-flores-komodo-explorer&DealType=Tour&Dates=8/5/17-8/20/17&Starting=2749.00","HTTP_CONNECTION":"Keep-Alive","REQUEST_METHOD":"GET","HTTP_HOST":"bluesunshinetravel.com"}]},
{"EntryDate":"2016-12-03 09:38:25 -05:00","Time":"09:38:25","Level":"WARN","Message":[{"Rule":"bots_hotels_forms","REMOTE_HOST":"40.77.167.7","URL":"/request-quote.html","HTTP_REFERER":"","HTTPS":"off","HTTP_USER_AGENT":"Mozilla/5.0 (compatible; bingbot/2.0; +http://www.bing.com/bingbot.htm)","QUERY_STRING":"DealURL=burgundy-provence-southbound&DealType=Cruise&Dates=8/14/16-8/24/16&Starting=4099","HTTP_CONNECTION":"Keep-Alive","REQUEST_METHOD":"GET","HTTP_HOST":"bluesunshinetravel.com"}]},
{"EntryDate":"2016-12-03 09:40:37 -05:00","Time":"09:40:37","Level":"WARN","Message":[{"Rule":"bots_hotels_forms","REMOTE_HOST":"207.46.13.163","URL":"/request-quote.html","HTTP_REFERER":"","HTTPS":"off","HTTP_USER_AGENT":"Mozilla/5.0 (compatible; bingbot/2.0; +http://www.bing.com/bingbot.htm)","QUERY_STRING":"DealURL=northern-india-rajasthan-to-goa-by-rail&DealType=Tour&Dates=9/2/16-9/21/16&Starting=2249.00","HTTP_CONNECTION":"Keep-Alive","REQUEST_METHOD":"GET","HTTP_HOST":"bluesunshinetravel.com"}]},
{"EntryDate":"2016-12-03 09:47:18 -05:00","Time":"09:47:18","Level":"WARN","Message":[{"Rule":"bots_hotels_forms","REMOTE_HOST":"208.43.225.84","URL":"/send-to-a-friend.html","HTTP_REFERER":"","HTTPS":"off","HTTP_USER_AGENT":"Mozilla/5.0 (compatible; SiteExplorer/1.1b; +http://siteexplorer.info/Backlink-Checker-Spider/)","QUERY_STRING":"","HTTP_CONNECTION":"Keep-Alive","REQUEST_METHOD":"GET","HTTP_HOST":"lvntravel.com"}]},
{"EntryDate":"2016-12-03 10:22:50 -05:00","Time":"10:22:50","Level":"WARN","Message":[{"Rule":"bots_hotels_forms","REMOTE_HOST":"157.55.39.103","URL":"/request-quote.html","HTTP_REFERER":"","HTTPS":"off","HTTP_USER_AGENT":"Mozilla/5.0 (compatible; bingbot/2.0; +http://www.bing.com/bingbot.htm)","QUERY_STRING":"DealURL=bali-flores-komodo-explorer&DealType=Tour&Dates=10/22/16-11/6/16&Starting=2599.00","HTTP_CONNECTION":"Keep-Alive","REQUEST_METHOD":"GET","HTTP_HOST":"bluesunshinetravel.com"}]},
{"EntryDate":"2016-12-03 10:36:25 -05:00","Time":"10:36:25","Level":"WARN","Message":[{"Rule":"pageview","REMOTE_HOST":"82.80.230.228","URL":"/promotions/30percent-off-200-resort-credit-los-cabos-all-inclusive-golf-spa.html","HTTP_REFERER":"http://www.wondersoftheseatravel.com/destinations/north-america/mexico/acapulco.html","HTTPS":"off","HTTP_USER_AGENT":"Mozilla/6.0 (compatible)","QUERY_STRING":"","HTTP_CONNECTION":"","REQUEST_METHOD":"GET","HTTP_HOST":"wondersoftheseatravel.com"}]},
{"EntryDate":"2016-12-03 10:39:21 -05:00","Time":"10:39:21","Level":"WARN","Message":[{"Rule":"bots_hotels_forms","REMOTE_HOST":"207.46.13.163","URL":"/request-quote.html","HTTP_REFERER":"","HTTPS":"off","HTTP_USER_AGENT":"Mozilla/5.0 (compatible; bingbot/2.0; +http://www.bing.com/bingbot.htm)","QUERY_STRING":"DealURL=cape-dunes-discoverer-2&DealType=Tour&Dates=12/8/17-12/19/17&Starting=1899.00","HTTP_CONNECTION":"Keep-Alive","REQUEST_METHOD":"GET","HTTP_HOST":"bluesunshinetravel.com"}]},
{"EntryDate":"2016-12-03 10:41:41 -05:00","Time":"10:41:41","Level":"WARN","Message":[{"Rule":"pageview","REMOTE_HOST":"82.80.230.228","URL":"/request-quote.html","HTTP_REFERER":"http://www.wondersoftheseatravel.com/cruises/5-night-bahamas-cruise-16.html","HTTPS":"off","HTTP_USER_AGENT":"Mozilla/5.0 (Windows NT 6.1; WOW64) AppleWebKit/537.36 (KHTML, like Gecko) Chrome/35.0.1916.153 Safari/537.36","QUERY_STRING":"DealURL=5-night-bahamas-cruise-16&DealType=Cruise&Dates=12/4/17-12/9/17&Starting=414","HTTP_CONNECTION":"","REQUEST_METHOD":"GET","HTTP_HOST":"wondersoftheseatravel.com"}]},
{"EntryDate":"2016-12-03 10:56:31 -05:00","Time":"10:56:31","Level":"WARN","Message":[{"Rule":"pageview","REMOTE_HOST":"82.80.230.228","URL":"/cruises/15-night-far-east-cruise-7.html","HTTP_REFERER":"http://www.wondersoftheseatravel.com/promotions/20-night-tribute-to-the-emperors.html","HTTPS":"off","HTTP_USER_AGENT":"Mozilla/5.0 (Macintosh; Intel Mac OS X 10_9) AppleWebKit/537.71 (KHTML, like Gecko) Version/7.0 Safari/537.71","QUERY_STRING":"","HTTP_CONNECTION":"","REQUEST_METHOD":"GET","HTTP_HOST":"www.wondersoftheseatravel.com"}]},
{"EntryDate":"2016-12-03 11:07:19 -05:00","Time":"11:07:19","Level":"WARN","Message":[{"Rule":"bots_hotels_forms","REMOTE_HOST":"157.55.39.103","URL":"/request-quote.html","HTTP_REFERER":"","HTTPS":"off","HTTP_USER_AGENT":"Mozilla/5.0 (compatible; bingbot/2.0; +http://www.bing.com/bingbot.htm)","QUERY_STRING":"DealURL=why-not-cruise-to-south-america-antarctica-the-land-of-fire-ice&DealType=Cruise","HTTP_CONNECTION":"Keep-Alive","REQUEST_METHOD":"GET","HTTP_HOST":"bluesunshinetravel.com"}]},
{"EntryDate":"2016-12-03 11:19:10 -05:00","Time":"11:19:10","Level":"WARN","Message":[{"Rule":"bots_hotels_forms","REMOTE_HOST":"40.77.167.16","URL":"/request-quote.html","HTTP_REFERER":"","HTTPS":"off","HTTP_USER_AGENT":"Mozilla/5.0 (compatible; bingbot/2.0; +http://www.bing.com/bingbot.htm)","QUERY_STRING":"DealURL=14-night-far-east-cruise-16&DealType=Cruise&Dates=11/3/16-11/17/16&Starting=6299.00","HTTP_CONNECTION":"Keep-Alive","REQUEST_METHOD":"GET","HTTP_HOST":"travelbeevacations.agentstudio.com"}]},
{"EntryDate":"2016-12-03 11:23:40 -05:00","Time":"11:23:40","Level":"WARN","Message":[{"Rule":"bots_hotels_forms","REMOTE_HOST":"207.46.13.30","URL":"/send-to-a-friend.html","HTTP_REFERER":"","HTTPS":"off","HTTP_USER_AGENT":"Mozilla/5.0 (compatible; bingbot/2.0; +http://www.bing.com/bingbot.htm)","QUERY_STRING":"seourl=10-night-northern-europe-cruise-3","HTTP_CONNECTION":"Keep-Alive","REQUEST_METHOD":"GET","HTTP_HOST":"bluesunshinetravel.com"}]},
{"EntryDate":"2016-12-03 11:55:54 -05:00","Time":"11:55:54","Level":"WARN","Message":[{"Rule":"bots_hotels_forms","REMOTE_HOST":"157.55.39.103","URL":"/request-quote.html","HTTP_REFERER":"","HTTPS":"off","HTTP_USER_AGENT":"Mozilla/5.0 (compatible; bingbot/2.0; +http://www.bing.com/bingbot.htm)","QUERY_STRING":"DealURL=aston-waikiki-beach-hotel&DealType=Tour&Dates=5/26/16-5/31/16&Starting=1017","HTTP_CONNECTION":"Keep-Alive","REQUEST_METHOD":"GET","HTTP_HOST":"bluesunshinetravel.com"}]},
{"EntryDate":"2016-12-03 12:19:47 -05:00","Time":"12:19:47","Level":"WARN","Message":[{"Rule":"bots_hotels_forms","REMOTE_HOST":"207.46.13.163","URL":"/request-quote.html","HTTP_REFERER":"","HTTPS":"off","HTTP_USER_AGENT":"Mozilla/5.0 (compatible; bingbot/2.0; +http://www.bing.com/bingbot.htm)","QUERY_STRING":"DealURL=central-european-experience-cruise-only-westbound&DealType=Cruise&Dates=9/12/17-9/19/17&Starting=3099","HTTP_CONNECTION":"Keep-Alive","REQUEST_METHOD":"GET","HTTP_HOST":"bluesunshinetravel.com"}]},
{"EntryDate":"2016-12-03 12:48:05 -05:00","Time":"12:48:05","Level":"WARN","Message":[{"Rule":"bots_hotels_forms","REMOTE_HOST":"184.154.139.18","URL":"/common/sign-in.html","HTTP_REFERER":"","HTTPS":"off","HTTP_USER_AGENT":"SiteLockSpider [en] (WinNT; I ;Nav)","QUERY_STRING":"","HTTP_CONNECTION":"TE, close","REQUEST_METHOD":"GET","HTTP_HOST":"agentrosetravel.com"}]},
{"EntryDate":"2016-12-03 13:18:24 -05:00","Time":"13:18:24","Level":"WARN","Message":[{"Rule":"bots_hotels_forms","REMOTE_HOST":"184.154.139.24","URL":"/common/sign-in.html","HTTP_REFERER":"","HTTPS":"off","HTTP_USER_AGENT":"SiteLockSpider [en] (WinNT; I ;Nav)","QUERY_STRING":"","HTTP_CONNECTION":"TE, close","REQUEST_METHOD":"GET","HTTP_HOST":"ilovedestinations.com"}]},
{"EntryDate":"2016-12-03 13:21:09 -05:00","Time":"13:21:09","Level":"WARN","Message":[{"Rule":"bots_hotels_forms","REMOTE_HOST":"207.46.13.30","URL":"/request-quote.html","HTTP_REFERER":"","HTTPS":"off","HTTP_USER_AGENT":"Mozilla/5.0 (compatible; bingbot/2.0; +http://www.bing.com/bingbot.htm)","QUERY_STRING":"DealURL=central-european-experience-cruise-only-westbound&DealType=Cruise&Dates=6/6/17-6/13/17&Starting=3049","HTTP_CONNECTION":"Keep-Alive","REQUEST_METHOD":"GET","HTTP_HOST":"bluesunshinetravel.com"}]},
{"EntryDate":"2016-12-03 13:37:45 -05:00","Time":"13:37:45","Level":"WARN","Message":[{"Rule":"bots_hotels_forms","REMOTE_HOST":"207.46.13.163","URL":"/send-to-a-friend.html","HTTP_REFERER":"","HTTPS":"off","HTTP_USER_AGENT":"Mozilla/5.0 (compatible; bingbot/2.0; +http://www.bing.com/bingbot.htm)","QUERY_STRING":"seourl=viva-wyndham-fortuna-beach-all-inclusive-2&DealType=Promotion","HTTP_CONNECTION":"Keep-Alive","REQUEST_METHOD":"GET","HTTP_HOST":"bluesunshinetravel.com"}]},
{"EntryDate":"2016-12-03 13:46:22 -05:00","Time":"13:46:22","Level":"WARN","Message":[{"Rule":"bots_hotels_forms","REMOTE_HOST":"157.55.39.154","URL":"/common/sign-in.html","HTTP_REFERER":"","HTTPS":"off","HTTP_USER_AGENT":"Mozilla/5.0 (compatible; bingbot/2.0; +http://www.bing.com/bingbot.htm)","QUERY_STRING":"","HTTP_CONNECTION":"Keep-Alive","REQUEST_METHOD":"GET","HTTP_HOST":"nashtravels.agentstudio.com"}]},
{"EntryDate":"2016-12-03 13:48:11 -05:00","Time":"13:48:11","Level":"WARN","Message":[{"Rule":"bots_hotels_forms","REMOTE_HOST":"157.55.39.5","URL":"/common/sign-in.html","HTTP_REFERER":"","HTTPS":"off","HTTP_USER_AGENT":"Mozilla/5.0 (compatible; bingbot/2.0; +http://www.bing.com/bingbot.htm)","QUERY_STRING":"","HTTP_CONNECTION":"Keep-Alive","REQUEST_METHOD":"GET","HTTP_HOST":"newdimensionstravel.com"}]},
{"EntryDate":"2016-12-03 13:59:45 -05:00","Time":"13:59:45","Level":"WARN","Message":[{"Rule":"bots_hotels_forms","REMOTE_HOST":"207.46.13.118","URL":"/request-quote.html","HTTP_REFERER":"","HTTPS":"off","HTTP_USER_AGENT":"Mozilla/5.0 (compatible; bingbot/2.0; +http://www.bing.com/bingbot.htm)","QUERY_STRING":"DealURL=cuba-libre-sailing&DealType=Tour&Dates=7/9/16-7/23/16&Starting=2979.00","HTTP_CONNECTION":"Keep-Alive","REQUEST_METHOD":"GET","HTTP_HOST":"bluesunshinetravel.com"}]},
{"EntryDate":"2016-12-03 14:24:33 -05:00","Time":"14:24:33","Level":"WARN","Message":[{"Rule":"bots_hotels_forms","REMOTE_HOST":"40.77.167.7","URL":"/request-quote.html","HTTP_REFERER":"","HTTPS":"off","HTTP_USER_AGENT":"Mozilla/5.0 (compatible; bingbot/2.0; +http://www.bing.com/bingbot.htm)","QUERY_STRING":"DealURL=highlights-of-tajikistan&DealType=Tour&Dates=6/15/16-6/20/16&Starting=799.00","HTTP_CONNECTION":"Keep-Alive","REQUEST_METHOD":"GET","HTTP_HOST":"bluesunshinetravel.com"}]},
{"EntryDate":"2016-12-03 14:29:28 -05:00","Time":"14:29:28","Level":"WARN","Message":[{"Rule":"bots_hotels_forms","REMOTE_HOST":"207.46.13.118","URL":"/request-quote.html","HTTP_REFERER":"","HTTPS":"off","HTTP_USER_AGENT":"Mozilla/5.0 (compatible; bingbot/2.0; +http://www.bing.com/bingbot.htm)","QUERY_STRING":"DealURL=local-living-italysorrento&DealType=Tour&Dates=9/24/17-9/30/17&Starting=1799.00","HTTP_CONNECTION":"Keep-Alive","REQUEST_METHOD":"GET","HTTP_HOST":"bluesunshinetravel.com"}]},
{"EntryDate":"2016-12-03 14:38:45 -05:00","Time":"14:38:45","Level":"WARN","Message":[{"Rule":"pageview","REMOTE_HOST":"82.80.249.192","URL":"/promotions/beach-palace-all-inclusive-2.html","HTTP_REFERER":"http://hoppervacations.com/cruises/11-night-canada-cruise-7.html","HTTPS":"off","HTTP_USER_AGENT":"Mozilla/5.0 (Windows NT 6.1; WOW64; Trident/7.0; rv:11.0) like Gecko","QUERY_STRING":"","HTTP_CONNECTION":"","REQUEST_METHOD":"GET","HTTP_HOST":"hoppervacations.com"}]},
{"EntryDate":"2016-12-03 14:42:37 -05:00","Time":"14:42:37","Level":"WARN","Message":[{"Rule":"pageview","REMOTE_HOST":"82.80.249.192","URL":"/request-quote.html","HTTP_REFERER":"http://www.hoppervacations.com/cruises/10-night-canada-colonial-coast-cruise-2.html","HTTPS":"off","HTTP_USER_AGENT":"Mozilla/5.0 (Windows NT 6.2; WOW64; rv:26.0) Gecko/20100101 Firefox/26.0","QUERY_STRING":"DealURL=10-night-canada-colonial-coast-cruise-2&DealType=Cruise&Dates=10/16/18-10/26/18&Starting=6850","HTTP_CONNECTION":"","REQUEST_METHOD":"GET","HTTP_HOST":"hoppervacations.com"}]},
{"EntryDate":"2016-12-03 14:48:08 -05:00","Time":"14:48:08","Level":"WARN","Message":[{"Rule":"pageview","REMOTE_HOST":"82.80.249.192","URL":"/request-quote.html","HTTP_REFERER":"http://hoppervacations.com/tours/florida-discovery-with-extended-stay-in-clearwater-beach.html","HTTPS":"off","HTTP_USER_AGENT":"Mozilla/5.0 (Windows NT 6.1; WOW64; rv:27.0) Gecko/20100101 Firefox/27.0","QUERY_STRING":"DealURL=florida-discovery-with-extended-stay-in-clearwater-beach&DealType=Tour","HTTP_CONNECTION":"","REQUEST_METHOD":"GET","HTTP_HOST":"hoppervacations.com"}]},
{"EntryDate":"2016-12-03 14:54:28 -05:00","Time":"14:54:28","Level":"WARN","Message":[{"Rule":"bots_hotels_forms","REMOTE_HOST":"184.154.139.21","URL":"/request-quote.html","HTTP_REFERER":"","HTTPS":"off","HTTP_USER_AGENT":"SiteLockSpider [en] (WinNT; I ;Nav)","QUERY_STRING":"DealURL=10-day-eastern-caribbean-6&DealType=Promotion","HTTP_CONNECTION":"TE, close","REQUEST_METHOD":"GET","HTTP_HOST":"grabyourbagstravel.com"}]},
{"EntryDate":"2016-12-03 15:09:46 -05:00","Time":"15:09:46","Level":"WARN","Message":[{"Rule":"bots_hotels_forms","REMOTE_HOST":"40.77.167.7","URL":"/send-to-a-friend.html","HTTP_REFERER":"","HTTPS":"off","HTTP_USER_AGENT":"Mozilla/5.0 (compatible; bingbot/2.0; +http://www.bing.com/bingbot.htm)","QUERY_STRING":"seourl=109-night-world-cruise-2","HTTP_CONNECTION":"Keep-Alive","REQUEST_METHOD":"GET","HTTP_HOST":"bluesunshinetravel.com"}]},
{"EntryDate":"2016-12-03 15:30:26 -05:00","Time":"15:30:26","Level":"WARN","Message":[{"Rule":"bots_hotels_forms","REMOTE_HOST":"207.46.13.118","URL":"/request-quote.html","HTTP_REFERER":"","HTTPS":"off","HTTP_USER_AGENT":"Mozilla/5.0 (compatible; bingbot/2.0; +http://www.bing.com/bingbot.htm)","QUERY_STRING":"DealURL=flavors-of-india-2018&DealType=Tour&Dates=11/14/17-11/25/17&Starting=1639","HTTP_CONNECTION":"Keep-Alive","REQUEST_METHOD":"GET","HTTP_HOST":"bluesunshinetravel.com"}]},
{"EntryDate":"2016-12-03 16:05:29 -05:00","Time":"16:05:29","Level":"WARN","Message":[{"Rule":"bots_hotels_forms","REMOTE_HOST":"157.55.39.19","URL":"/request-quote.html","HTTP_REFERER":"","HTTPS":"off","HTTP_USER_AGENT":"Mozilla/5.0 (compatible; bingbot/2.0; +http://www.bing.com/bingbot.htm)","QUERY_STRING":"DealURL=10-night-northern-europe-cruise-3&DealType=Cruise","HTTP_CONNECTION":"Keep-Alive","REQUEST_METHOD":"GET","HTTP_HOST":"vacationsbyvincent.com"}]},
{"EntryDate":"2016-12-03 16:06:04 -05:00","Time":"16:06:04","Level":"WARN","Message":[{"Rule":"bots_hotels_forms","REMOTE_HOST":"207.46.13.17","URL":"/send-to-a-friend.html","HTTP_REFERER":"","HTTPS":"off","HTTP_USER_AGENT":"Mozilla/5.0 (compatible; bingbot/2.0; +http://www.bing.com/bingbot.htm)","QUERY_STRING":"seourl=10-night-eastern-caribbean-cruise-10","HTTP_CONNECTION":"Keep-Alive","REQUEST_METHOD":"GET","HTTP_HOST":"vacationsbyvincent.com"}]},
{"EntryDate":"2016-12-03 16:17:19 -05:00","Time":"16:17:19","Level":"WARN","Message":[{"Rule":"bots_hotels_forms","REMOTE_HOST":"207.46.13.30","URL":"/request-quote.html","HTTP_REFERER":"","HTTPS":"off","HTTP_USER_AGENT":"Mozilla/5.0 (compatible; bingbot/2.0; +http://www.bing.com/bingbot.htm)","QUERY_STRING":"DealURL=aston-waikiki-beach-hotel&DealType=Tour","HTTP_CONNECTION":"Keep-Alive","REQUEST_METHOD":"GET","HTTP_HOST":"bluesunshinetravel.com"}]},
{"EntryDate":"2016-12-03 16:18:21 -05:00","Time":"16:18:21","Level":"WARN","Message":[{"Rule":"bots_hotels_forms","REMOTE_HOST":"184.154.36.180","URL":"/common/sign-in.html","HTTP_REFERER":"","HTTPS":"off","HTTP_USER_AGENT":"SiteLockSpider [en] (WinNT; I ;Nav)","QUERY_STRING":"","HTTP_CONNECTION":"TE, close","REQUEST_METHOD":"GET","HTTP_HOST":"commonwealthtravel.net"}]},
{"EntryDate":"2016-12-03 16:32:43 -05:00","Time":"16:32:43","Level":"WARN","Message":[{"Rule":"bots_hotels_forms","REMOTE_HOST":"157.55.39.210","URL":"/send-to-a-friend.html","HTTP_REFERER":"","HTTPS":"off","HTTP_USER_AGENT":"Mozilla/5.0 (compatible; bingbot/2.0; +http://www.bing.com/bingbot.htm)","QUERY_STRING":"seourl=7-night-mediterranean-cruise-69","HTTP_CONNECTION":"Keep-Alive","REQUEST_METHOD":"GET","HTTP_HOST":"mau-asamtravel.agentstudio.com"}]},
{"EntryDate":"2016-12-03 16:33:12 -05:00","Time":"16:33:12","Level":"WARN","Message":[{"Rule":"bots_hotels_forms","REMOTE_HOST":"157.55.39.154","URL":"/send-to-a-friend.html","HTTP_REFERER":"","HTTPS":"off","HTTP_USER_AGENT":"Mozilla/5.0 (compatible; bingbot/2.0; +http://www.bing.com/bingbot.htm)","QUERY_STRING":"seourl=rome-to-london-on-a-shoestring","HTTP_CONNECTION":"Keep-Alive","REQUEST_METHOD":"GET","HTTP_HOST":"mau-asamtravel.agentstudio.com"}]},
{"EntryDate":"2016-12-03 16:52:19 -05:00","Time":"16:52:19","Level":"WARN","Message":[{"Rule":"bots_hotels_forms","REMOTE_HOST":"207.46.13.30","URL":"/request-quote.html","HTTP_REFERER":"","HTTPS":"off","HTTP_USER_AGENT":"Mozilla/5.0 (compatible; bingbot/2.0; +http://www.bing.com/bingbot.htm)","QUERY_STRING":"DealURL=spring-savings-from-1999-per-person-on-april-2016-departures&DealType=Cruise","HTTP_CONNECTION":"Keep-Alive","REQUEST_METHOD":"GET","HTTP_HOST":"bluesunshinetravel.com"}]},
{"EntryDate":"2016-12-03 16:55:57 -05:00","Time":"16:55:57","Level":"WARN","Message":[{"Rule":"bots_hotels_forms","REMOTE_HOST":"184.154.248.106","URL":"/request-quote.html","HTTP_REFERER":"","HTTPS":"off","HTTP_USER_AGENT":"SiteLockSpider [en] (WinNT; I ;Nav)","QUERY_STRING":"DealURL=10-day-western-mediterranean-2&DealType=Promotion","HTTP_CONNECTION":"TE, close","REQUEST_METHOD":"GET","HTTP_HOST":"pandora.travel"}]},
{"EntryDate":"2016-12-03 17:08:46 -05:00","Time":"17:08:46","Level":"WARN","Message":[{"Rule":"bots_hotels_forms","REMOTE_HOST":"184.154.164.186","URL":"/request-quote.html","HTTP_REFERER":"","HTTPS":"off","HTTP_USER_AGENT":"SiteLockSpider [en] (WinNT; I ;Nav)","QUERY_STRING":"DealURL=mdm-special-offer&DealType=Tour","HTTP_CONNECTION":"TE, close","REQUEST_METHOD":"GET","HTTP_HOST":"pinnacletrips.com"}]},
{"EntryDate":"2016-12-03 17:51:48 -05:00","Time":"17:51:48","Level":"WARN","Message":[{"Rule":"bots_hotels_forms","REMOTE_HOST":"40.77.167.16","URL":"/common/sign-in.html","HTTP_REFERER":"","HTTPS":"off","HTTP_USER_AGENT":"Mozilla/5.0 (compatible; bingbot/2.0; +http://www.bing.com/bingbot.htm)","QUERY_STRING":"","HTTP_CONNECTION":"Keep-Alive","REQUEST_METHOD":"GET","HTTP_HOST":"oceantooceancruises.agentstudio.com"}]},
{"EntryDate":"2016-12-03 17:59:17 -05:00","Time":"17:59:17","Level":"WARN","Message":[{"Rule":"bots_hotels_forms","REMOTE_HOST":"180.76.15.160","URL":"/request-quote.html","HTTP_REFERER":"","HTTPS":"off","HTTP_USER_AGENT":"Mozilla/5.0 (compatible; Baiduspider/2.0; +http://www.baidu.com/search/spider.html)","QUERY_STRING":"DealURL=30percent-off-200-resort-credit-the-explorean-kohunlich&DealType=promotion","HTTP_CONNECTION":"close","REQUEST_METHOD":"GET","HTTP_HOST":"juleztravel.agentstudio.com"}]},
{"EntryDate":"2016-12-03 18:26:13 -05:00","Time":"18:26:13","Level":"WARN","Message":[{"Rule":"bots_hotels_forms","REMOTE_HOST":"184.154.249.74","URL":"/send-to-a-friend.html","HTTP_REFERER":"","HTTPS":"off","HTTP_USER_AGENT":"SiteLockSpider [en] (WinNT; I ;Nav)","QUERY_STRING":"seourl=memphis-to-clarksville-nashville&DealType=Cruise","HTTP_CONNECTION":"TE, close","REQUEST_METHOD":"GET","HTTP_HOST":"boutiqueta.com"}]},
{"EntryDate":"2016-12-03 18:34:01 -05:00","Time":"18:34:01","Level":"WARN","Message":[{"Rule":"bots_hotels_forms","REMOTE_HOST":"157.55.39.154","URL":"/request-quote.html","HTTP_REFERER":"","HTTPS":"off","HTTP_USER_AGENT":"Mozilla/5.0 (compatible; bingbot/2.0; +http://www.bing.com/bingbot.htm)","QUERY_STRING":"DealURL=13-night-transatlantic-cruise-24&DealType=Cruise&Dates=11/19/16-12/2/16&Starting=626.00","HTTP_CONNECTION":"Keep-Alive","REQUEST_METHOD":"GET","HTTP_HOST":"majesticcruisesandtours.agentstudio.com"}]},
{"EntryDate":"2016-12-03 18:35:01 -05:00","Time":"18:35:01","Level":"WARN","Message":[{"Rule":"bots_hotels_forms","REMOTE_HOST":"157.55.39.210","URL":"/request-quote.html","HTTP_REFERER":"","HTTPS":"off","HTTP_USER_AGENT":"Mozilla/5.0 (compatible; bingbot/2.0; +http://www.bing.com/bingbot.htm)","QUERY_STRING":"DealURL=mekong-savings-2-for-1-airfare&DealType=cruise","HTTP_CONNECTION":"Keep-Alive","REQUEST_METHOD":"GET","HTTP_HOST":"majesticcruisesandtours.agentstudio.com"}]},
{"EntryDate":"2016-12-03 18:47:56 -05:00","Time":"18:47:56","Level":"WARN","Message":[{"Rule":"bots_hotels_forms","REMOTE_HOST":"157.55.39.142","URL":"/request-quote.html","HTTP_REFERER":"","HTTPS":"off","HTTP_USER_AGENT":"Mozilla/5.0 (compatible; bingbot/2.0; +http://www.bing.com/bingbot.htm)","QUERY_STRING":"DealURL=morocco-on-a-shoestring-2&DealType=Tour&Dates=1/7/17-1/21/17&Starting=1449.00","HTTP_CONNECTION":"Keep-Alive","REQUEST_METHOD":"GET","HTTP_HOST":"enchantedlovetravel.com"}]},
{"EntryDate":"2016-12-03 18:48:26 -05:00","Time":"18:48:26","Level":"WARN","Message":[{"Rule":"bots_hotels_forms","REMOTE_HOST":"157.55.39.167","URL":"/request-quote.html","HTTP_REFERER":"","HTTPS":"off","HTTP_USER_AGENT":"Mozilla/5.0 (compatible; bingbot/2.0; +http://www.bing.com/bingbot.htm)","QUERY_STRING":"DealURL=mexicocities-cuisine-ruins&DealType=Tour&Dates=9/3/16-9/17/16&Starting=1249.00","HTTP_CONNECTION":"Keep-Alive","REQUEST_METHOD":"GET","HTTP_HOST":"enchantedlovetravel.com"}]},
{"EntryDate":"2016-12-03 18:48:58 -05:00","Time":"18:48:58","Level":"WARN","Message":[{"Rule":"bots_hotels_forms","REMOTE_HOST":"207.46.13.38","URL":"/request-quote.html","HTTP_REFERER":"","HTTPS":"off","HTTP_USER_AGENT":"Mozilla/5.0 (compatible; bingbot/2.0; +http://www.bing.com/bingbot.htm)","QUERY_STRING":"DealURL=mexicocities-cuisine-ruins&DealType=Tour&Dates=8/27/16-9/10/16&Starting=1299.00","HTTP_CONNECTION":"Keep-Alive","REQUEST_METHOD":"GET","HTTP_HOST":"enchantedlovetravel.com"}]},
{"EntryDate":"2016-12-03 18:49:34 -05:00","Time":"18:49:34","Level":"WARN","Message":[{"Rule":"bots_hotels_forms","REMOTE_HOST":"40.77.167.15","URL":"/request-quote.html","HTTP_REFERER":"","HTTPS":"off","HTTP_USER_AGENT":"Mozilla/5.0 (compatible; bingbot/2.0; +http://www.bing.com/bingbot.htm)","QUERY_STRING":"DealURL=north-america/united-states/california/san-jose&DealType=Destination","HTTP_CONNECTION":"Keep-Alive","REQUEST_METHOD":"GET","HTTP_HOST":"enchantedlovetravel.com"}]},
{"EntryDate":"2016-12-03 18:57:25 -05:00","Time":"18:57:25","Level":"WARN","Message":[{"Rule":"bots_hotels_forms","REMOTE_HOST":"67.212.188.154","URL":"/request-quote.html","HTTP_REFERER":"","HTTPS":"off","HTTP_USER_AGENT":"SiteLockSpider [en] (WinNT; I ;Nav)","QUERY_STRING":"DealURL=east-coast-usa-and-canada-summer-2017&DealType=Tour","HTTP_CONNECTION":"TE, close","REQUEST_METHOD":"GET","HTTP_HOST":"offonvacation.net"}]},
{"EntryDate":"2016-12-03 19:00:52 -05:00","Time":"19:00:52","Level":"WARN","Message":[{"Rule":"bots_hotels_forms","REMOTE_HOST":"207.46.13.22","URL":"/request-quote.html","HTTP_REFERER":"","HTTPS":"off","HTTP_USER_AGENT":"Mozilla/5.0 (compatible; bingbot/2.0; +http://www.bing.com/bingbot.htm)","QUERY_STRING":"DealURL=edinburgh-whisky-break&DealType=tour","HTTP_CONNECTION":"Keep-Alive","REQUEST_METHOD":"GET","HTTP_HOST":"thecarefreetravel.com"}]},
{"EntryDate":"2016-12-03 19:03:14 -05:00","Time":"19:03:14","Level":"WARN","Message":[{"Rule":"bots_hotels_forms","REMOTE_HOST":"40.77.167.7","URL":"/request-quote.html","HTTP_REFERER":"","HTTPS":"off","HTTP_USER_AGENT":"Mozilla/5.0 (compatible; bingbot/2.0; +http://www.bing.com/bingbot.htm)","QUERY_STRING":"DealURL=galpagos-south-central-islands-aboard-the-estrella&DealType=Tour&Dates=2/5/17-2/11/17&Starting=2999.00","HTTP_CONNECTION":"Keep-Alive","REQUEST_METHOD":"GET","HTTP_HOST":"bluesunshinetravel.com"}]},
{"EntryDate":"2016-12-03 19:06:23 -05:00","Time":"19:06:23","Level":"WARN","Message":[{"Rule":"bots_hotels_forms","REMOTE_HOST":"207.46.13.30","URL":"/request-quote.html","HTTP_REFERER":"","HTTPS":"off","HTTP_USER_AGENT":"Mozilla/5.0 (compatible; bingbot/2.0; +http://www.bing.com/bingbot.htm)","QUERY_STRING":"DealURL=burgundy-provence-southbound&DealType=Cruise&Dates=4/28/16-5/8/16&Starting=4149","HTTP_CONNECTION":"Keep-Alive","REQUEST_METHOD":"GET","HTTP_HOST":"bluesunshinetravel.com"}]},
{"EntryDate":"2016-12-03 19:10:47 -05:00","Time":"19:10:47","Level":"WARN","Message":[{"Rule":"bots_hotels_forms","REMOTE_HOST":"207.46.13.118","URL":"/request-quote.html","HTTP_REFERER":"","HTTPS":"off","HTTP_USER_AGENT":"Mozilla/5.0 (compatible; bingbot/2.0; +http://www.bing.com/bingbot.htm)","QUERY_STRING":"DealURL=kuala-lumpur-to-bangkok-adventure&DealType=Tour&Dates=8/5/16-8/16/16&Starting=1399.00","HTTP_CONNECTION":"Keep-Alive","REQUEST_METHOD":"GET","HTTP_HOST":"bluesunshinetravel.com"}]},
{"EntryDate":"2016-12-03 19:15:06 -05:00","Time":"19:15:06","Level":"WARN","Message":[{"Rule":"bots_hotels_forms","REMOTE_HOST":"40.77.167.16","URL":"/common/sign-in.html","HTTP_REFERER":"","HTTPS":"off","HTTP_USER_AGENT":"Mozilla/5.0 (compatible; bingbot/2.0; +http://www.bing.com/bingbot.htm)","QUERY_STRING":"","HTTP_CONNECTION":"Keep-Alive","REQUEST_METHOD":"GET","HTTP_HOST":"tripstipsntours.agentstudio.com"}]},
{"EntryDate":"2016-12-03 19:15:17 -05:00","Time":"19:15:17","Level":"WARN","Message":[{"Rule":"bots_hotels_forms","REMOTE_HOST":"40.77.167.59","URL":"/common/sign-in.html","HTTP_REFERER":"","HTTPS":"off","HTTP_USER_AGENT":"Mozilla/5.0 (compatible; bingbot/2.0; +http://www.bing.com/bingbot.htm)","QUERY_STRING":"","HTTP_CONNECTION":"Keep-Alive","REQUEST_METHOD":"GET","HTTP_HOST":"thewaytogotravel1.agentstudio.com"}]},
{"EntryDate":"2016-12-03 19:15:32 -05:00","Time":"19:15:32","Level":"WARN","Message":[{"Rule":"bots_hotels_forms","REMOTE_HOST":"157.55.39.210","URL":"/common/sign-in.html","HTTP_REFERER":"","HTTPS":"off","HTTP_USER_AGENT":"Mozilla/5.0 (compatible; bingbot/2.0; +http://www.bing.com/bingbot.htm)","QUERY_STRING":"","HTTP_CONNECTION":"Keep-Alive","REQUEST_METHOD":"GET","HTTP_HOST":"vickysvacationsllc.agentstudio.com"}]},
{"EntryDate":"2016-12-03 19:16:31 -05:00","Time":"19:16:31","Level":"WARN","Message":[{"Rule":"bots_hotels_forms","REMOTE_HOST":"157.55.39.154","URL":"/common/sign-in.html","HTTP_REFERER":"","HTTPS":"off","HTTP_USER_AGENT":"Mozilla/5.0 (compatible; bingbot/2.0; +http://www.bing.com/bingbot.htm)","QUERY_STRING":"","HTTP_CONNECTION":"Keep-Alive","REQUEST_METHOD":"GET","HTTP_HOST":"travel4.agentstudio.com"}]},
{"EntryDate":"2016-12-03 19:17:37 -05:00","Time":"19:17:37","Level":"WARN","Message":[{"Rule":"bots_hotels_forms","REMOTE_HOST":"157.55.39.179","URL":"/send-to-a-friend.html","HTTP_REFERER":"","HTTPS":"off","HTTP_USER_AGENT":"Mozilla/5.0 (compatible; bingbot/2.0; +http://www.bing.com/bingbot.htm)","QUERY_STRING":"seourl=tokyo-4-days-3-nights-modular","HTTP_CONNECTION":"Keep-Alive","REQUEST_METHOD":"GET","HTTP_HOST":"travelunlimited.net"}]},
{"EntryDate":"2016-12-03 19:20:07 -05:00","Time":"19:20:07","Level":"WARN","Message":[{"Rule":"bots_hotels_forms","REMOTE_HOST":"207.46.13.30","URL":"/request-quote.html","HTTP_REFERER":"","HTTPS":"off","HTTP_USER_AGENT":"Mozilla/5.0 (compatible; bingbot/2.0; +http://www.bing.com/bingbot.htm)","QUERY_STRING":"DealURL=falls-beaches-serengeti-adventure-northbound&DealType=Tour&Dates=7/2/16-7/28/16&Starting=4299.00","HTTP_CONNECTION":"Keep-Alive","REQUEST_METHOD":"GET","HTTP_HOST":"bluesunshinetravel.com"}]},
{"EntryDate":"2016-12-03 19:20:13 -05:00","Time":"19:20:13","Level":"WARN","Message":[{"Rule":"bots_hotels_forms","REMOTE_HOST":"207.46.13.105","URL":"/send-to-a-friend.html","HTTP_REFERER":"","HTTPS":"off","HTTP_USER_AGENT":"Mozilla/5.0 (compatible; bingbot/2.0; +http://www.bing.com/bingbot.htm)","QUERY_STRING":"seourl=epic-trans-siberian-journey","HTTP_CONNECTION":"Keep-Alive","REQUEST_METHOD":"GET","HTTP_HOST":"travelunlimited.net"}]},
{"EntryDate":"2016-12-03 19:25:35 -05:00","Time":"19:25:35","Level":"WARN","Message":[{"Rule":"bots_hotels_forms","REMOTE_HOST":"207.46.13.118","URL":"/request-quote.html","HTTP_REFERER":"","HTTPS":"off","HTTP_USER_AGENT":"Mozilla/5.0 (compatible; bingbot/2.0; +http://www.bing.com/bingbot.htm)","QUERY_STRING":"DealURL=300-boating-fuel-credit-offer-7&DealType=Resort","HTTP_CONNECTION":"Keep-Alive","REQUEST_METHOD":"GET","HTTP_HOST":"bluesunshinetravel.com"}]},
{"EntryDate":"2016-12-03 19:56:08 -05:00","Time":"19:56:08","Level":"WARN","Message":[{"Rule":"bots_hotels_forms","REMOTE_HOST":"157.55.39.250","URL":"/request-quote.html","HTTP_REFERER":"","HTTPS":"off","HTTP_USER_AGENT":"Mozilla/5.0 (compatible; bingbot/2.0; +http://www.bing.com/bingbot.htm)","QUERY_STRING":"DealURL=4-night-western-caribbean-itiner-10&DealType=cruise","HTTP_CONNECTION":"Keep-Alive","REQUEST_METHOD":"GET","HTTP_HOST":"tlcbluewatertravel.com"}]},
{"EntryDate":"2016-12-03 19:56:43 -05:00","Time":"19:56:43","Level":"WARN","Message":[{"Rule":"bots_hotels_forms","REMOTE_HOST":"207.46.13.176","URL":"/request-quote.html","HTTP_REFERER":"","HTTPS":"off","HTTP_USER_AGENT":"Mozilla/5.0 (compatible; bingbot/2.0; +http://www.bing.com/bingbot.htm)","QUERY_STRING":"DealURL=4-day-bahamas-from-miami&DealType=cruise","HTTP_CONNECTION":"Keep-Alive","REQUEST_METHOD":"GET","HTTP_HOST":"tlcbluewatertravel.com"}]},
{"EntryDate":"2016-12-03 20:12:27 -05:00","Time":"20:12:27","Level":"WARN","Message":[{"Rule":"bots_hotels_forms","REMOTE_HOST":"157.55.39.115","URL":"/send-to-a-friend.html","HTTP_REFERER":"","HTTPS":"off","HTTP_USER_AGENT":"Mozilla/5.0 (compatible; bingbot/2.0; +http://www.bing.com/bingbot.htm)","QUERY_STRING":"seourl=the-buccaneer-3","HTTP_CONNECTION":"Keep-Alive","REQUEST_METHOD":"GET","HTTP_HOST":"globalathleteadventures.com"}]},
{"EntryDate":"2016-12-03 20:34:36 -05:00","Time":"20:34:36","Level":"WARN","Message":[{"Rule":"bots_hotels_forms","REMOTE_HOST":"157.55.39.145","URL":"/send-to-a-friend.html","HTTP_REFERER":"","HTTPS":"off","HTTP_USER_AGENT":"Mozilla/5.0 (compatible; bingbot/2.0; +http://www.bing.com/bingbot.htm)","QUERY_STRING":"seourl=discover-the-galpagos-peru-with-the-amazon","HTTP_CONNECTION":"Keep-Alive","REQUEST_METHOD":"GET","HTTP_HOST":"execufirst.com"}]},
{"EntryDate":"2016-12-03 20:35:47 -05:00","Time":"20:35:47","Level":"WARN","Message":[{"Rule":"bots_hotels_forms","REMOTE_HOST":"184.154.36.181","URL":"/common/sign-in.html","HTTP_REFERER":"","HTTPS":"off","HTTP_USER_AGENT":"SiteLockSpider [en] (WinNT; I ;Nav)","QUERY_STRING":"","HTTP_CONNECTION":"TE, close","REQUEST_METHOD":"GET","HTTP_HOST":"onthewaytravel.net"}]},
{"EntryDate":"2016-12-03 20:43:35 -05:00","Time":"20:43:35","Level":"WARN","Message":[{"Rule":"bots_hotels_forms","REMOTE_HOST":"40.77.167.20","URL":"/request-quote.html","HTTP_REFERER":"","HTTPS":"off","HTTP_USER_AGENT":"Mozilla/5.0 (compatible; bingbot/2.0; +http://www.bing.com/bingbot.htm)","QUERY_STRING":"DealURL=cuba-libre-and-sailing&DealType=Tour&Dates=3/19/16-4/2/16&Starting=2799.00","HTTP_CONNECTION":"Keep-Alive","REQUEST_METHOD":"GET","HTTP_HOST":"execufirst.com"}]},
{"EntryDate":"2016-12-03 21:02:25 -05:00","Time":"21:02:25","Level":"WARN","Message":[{"Rule":"bots_hotels_forms","REMOTE_HOST":"157.55.39.145","URL":"/request-quote.html","HTTP_REFERER":"","HTTPS":"off","HTTP_USER_AGENT":"Mozilla/5.0 (compatible; bingbot/2.0; +http://www.bing.com/bingbot.htm)","QUERY_STRING":"DealURL=discover-the-galpagos-peru-with-the-amazon&DealType=Cruise&Dates=12/7/16-12/25/16&Starting=7559","HTTP_CONNECTION":"Keep-Alive","REQUEST_METHOD":"GET","HTTP_HOST":"execufirst.com"}]},
{"EntryDate":"2016-12-03 21:03:29 -05:00","Time":"21:03:29","Level":"WARN","Message":[{"Rule":"bots_hotels_forms","REMOTE_HOST":"157.55.39.154","URL":"/request-quote.html","HTTP_REFERER":"","HTTPS":"off","HTTP_USER_AGENT":"Mozilla/5.0 (compatible; bingbot/2.0; +http://www.bing.com/bingbot.htm)","QUERY_STRING":"DealURL=500th-anniversary-of-the-reformation-faith-based-travel&DealType=Tour","HTTP_CONNECTION":"Keep-Alive","REQUEST_METHOD":"GET","HTTP_HOST":"merciertravel.agentstudio.com"}]},
{"EntryDate":"2016-12-03 21:04:45 -05:00","Time":"21:04:45","Level":"WARN","Message":[{"Rule":"bots_hotels_forms","REMOTE_HOST":"207.46.13.156","URL":"/request-quote.html","HTTP_REFERER":"","HTTPS":"off","HTTP_USER_AGENT":"Mozilla/5.0 (compatible; bingbot/2.0; +http://www.bing.com/bingbot.htm)","QUERY_STRING":"DealURL=10-day-panama-canal-sunfarer&DealType=cruise","HTTP_CONNECTION":"Keep-Alive","REQUEST_METHOD":"GET","HTTP_HOST":"merciertravel.agentstudio.com"}]},
{"EntryDate":"2016-12-03 21:06:02 -05:00","Time":"21:06:02","Level":"WARN","Message":[{"Rule":"bots_hotels_forms","REMOTE_HOST":"40.77.167.59","URL":"/request-quote.html","HTTP_REFERER":"","HTTPS":"off","HTTP_USER_AGENT":"Mozilla/5.0 (compatible; bingbot/2.0; +http://www.bing.com/bingbot.htm)","QUERY_STRING":"DealURL=4-night-bahamas-cruise-5&DealType=cruise","HTTP_CONNECTION":"Keep-Alive","REQUEST_METHOD":"GET","HTTP_HOST":"merciertravel.agentstudio.com"}]},
{"EntryDate":"2016-12-03 21:10:11 -05:00","Time":"21:10:11","Level":"WARN","Message":[{"Rule":"bots_hotels_forms","REMOTE_HOST":"157.55.39.210","URL":"/request-quote.html","HTTP_REFERER":"","HTTPS":"off","HTTP_USER_AGENT":"Mozilla/5.0 (compatible; bingbot/2.0; +http://www.bing.com/bingbot.htm)","QUERY_STRING":"DealURL=3-night-baja-mexico-4&DealType=cruise","HTTP_CONNECTION":"Keep-Alive","REQUEST_METHOD":"GET","HTTP_HOST":"merciertravel.agentstudio.com"}]},
{"EntryDate":"2016-12-03 21:16:08 -05:00","Time":"21:16:08","Level":"WARN","Message":[{"Rule":"bots_hotels_forms","REMOTE_HOST":"157.55.39.52","URL":"/send-to-a-friend.html","HTTP_REFERER":"","HTTPS":"off","HTTP_USER_AGENT":"Mozilla/5.0 (compatible; bingbot/2.0; +http://www.bing.com/bingbot.htm)","QUERY_STRING":"seourl=occidental-grand-papagayo","HTTP_CONNECTION":"Keep-Alive","REQUEST_METHOD":"GET","HTTP_HOST":"execufirst.com"}]},
{"EntryDate":"2016-12-03 21:26:20 -05:00","Time":"21:26:20","Level":"WARN","Message":[{"Rule":"bots_hotels_forms","REMOTE_HOST":"207.46.13.56","URL":"/request-quote.html","HTTP_REFERER":"","HTTPS":"off","HTTP_USER_AGENT":"Mozilla/5.0 (compatible; bingbot/2.0; +http://www.bing.com/bingbot.htm)","QUERY_STRING":"DealURL=christmastime-zrich-to-prague&DealType=Cruise","HTTP_CONNECTION":"Keep-Alive","REQUEST_METHOD":"GET","HTTP_HOST":"tlcbluewatertravel.com"}]},
{"EntryDate":"2016-12-03 21:36:36 -05:00","Time":"21:36:36","Level":"WARN","Message":[{"Rule":"bots_hotels_forms","REMOTE_HOST":"40.77.167.59","URL":"/send-to-a-friend.html","HTTP_REFERER":"","HTTPS":"off","HTTP_USER_AGENT":"Mozilla/5.0 (compatible; bingbot/2.0; +http://www.bing.com/bingbot.htm)","QUERY_STRING":"seourl=honeymoon-amenities-promotion","HTTP_CONNECTION":"Keep-Alive","REQUEST_METHOD":"GET","HTTP_HOST":"inveljtravel.agentstudio.com"}]},
{"EntryDate":"2016-12-03 21:38:21 -05:00","Time":"21:38:21","Level":"WARN","Message":[{"Rule":"bots_hotels_forms","REMOTE_HOST":"157.55.39.210","URL":"/request-quote.html","HTTP_REFERER":"","HTTPS":"off","HTTP_USER_AGENT":"Mozilla/5.0 (compatible; bingbot/2.0; +http://www.bing.com/bingbot.htm)","QUERY_STRING":"DealURL=south-america-cruise-chilean-fjords&DealType=Tour","HTTP_CONNECTION":"Keep-Alive","REQUEST_METHOD":"GET","HTTP_HOST":"inveljtravel.agentstudio.com"}]},
{"EntryDate":"2016-12-03 21:38:51 -05:00","Time":"21:38:51","Level":"WARN","Message":[{"Rule":"bots_hotels_forms","REMOTE_HOST":"157.55.39.125","URL":"/control-panel/main.html","HTTP_REFERER":"","HTTPS":"off","HTTP_USER_AGENT":"Mozilla/5.0 (compatible; bingbot/2.0; +http://www.bing.com/bingbot.htm)","QUERY_STRING":"","HTTP_CONNECTION":"Keep-Alive","REQUEST_METHOD":"GET","HTTP_HOST":"creativecruiseandtravel.com"}]},
{"EntryDate":"2016-12-03 21:38:56 -05:00","Time":"21:38:56","Level":"WARN","Message":[{"Rule":"bots_hotels_forms","REMOTE_HOST":"207.46.13.156","URL":"/common/sign-in.html","HTTP_REFERER":"","HTTPS":"off","HTTP_USER_AGENT":"Mozilla/5.0 (compatible; bingbot/2.0; +http://www.bing.com/bingbot.htm)","QUERY_STRING":"","HTTP_CONNECTION":"Keep-Alive","REQUEST_METHOD":"GET","HTTP_HOST":"daisystravelagency.agentstudio.com"}]},
{"EntryDate":"2016-12-03 21:39:01 -05:00","Time":"21:39:01","Level":"WARN","Message":[{"Rule":"bots_hotels_forms","REMOTE_HOST":"157.55.39.154","URL":"/request-quote.html","HTTP_REFERER":"","HTTPS":"off","HTTP_USER_AGENT":"Mozilla/5.0 (compatible; bingbot/2.0; +http://www.bing.com/bingbot.htm)","QUERY_STRING":"DealURL=alaska-adventure-cruise&DealType=Tour&Dates=9/22/17-10/1/17&Starting=2039","HTTP_CONNECTION":"Keep-Alive","REQUEST_METHOD":"GET","HTTP_HOST":"inveljtravel.agentstudio.com"}]},
{"EntryDate":"2016-12-03 21:48:38 -05:00","Time":"21:48:38","Level":"WARN","Message":[{"Rule":"bots_hotels_forms","REMOTE_HOST":"184.154.139.48","URL":"/common/sign-in.html","HTTP_REFERER":"","HTTPS":"off","HTTP_USER_AGENT":"SiteLockSpider [en] (WinNT; I ;Nav)","QUERY_STRING":"","HTTP_CONNECTION":"TE, close","REQUEST_METHOD":"GET","HTTP_HOST":"tagalongtravels.com"}]},
{"EntryDate":"2016-12-03 21:56:02 -05:00","Time":"21:56:02","Level":"WARN","Message":[{"Rule":"bots_hotels_forms","REMOTE_HOST":"157.55.39.145","URL":"/send-to-a-friend.html","HTTP_REFERER":"","HTTPS":"off","HTTP_USER_AGENT":"Mozilla/5.0 (compatible; bingbot/2.0; +http://www.bing.com/bingbot.htm)","QUERY_STRING":"seourl=30-day-circle-hawaii-tahiti-marquesas","HTTP_CONNECTION":"Keep-Alive","REQUEST_METHOD":"GET","HTTP_HOST":"execufirst.com"}]},
{"EntryDate":"2016-12-03 22:01:15 -05:00","Time":"22:01:15","Level":"WARN","Message":[{"Rule":"bots_hotels_forms","REMOTE_HOST":"157.55.39.210","URL":"/request-quote.html","HTTP_REFERER":"","HTTPS":"off","HTTP_USER_AGENT":"Mozilla/5.0 (compatible; bingbot/2.0; +http://www.bing.com/bingbot.htm)","QUERY_STRING":"DealURL=annapurna-sanctuary&DealType=Tour&Dates=7/24/16-8/7/16&Starting=1249.00","HTTP_CONNECTION":"Keep-Alive","REQUEST_METHOD":"GET","HTTP_HOST":"sunnyskiestravel.agentstudio.com"}]},
{"EntryDate":"2016-12-03 22:01:37 -05:00","Time":"22:01:37","Level":"WARN","Message":[{"Rule":"bots_hotels_forms","REMOTE_HOST":"208.43.225.85","URL":"/send-to-a-friend.html","HTTP_REFERER":"","HTTPS":"off","HTTP_USER_AGENT":"Mozilla/5.0 (compatible; SiteExplorer/1.1b; +http://siteexplorer.info/Backlink-Checker-Spider/)","QUERY_STRING":"","HTTP_CONNECTION":"Keep-Alive","REQUEST_METHOD":"GET","HTTP_HOST":"mccartneytravel.com"}]},
{"EntryDate":"2016-12-03 22:03:18 -05:00","Time":"22:03:18","Level":"WARN","Message":[{"Rule":"bots_hotels_forms","REMOTE_HOST":"157.55.39.154","URL":"/request-quote.html","HTTP_REFERER":"","HTTPS":"off","HTTP_USER_AGENT":"Mozilla/5.0 (compatible; bingbot/2.0; +http://www.bing.com/bingbot.htm)","QUERY_STRING":"DealURL=annapurna-sanctuary&DealType=Tour&Dates=6/5/16-6/19/16&Starting=1249.00","HTTP_CONNECTION":"Keep-Alive","REQUEST_METHOD":"GET","HTTP_HOST":"sunnyskiestravel.agentstudio.com"}]},
{"EntryDate":"2016-12-03 22:21:26 -05:00","Time":"22:21:26","Level":"WARN","Message":[{"Rule":"bots_hotels_forms","REMOTE_HOST":"157.55.39.210","URL":"/common/sign-in.html","HTTP_REFERER":"","HTTPS":"off","HTTP_USER_AGENT":"Mozilla/5.0 (compatible; bingbot/2.0; +http://www.bing.com/bingbot.htm)","QUERY_STRING":"","HTTP_CONNECTION":"Keep-Alive","REQUEST_METHOD":"GET","HTTP_HOST":"travelticketbooking.agentstudio.com"}]},
{"EntryDate":"2016-12-03 22:21:36 -05:00","Time":"22:21:36","Level":"WARN","Message":[{"Rule":"bots_hotels_forms","REMOTE_HOST":"107.6.137.74","URL":"/send-to-a-friend.html","HTTP_REFERER":"","HTTPS":"off","HTTP_USER_AGENT":"SiteLockSpider [en] (WinNT; I ;Nav)","QUERY_STRING":"seourl=memphis-to-louisville-2&DealType=Cruise","HTTP_CONNECTION":"TE, close","REQUEST_METHOD":"GET","HTTP_HOST":"irishcuetravel.com"}]},
{"EntryDate":"2016-12-03 22:28:58 -05:00","Time":"22:28:58","Level":"WARN","Message":[{"Rule":"bots_hotels_forms","REMOTE_HOST":"40.77.167.59","URL":"/request-quote.html","HTTP_REFERER":"","HTTPS":"off","HTTP_USER_AGENT":"Mozilla/5.0 (compatible; bingbot/2.0; +http://www.bing.com/bingbot.htm)","QUERY_STRING":"DealURL=discover-southeast-asia&DealType=Tour&Dates=3/12/16-3/29/16&Starting=3899.00","HTTP_CONNECTION":"Keep-Alive","REQUEST_METHOD":"GET","HTTP_HOST":"militaryreunions.agentstudio.com"}]},
{"EntryDate":"2016-12-03 22:35:11 -05:00","Time":"22:35:11","Level":"WARN","Message":[{"Rule":"bots_hotels_forms","REMOTE_HOST":"157.55.39.154","URL":"/request-quote.html","HTTP_REFERER":"","HTTPS":"off","HTTP_USER_AGENT":"Mozilla/5.0 (compatible; bingbot/2.0; +http://www.bing.com/bingbot.htm)","QUERY_STRING":"DealURL=southeast-asia-in-depth&DealType=Tour","HTTP_CONNECTION":"Keep-Alive","REQUEST_METHOD":"GET","HTTP_HOST":"militaryreunions.agentstudio.com"}]},
{"EntryDate":"2016-12-03 22:38:24 -05:00","Time":"22:38:24","Level":"WARN","Message":[{"Rule":"bots_hotels_forms","REMOTE_HOST":"157.55.39.52","URL":"/request-quote.html","HTTP_REFERER":"","HTTPS":"off","HTTP_USER_AGENT":"Mozilla/5.0 (compatible; bingbot/2.0; +http://www.bing.com/bingbot.htm)","QUERY_STRING":"DealURL=adriatic-adventuredubrovnik-to-athens-2&DealType=Tour&Dates=6/18/16-6/26/16&Starting=1149.00","HTTP_CONNECTION":"Keep-Alive","REQUEST_METHOD":"GET","HTTP_HOST":"execufirst.com"}]},
{"EntryDate":"2016-12-03 23:09:50 -05:00","Time":"23:09:50","Level":"WARN","Message":[{"Rule":"bots_hotels_forms","REMOTE_HOST":"40.77.167.59","URL":"/common/sign-in.html","HTTP_REFERER":"","HTTPS":"off","HTTP_USER_AGENT":"Mozilla/5.0 (compatible; bingbot/2.0; +http://www.bing.com/bingbot.htm)","QUERY_STRING":"","HTTP_CONNECTION":"Keep-Alive","REQUEST_METHOD":"GET","HTTP_HOST":"destiny2travel.agentstudio.com"}]},
{"EntryDate":"2016-12-03 23:12:02 -05:00","Time":"23:12:02","Level":"WARN","Message":[{"Rule":"bots_hotels_forms","REMOTE_HOST":"208.43.225.84","URL":"/request-quote.html","HTTP_REFERER":"","HTTPS":"off","HTTP_USER_AGENT":"Mozilla/5.0 (compatible; SiteExplorer/1.1b; +http://siteexplorer.info/Backlink-Checker-Spider/)","QUERY_STRING":"Starting=916","HTTP_CONNECTION":"Keep-Alive","REQUEST_METHOD":"GET","HTTP_HOST":"gaelicadventures.com"}]},
{"EntryDate":"2016-12-03 23:19:36 -05:00","Time":"23:19:36","Level":"WARN","Message":[{"Rule":"bots_hotels_forms","REMOTE_HOST":"157.55.39.210","URL":"/common/sign-in.html","HTTP_REFERER":"","HTTPS":"off","HTTP_USER_AGENT":"Mozilla/5.0 (compatible; bingbot/2.0; +http://www.bing.com/bingbot.htm)","QUERY_STRING":"ForceDesktopMode=true","HTTP_CONNECTION":"Keep-Alive","REQUEST_METHOD":"GET","HTTP_HOST":"prestigetravelpremier.agentstudio.com"}]},
{"EntryDate":"2016-12-03 23:24:49 -05:00","Time":"23:24:49","Level":"WARN","Message":[{"Rule":"bots_hotels_forms","REMOTE_HOST":"207.46.13.136","URL":"/request-quote.html","HTTP_REFERER":"","HTTPS":"off","HTTP_USER_AGENT":"Mozilla/5.0 (compatible; bingbot/2.0; +http://www.bing.com/bingbot.htm)","QUERY_STRING":"DealURL=avenue-of-the-volcanos-add-on&DealType=Tour&Dates=3/19/16-3/24/16&Starting=1099.00","HTTP_CONNECTION":"Keep-Alive","REQUEST_METHOD":"GET","HTTP_HOST":"execufirst.com"}]},
{"EntryDate":"2016-12-03 23:42:15 -05:00","Time":"23:42:15","Level":"WARN","Message":[{"Rule":"bots_hotels_forms","REMOTE_HOST":"157.55.39.154","URL":"/common/sign-in.html","HTTP_REFERER":"","HTTPS":"off","HTTP_USER_AGENT":"Mozilla/5.0 (compatible; bingbot/2.0; +http://www.bing.com/bingbot.htm)","QUERY_STRING":"","HTTP_CONNECTION":"Keep-Alive","REQUEST_METHOD":"GET","HTTP_HOST":"lizontravel.agentstudio.com"}]},
{"EntryDate":"2016-12-03 23:48:33 -05:00","Time":"23:48:33","Level":"WARN","Message":[{"Rule":"bots_hotels_forms","REMOTE_HOST":"184.154.36.174","URL":"/send-to-a-friend.html","HTTP_REFERER":"","HTTPS":"off","HTTP_USER_AGENT":"SiteLockSpider [en] (WinNT; I ;Nav)","QUERY_STRING":"seourl=thanksgiving-in-new-york-city-2017&DealType=Tour","HTTP_CONNECTION":"TE, close","REQUEST_METHOD":"GET","HTTP_HOST":"marinatours.com"}]},
{"EntryDate":"2016-12-03 23:49:50 -05:00","Time":"23:49:50","Level":"WARN","Message":[{"Rule":"homepage","REMOTE_HOST":"74.220.158.4","URL":"/","HTTP_REFERER":"","HTTPS":"on","HTTP_USER_AGENT":"Mozilla/4.0 (compatible; MSIE 8.0; Windows NT 5.1; Trident/4.0)","QUERY_STRING":"","HTTP_CONNECTION":"Keep-Alive","REQUEST_METHOD":"GET","HTTP_HOST":"16-179-64-69-available.ilandcloud.com"}]},
{"EntryDate":"2016-12-03 23:50:52 -05:00","Time":"23:50:52","Level":"WARN","Message":[{"Rule":"homepage","REMOTE_HOST":"74.220.158.4","URL":"/","HTTP_REFERER":"","HTTPS":"on","HTTP_USER_AGENT":"Mozilla/4.0 (compatible; MSIE 8.0; Windows NT 5.1; Trident/4.0)","QUERY_STRING":"","HTTP_CONNECTION":"Keep-Alive","REQUEST_METHOD":"GET","HTTP_HOST":"16-179-64-69-available.ilandcloud.com"}]},
{"EntryDate":"2016-12-03 23:51:53 -05:00","Time":"23:51:53","Level":"WARN","Message":[{"Rule":"homepage","REMOTE_HOST":"74.220.158.4","URL":"/","HTTP_REFERER":"","HTTPS":"on","HTTP_USER_AGENT":"Mozilla/4.0 (compatible; MSIE 8.0; Windows NT 5.1; Trident/4.0)","QUERY_STRING":"","HTTP_CONNECTION":"Keep-Alive","REQUEST_METHOD":"GET","HTTP_HOST":"16-179-64-69-available.ilandcloud.com"}]},
{"EntryDate":"2016-12-03 23:52:54 -05:00","Time":"23:52:54","Level":"WARN","Message":[{"Rule":"homepage","REMOTE_HOST":"74.220.158.4","URL":"/","HTTP_REFERER":"","HTTPS":"off","HTTP_USER_AGENT":"Mozilla/4.0 (compatible; MSIE 8.0; Windows NT 5.1; Trident/4.0)","QUERY_STRING":"","HTTP_CONNECTION":"Keep-Alive","REQUEST_METHOD":"GET","HTTP_HOST":"16-179-64-69-available.ilandcloud.com"}]},
{"EntryDate":"2016-12-03 23:54:47 -05:00","Time":"23:54:47","Level":"WARN","Message":[{"Rule":"bots_hotels_forms","REMOTE_HOST":"184.154.139.46","URL":"/request-quote.html","HTTP_REFERER":"","HTTPS":"off","HTTP_USER_AGENT":"SiteLockSpider [en] (WinNT; I ;Nav)","QUERY_STRING":"DealURL=cruising-ecuadors-galpagos-islands-2&DealType=Cruise","HTTP_CONNECTION":"TE, close","REQUEST_METHOD":"GET","HTTP_HOST":"grandvoyagetravel.com"}]},
{"EntryDate":"2016-12-03 23:55:08 -05:00","Time":"23:55:08","Level":"WARN","Message":[{"Rule":"bots_hotels_forms","REMOTE_HOST":"207.46.13.136","URL":"/request-quote.html","HTTP_REFERER":"","HTTPS":"off","HTTP_USER_AGENT":"Mozilla/5.0 (compatible; bingbot/2.0; +http://www.bing.com/bingbot.htm)","QUERY_STRING":"DealURL=waikiki-explorer-4-nights-6918&DealType=Tour&Dates=12/11/12-12/15/12&Starting=365","HTTP_CONNECTION":"Keep-Alive","REQUEST_METHOD":"GET","HTTP_HOST":"execufirst.com"}]},
