{"EntryDate":"2016-12-17 00:15:25 -05:00","Time":"00:15:25","Level":"WARN","Message":[{"Rule":"bots_hotels_forms","REMOTE_HOST":"157.55.39.207","URL":"/request-quote.html","HTTP_REFERER":"","HTTPS":"off","HTTP_USER_AGENT":"Mozilla/5.0 (compatible; bingbot/2.0; +http://www.bing.com/bingbot.htm)","QUERY_STRING":"DealURL=southern-divide&DealType=Tour&Dates=10/17/15-11/7/15&Starting=3999.00","HTTP_CONNECTION":"Keep-Alive","REQUEST_METHOD":"GET","HTTP_HOST":"travelbeevacations.agentstudio.com"}]},
{"EntryDate":"2016-12-17 00:16:24 -05:00","Time":"00:16:24","Level":"WARN","Message":[{"Rule":"bots_hotels_forms","REMOTE_HOST":"40.77.167.36","URL":"/request-quote.html","HTTP_REFERER":"","HTTPS":"off","HTTP_USER_AGENT":"Mozilla/5.0 (compatible; bingbot/2.0; +http://www.bing.com/bingbot.htm)","QUERY_STRING":"DealURL=southern-divide&DealType=Tour&Dates=1/9/16-1/30/16&Starting=3999.00","HTTP_CONNECTION":"Keep-Alive","REQUEST_METHOD":"GET","HTTP_HOST":"travelbeevacations.agentstudio.com"}]},
{"EntryDate":"2016-12-17 00:18:02 -05:00","Time":"00:18:02","Level":"WARN","Message":[{"Rule":"bots_hotels_forms","REMOTE_HOST":"207.46.13.90","URL":"/request-quote.html","HTTP_REFERER":"","HTTPS":"off","HTTP_USER_AGENT":"Mozilla/5.0 (compatible; bingbot/2.0; +http://www.bing.com/bingbot.htm)","QUERY_STRING":"DealURL=7-day-st-petersburg-the-baltic&DealType=Cruise&Dates=8/1/15-8/8/15&Starting=4799.00","HTTP_CONNECTION":"Keep-Alive","REQUEST_METHOD":"GET","HTTP_HOST":"travelbeevacations.agentstudio.com"}]},
{"EntryDate":"2016-12-17 00:50:05 -05:00","Time":"00:50:05","Level":"WARN","Message":[{"Rule":"bots_hotels_forms","REMOTE_HOST":"208.43.225.85","URL":"/request-quote.html","HTTP_REFERER":"","HTTPS":"off","HTTP_USER_AGENT":"Mozilla/5.0 (compatible; SiteExplorer/1.1b; +http://siteexplorer.info/Backlink-Checker-Spider/)","QUERY_STRING":"Starting=8450","HTTP_CONNECTION":"Keep-Alive","REQUEST_METHOD":"GET","HTTP_HOST":"wasatchtravel.com"}]},
{"EntryDate":"2016-12-17 01:31:19 -05:00","Time":"01:31:19","Level":"WARN","Message":[{"Rule":"bots_hotels_forms","REMOTE_HOST":"207.46.13.58","URL":"/request-quote.html","HTTP_REFERER":"","HTTPS":"off","HTTP_USER_AGENT":"Mozilla/5.0 (compatible; bingbot/2.0; +http://www.bing.com/bingbot.htm)","QUERY_STRING":"DealURL=colombian-culture-caribbean-lost-city&DealType=Tour&Dates=5/13/17-6/3/17&Starting=3699.00","HTTP_CONNECTION":"Keep-Alive","REQUEST_METHOD":"GET","HTTP_HOST":"romanticinterludestravel.com"}]},
{"EntryDate":"2016-12-17 01:50:27 -05:00","Time":"01:50:27","Level":"WARN","Message":[{"Rule":"bots_hotels_forms","REMOTE_HOST":"184.154.36.168","URL":"/request-quote.html","HTTP_REFERER":"","HTTPS":"off","HTTP_USER_AGENT":"SiteLockSpider [en] (WinNT; I ;Nav)","QUERY_STRING":"DealURL=2016-year-end-sale&DealType=Tour","HTTP_CONNECTION":"TE, close","REQUEST_METHOD":"GET","HTTP_HOST":"oldworldflavors.com"}]},
{"EntryDate":"2016-12-17 02:09:58 -05:00","Time":"02:09:58","Level":"WARN","Message":[{"Rule":"bots_hotels_forms","REMOTE_HOST":"184.154.36.166","URL":"/request-quote.html","HTTP_REFERER":"","HTTPS":"off","HTTP_USER_AGENT":"SiteLockSpider [en] (WinNT; I ;Nav)","QUERY_STRING":"DealURL=12-night-transatlantic-canada-and-new-england&DealType=Cruise","HTTP_CONNECTION":"TE, close","REQUEST_METHOD":"GET","HTTP_HOST":"oaklandtravelagency.com"}]},
{"EntryDate":"2016-12-17 02:31:14 -05:00","Time":"02:31:14","Level":"WARN","Message":[{"Rule":"bots_hotels_forms","REMOTE_HOST":"157.55.39.49","URL":"/request-quote.html","HTTP_REFERER":"","HTTPS":"off","HTTP_USER_AGENT":"Mozilla/5.0 (compatible; bingbot/2.0; +http://www.bing.com/bingbot.htm)","QUERY_STRING":"DealURL=grand-fiesta-american-los-cabos-golf-spa-ai&DealType=Promotion&Dates=1/3/17-1/10/17&Starting=1113","HTTP_CONNECTION":"Keep-Alive","REQUEST_METHOD":"GET","HTTP_HOST":"romanticinterludestravel.com"}]},
{"EntryDate":"2016-12-17 02:50:15 -05:00","Time":"02:50:15","Level":"WARN","Message":[{"Rule":"bots_hotels_forms","REMOTE_HOST":"40.77.167.11","URL":"/request-quote.html","HTTP_REFERER":"","HTTPS":"off","HTTP_USER_AGENT":"Mozilla/5.0 (compatible; bingbot/2.0; +http://www.bing.com/bingbot.htm)","QUERY_STRING":"DealURL=16-nights-polynesian-palette&DealType=Cruise","HTTP_CONNECTION":"Keep-Alive","REQUEST_METHOD":"GET","HTTP_HOST":"a1awesometravel.com"}]},
{"EntryDate":"2016-12-17 02:51:38 -05:00","Time":"02:51:38","Level":"WARN","Message":[{"Rule":"bots_hotels_forms","REMOTE_HOST":"207.46.13.2","URL":"/request-quote.html","HTTP_REFERER":"","HTTPS":"off","HTTP_USER_AGENT":"Mozilla/5.0 (compatible; bingbot/2.0; +http://www.bing.com/bingbot.htm)","QUERY_STRING":"DealURL=24-day-route-of-the-vikings&DealType=Cruise","HTTP_CONNECTION":"Keep-Alive","REQUEST_METHOD":"GET","HTTP_HOST":"a1awesometravel.com"}]},
{"EntryDate":"2016-12-17 02:53:02 -05:00","Time":"02:53:02","Level":"WARN","Message":[{"Rule":"bots_hotels_forms","REMOTE_HOST":"40.77.167.27","URL":"/request-quote.html","HTTP_REFERER":"","HTTPS":"off","HTTP_USER_AGENT":"Mozilla/5.0 (compatible; bingbot/2.0; +http://www.bing.com/bingbot.htm)","QUERY_STRING":"DealURL=17-night-panama-canal-ocean-to-ocean&DealType=Cruise","HTTP_CONNECTION":"Keep-Alive","REQUEST_METHOD":"GET","HTTP_HOST":"a1awesometravel.com"}]},
{"EntryDate":"2016-12-17 03:08:25 -05:00","Time":"03:08:25","Level":"WARN","Message":[{"Rule":"bots_hotels_forms","REMOTE_HOST":"184.154.139.22","URL":"/send-to-a-friend.html","HTTP_REFERER":"","HTTPS":"off","HTTP_USER_AGENT":"SiteLockSpider [en] (WinNT; I ;Nav)","QUERY_STRING":"seourl=12-day-canada-new-englad&DealType=Promotion","HTTP_CONNECTION":"TE, close","REQUEST_METHOD":"GET","HTTP_HOST":"coupdetattravelconsulting.com"}]},
{"EntryDate":"2016-12-17 03:13:00 -05:00","Time":"03:13:00","Level":"WARN","Message":[{"Rule":"bots_hotels_forms","REMOTE_HOST":"40.77.167.1","URL":"/request-quote.html","HTTP_REFERER":"","HTTPS":"off","HTTP_USER_AGENT":"Mozilla/5.0 (compatible; bingbot/2.0; +http://www.bing.com/bingbot.htm)","QUERY_STRING":"DealURL=14-night-mexico-cruise-2&DealType=Cruise","HTTP_CONNECTION":"Keep-Alive","REQUEST_METHOD":"GET","HTTP_HOST":"a1awesometravel.com"}]},
{"EntryDate":"2016-12-17 03:34:11 -05:00","Time":"03:34:11","Level":"WARN","Message":[{"Rule":"bots_hotels_forms","REMOTE_HOST":"178.255.215.66","URL":"/request-quote.html","HTTP_REFERER":"","HTTPS":"off","HTTP_USER_AGENT":"Mozilla/5.0 (compatible; Exabot/3.0; +http://www.exabot.com/go/robot)","QUERY_STRING":"DealURL=15-night-northern-australia-explorer-3&DealType=cruise","HTTP_CONNECTION":"Close","REQUEST_METHOD":"GET","HTTP_HOST":"midmosaver.agentstudio.com"}]},
{"EntryDate":"2016-12-17 03:38:39 -05:00","Time":"03:38:39","Level":"WARN","Message":[{"Rule":"bots_hotels_forms","REMOTE_HOST":"178.255.215.67","URL":"/request-quote.html","HTTP_REFERER":"","HTTPS":"off","HTTP_USER_AGENT":"Mozilla/5.0 (compatible; Exabot/3.0; +http://www.exabot.com/go/robot)","QUERY_STRING":"DealURL=bride-groom-stay-free-20percent-discount-off&DealType=promotion","HTTP_CONNECTION":"Close","REQUEST_METHOD":"GET","HTTP_HOST":"besttravelagentonline.com"}]},
{"EntryDate":"2016-12-17 04:47:24 -05:00","Time":"04:47:24","Level":"WARN","Message":[{"Rule":"bots_hotels_forms","REMOTE_HOST":"184.154.139.17","URL":"/send-to-a-friend.html","HTTP_REFERER":"","HTTPS":"off","HTTP_USER_AGENT":"SiteLockSpider [en] (WinNT; I ;Nav)","QUERY_STRING":"seourl=roundtrip-nashville&DealType=Cruise","HTTP_CONNECTION":"TE, close","REQUEST_METHOD":"GET","HTTP_HOST":"havebagwilltravelagency.com"}]},
{"EntryDate":"2016-12-17 06:16:26 -05:00","Time":"06:16:26","Level":"WARN","Message":[{"Rule":"bots_hotels_forms","REMOTE_HOST":"184.154.139.20","URL":"/send-to-a-friend.html","HTTP_REFERER":"","HTTPS":"off","HTTP_USER_AGENT":"SiteLockSpider [en] (WinNT; I ;Nav)","QUERY_STRING":"seourl=2016-holiday-christmas-markets-sale-8&DealType=Promotion","HTTP_CONNECTION":"TE, close","REQUEST_METHOD":"GET","HTTP_HOST":"travelers-edge.com"}]},
{"EntryDate":"2016-12-17 06:21:43 -05:00","Time":"06:21:43","Level":"WARN","Message":[{"Rule":"bots_hotels_forms","REMOTE_HOST":"208.43.225.84","URL":"/send-to-a-friend.html","HTTP_REFERER":"","HTTPS":"off","HTTP_USER_AGENT":"Mozilla/5.0 (compatible; SiteExplorer/1.1b; +http://siteexplorer.info/Backlink-Checker-Spider/)","QUERY_STRING":"","HTTP_CONNECTION":"Keep-Alive","REQUEST_METHOD":"GET","HTTP_HOST":"adamsglobaltravel.com"}]},
{"EntryDate":"2016-12-17 07:50:32 -05:00","Time":"07:50:32","Level":"WARN","Message":[{"Rule":"bots_hotels_forms","REMOTE_HOST":"184.154.139.20","URL":"/common/sign-in.html","HTTP_REFERER":"","HTTPS":"off","HTTP_USER_AGENT":"SiteLockSpider [en] (WinNT; I ;Nav)","QUERY_STRING":"","HTTP_CONNECTION":"TE, close","REQUEST_METHOD":"GET","HTTP_HOST":"exploretheseven.com"}]},
{"EntryDate":"2016-12-17 07:52:00 -05:00","Time":"07:52:00","Level":"WARN","Message":[{"Rule":"bots_hotels_forms","REMOTE_HOST":"108.163.224.114","URL":"/send-to-a-friend.html","HTTP_REFERER":"","HTTPS":"off","HTTP_USER_AGENT":"SiteLockSpider [en] (WinNT; I ;Nav)","QUERY_STRING":"seourl=12-night-hawaii-cruise-6&DealType=Promotion","HTTP_CONNECTION":"TE, close","REQUEST_METHOD":"GET","HTTP_HOST":"echevarriatravel.com"}]},
{"EntryDate":"2016-12-17 07:54:55 -05:00","Time":"07:54:55","Level":"WARN","Message":[{"Rule":"bots_hotels_forms","REMOTE_HOST":"157.55.39.49","URL":"/request-quote.html","HTTP_REFERER":"","HTTPS":"off","HTTP_USER_AGENT":"Mozilla/5.0 (compatible; bingbot/2.0; +http://www.bing.com/bingbot.htm)","QUERY_STRING":"DealURL=2016-norway-autumn-voyages&DealType=Cruise","HTTP_CONNECTION":"Keep-Alive","REQUEST_METHOD":"GET","HTTP_HOST":"romanticinterludestravel.com"}]},
{"EntryDate":"2016-12-17 08:37:17 -05:00","Time":"08:37:17","Level":"WARN","Message":[{"Rule":"bots_hotels_forms","REMOTE_HOST":"184.154.139.49","URL":"/request-quote.html","HTTP_REFERER":"","HTTPS":"off","HTTP_USER_AGENT":"SiteLockSpider [en] (WinNT; I ;Nav)","QUERY_STRING":"DealURL=8-day-tasmania-2&DealType=Promotion","HTTP_CONNECTION":"TE, close","REQUEST_METHOD":"GET","HTTP_HOST":"travelexplorerelax.com"}]},
{"EntryDate":"2016-12-17 09:47:21 -05:00","Time":"09:47:21","Level":"WARN","Message":[{"Rule":"bots_hotels_forms","REMOTE_HOST":"208.43.225.85","URL":"/send-to-a-friend.html","HTTP_REFERER":"","HTTPS":"off","HTTP_USER_AGENT":"Mozilla/5.0 (compatible; SiteExplorer/1.1b; +http://siteexplorer.info/Backlink-Checker-Spider/)","QUERY_STRING":"","HTTP_CONNECTION":"Keep-Alive","REQUEST_METHOD":"GET","HTTP_HOST":"adventuretravel-inc.com"}]},
{"EntryDate":"2016-12-17 11:42:54 -05:00","Time":"11:42:54","Level":"WARN","Message":[{"Rule":"bots_hotels_forms","REMOTE_HOST":"157.55.39.113","URL":"/request-quote.html","HTTP_REFERER":"","HTTPS":"off","HTTP_USER_AGENT":"Mozilla/5.0 (compatible; bingbot/2.0; +http://www.bing.com/bingbot.htm)","QUERY_STRING":"DealURL=highlights-of-the-south-pacific-with-fiji&DealType=Tour&Dates=10/16/16-11/4/16&Starting=5209","HTTP_CONNECTION":"Keep-Alive","REQUEST_METHOD":"GET","HTTP_HOST":"romanticinterludestravel.com"}]},
{"EntryDate":"2016-12-17 12:10:54 -05:00","Time":"12:10:54","Level":"WARN","Message":[{"Rule":"bots_hotels_forms","REMOTE_HOST":"184.154.36.181","URL":"/common/sign-in.html","HTTP_REFERER":"","HTTPS":"off","HTTP_USER_AGENT":"SiteLockSpider [en] (WinNT; I ;Nav)","QUERY_STRING":"","HTTP_CONNECTION":"TE, close","REQUEST_METHOD":"GET","HTTP_HOST":"mousetowntravel.com"}]},
{"EntryDate":"2016-12-17 12:10:54 -05:00","Time":"12:10:54","Level":"WARN","Message":[{"Rule":"bots_hotels_forms","REMOTE_HOST":"157.55.39.207","URL":"/send-to-a-friend.html","HTTP_REFERER":"","HTTPS":"off","HTTP_USER_AGENT":"Mozilla/5.0 (compatible; bingbot/2.0; +http://www.bing.com/bingbot.htm)","QUERY_STRING":"seourl=air-credit-promotion","HTTP_CONNECTION":"Keep-Alive","REQUEST_METHOD":"GET","HTTP_HOST":"mau-asamtravel.agentstudio.com"}]},
{"EntryDate":"2016-12-17 12:11:15 -05:00","Time":"12:11:15","Level":"WARN","Message":[{"Rule":"bots_hotels_forms","REMOTE_HOST":"207.46.13.6","URL":"/send-to-a-friend.html","HTTP_REFERER":"","HTTPS":"off","HTTP_USER_AGENT":"Mozilla/5.0 (compatible; bingbot/2.0; +http://www.bing.com/bingbot.htm)","QUERY_STRING":"seourl=14-nights-new-zealand-explorer","HTTP_CONNECTION":"Keep-Alive","REQUEST_METHOD":"GET","HTTP_HOST":"mau-asamtravel.agentstudio.com"}]},
{"EntryDate":"2016-12-17 12:12:51 -05:00","Time":"12:12:51","Level":"WARN","Message":[{"Rule":"bots_hotels_forms","REMOTE_HOST":"207.46.13.90","URL":"/send-to-a-friend.html","HTTP_REFERER":"","HTTPS":"off","HTTP_USER_AGENT":"Mozilla/5.0 (compatible; bingbot/2.0; +http://www.bing.com/bingbot.htm)","QUERY_STRING":"seourl=24-day-mediterranean-autumn","HTTP_CONNECTION":"Keep-Alive","REQUEST_METHOD":"GET","HTTP_HOST":"mau-asamtravel.agentstudio.com"}]},
{"EntryDate":"2016-12-17 12:13:09 -05:00","Time":"12:13:09","Level":"WARN","Message":[{"Rule":"bots_hotels_forms","REMOTE_HOST":"40.77.167.36","URL":"/request-quote.html","HTTP_REFERER":"","HTTPS":"off","HTTP_USER_AGENT":"Mozilla/5.0 (compatible; bingbot/2.0; +http://www.bing.com/bingbot.htm)","QUERY_STRING":"DealURL=european-masterpiece&DealType=tour","HTTP_CONNECTION":"Keep-Alive","REQUEST_METHOD":"GET","HTTP_HOST":"mau-asamtravel.agentstudio.com"}]},
{"EntryDate":"2016-12-17 12:19:10 -05:00","Time":"12:19:10","Level":"WARN","Message":[{"Rule":"bots_hotels_forms","REMOTE_HOST":"184.154.139.21","URL":"/common/sign-in.html","HTTP_REFERER":"","HTTPS":"off","HTTP_USER_AGENT":"SiteLockSpider [en] (WinNT; I ;Nav)","QUERY_STRING":"","HTTP_CONNECTION":"TE, close","REQUEST_METHOD":"GET","HTTP_HOST":"agentrosetravel.com"}]},
{"EntryDate":"2016-12-17 12:36:28 -05:00","Time":"12:36:28","Level":"WARN","Message":[{"Rule":"bots_hotels_forms","REMOTE_HOST":"184.154.139.47","URL":"/common/sign-in.html","HTTP_REFERER":"","HTTPS":"off","HTTP_USER_AGENT":"SiteLockSpider [en] (WinNT; I ;Nav)","QUERY_STRING":"","HTTP_CONNECTION":"TE, close","REQUEST_METHOD":"GET","HTTP_HOST":"besttravel4less.com"}]},
{"EntryDate":"2016-12-17 12:47:37 -05:00","Time":"12:47:37","Level":"WARN","Message":[{"Rule":"bots_hotels_forms","REMOTE_HOST":"40.77.167.36","URL":"/request-quote.html","HTTP_REFERER":"","HTTPS":"off","HTTP_USER_AGENT":"Mozilla/5.0 (compatible; bingbot/2.0; +http://www.bing.com/bingbot.htm)","QUERY_STRING":"DealURL=7-day-western-caribbean-from-miami&DealType=cruise","HTTP_CONNECTION":"Keep-Alive","REQUEST_METHOD":"GET","HTTP_HOST":"jmktravels.agentstudio.com"}]},
{"EntryDate":"2016-12-17 12:48:24 -05:00","Time":"12:48:24","Level":"WARN","Message":[{"Rule":"bots_hotels_forms","REMOTE_HOST":"207.46.13.90","URL":"/request-quote.html","HTTP_REFERER":"","HTTPS":"off","HTTP_USER_AGENT":"Mozilla/5.0 (compatible; bingbot/2.0; +http://www.bing.com/bingbot.htm)","QUERY_STRING":"DealURL=7-day-eastern-caribbean-from-miami-3&DealType=cruise","HTTP_CONNECTION":"Keep-Alive","REQUEST_METHOD":"GET","HTTP_HOST":"jmktravels.agentstudio.com"}]},
{"EntryDate":"2016-12-17 12:48:54 -05:00","Time":"12:48:54","Level":"WARN","Message":[{"Rule":"bots_hotels_forms","REMOTE_HOST":"207.46.13.6","URL":"/request-quote.html","HTTP_REFERER":"","HTTPS":"off","HTTP_USER_AGENT":"Mozilla/5.0 (compatible; bingbot/2.0; +http://www.bing.com/bingbot.htm)","QUERY_STRING":"DealURL=7-day-western-mediterranean-from-civitavecchia&DealType=cruise","HTTP_CONNECTION":"Keep-Alive","REQUEST_METHOD":"GET","HTTP_HOST":"jmktravels.agentstudio.com"}]},
{"EntryDate":"2016-12-17 13:10:41 -05:00","Time":"13:10:41","Level":"WARN","Message":[{"Rule":"bots_hotels_forms","REMOTE_HOST":"157.55.39.183","URL":"/common/sign-in.html","HTTP_REFERER":"","HTTPS":"off","HTTP_USER_AGENT":"Mozilla/5.0 (compatible; bingbot/2.0; +http://www.bing.com/bingbot.htm)","QUERY_STRING":"","HTTP_CONNECTION":"Keep-Alive","REQUEST_METHOD":"GET","HTTP_HOST":"flighttwo.com"}]},
{"EntryDate":"2016-12-17 13:11:06 -05:00","Time":"13:11:06","Level":"WARN","Message":[{"Rule":"bots_hotels_forms","REMOTE_HOST":"157.55.39.157","URL":"/request-quote.html","HTTP_REFERER":"","HTTPS":"off","HTTP_USER_AGENT":"Mozilla/5.0 (compatible; bingbot/2.0; +http://www.bing.com/bingbot.htm)","QUERY_STRING":"DealURL=hola-cuba&DealType=tour","HTTP_CONNECTION":"Keep-Alive","REQUEST_METHOD":"GET","HTTP_HOST":"flighttwo.com"}]},
{"EntryDate":"2016-12-17 13:13:17 -05:00","Time":"13:13:17","Level":"WARN","Message":[{"Rule":"bots_hotels_forms","REMOTE_HOST":"207.46.13.116","URL":"/request-quote.html","HTTP_REFERER":"","HTTPS":"off","HTTP_USER_AGENT":"Mozilla/5.0 (compatible; bingbot/2.0; +http://www.bing.com/bingbot.htm)","QUERY_STRING":"DealURL=a-trio-of-treasures-nicaragua-el-salvador-guatemala&DealType=tour","HTTP_CONNECTION":"Keep-Alive","REQUEST_METHOD":"GET","HTTP_HOST":"flighttwo.com"}]},
{"EntryDate":"2016-12-17 13:23:50 -05:00","Time":"13:23:50","Level":"WARN","Message":[{"Rule":"bots_hotels_forms","REMOTE_HOST":"184.154.139.48","URL":"/common/sign-in.html","HTTP_REFERER":"","HTTPS":"off","HTTP_USER_AGENT":"SiteLockSpider [en] (WinNT; I ;Nav)","QUERY_STRING":"","HTTP_CONNECTION":"TE, close","REQUEST_METHOD":"GET","HTTP_HOST":"ilovedestinations.com"}]},
{"EntryDate":"2016-12-17 14:06:31 -05:00","Time":"14:06:31","Level":"WARN","Message":[{"Rule":"bots_hotels_forms","REMOTE_HOST":"184.154.139.48","URL":"/request-quote.html","HTTP_REFERER":"","HTTPS":"off","HTTP_USER_AGENT":"SiteLockSpider [en] (WinNT; I ;Nav)","QUERY_STRING":"DealURL=10-day-christmas-markets-along-the-rhine-southbound&DealType=Promotion","HTTP_CONNECTION":"TE, close","REQUEST_METHOD":"GET","HTTP_HOST":"dreammakertravels.com"}]},
{"EntryDate":"2016-12-17 14:17:59 -05:00","Time":"14:17:59","Level":"WARN","Message":[{"Rule":"bots_hotels_forms","REMOTE_HOST":"157.55.39.207","URL":"/request-quote.html","HTTP_REFERER":"","HTTPS":"off","HTTP_USER_AGENT":"Mozilla/5.0 (compatible; bingbot/2.0; +http://www.bing.com/bingbot.htm)","QUERY_STRING":"DealURL=memphis-to-st-louis-alton&DealType=Cruise","HTTP_CONNECTION":"Keep-Alive","REQUEST_METHOD":"GET","HTTP_HOST":"danddtravel.agentstudio.com"}]},
{"EntryDate":"2016-12-17 14:18:09 -05:00","Time":"14:18:09","Level":"WARN","Message":[{"Rule":"bots_hotels_forms","REMOTE_HOST":"40.77.167.36","URL":"/request-quote.html","HTTP_REFERER":"","HTTPS":"off","HTTP_USER_AGENT":"Mozilla/5.0 (compatible; bingbot/2.0; +http://www.bing.com/bingbot.htm)","QUERY_STRING":"DealURL=7-day-roundtrip-vancouver-11&DealType=Cruise","HTTP_CONNECTION":"Keep-Alive","REQUEST_METHOD":"GET","HTTP_HOST":"danddtravel.agentstudio.com"}]},
{"EntryDate":"2016-12-17 14:18:31 -05:00","Time":"14:18:31","Level":"WARN","Message":[{"Rule":"bots_hotels_forms","REMOTE_HOST":"157.55.39.125","URL":"/request-quote.html","HTTP_REFERER":"","HTTPS":"off","HTTP_USER_AGENT":"Mozilla/5.0 (compatible; bingbot/2.0; +http://www.bing.com/bingbot.htm)","QUERY_STRING":"DealURL=7-night-eastern-mediterranean-cruise&DealType=Cruise","HTTP_CONNECTION":"Keep-Alive","REQUEST_METHOD":"GET","HTTP_HOST":"danddtravel.agentstudio.com"}]},
{"EntryDate":"2016-12-17 14:18:42 -05:00","Time":"14:18:42","Level":"WARN","Message":[{"Rule":"bots_hotels_forms","REMOTE_HOST":"207.46.13.6","URL":"/request-quote.html","HTTP_REFERER":"","HTTPS":"off","HTTP_USER_AGENT":"Mozilla/5.0 (compatible; bingbot/2.0; +http://www.bing.com/bingbot.htm)","QUERY_STRING":"DealURL=7-night-caribbean-cruise-35&DealType=Cruise","HTTP_CONNECTION":"Keep-Alive","REQUEST_METHOD":"GET","HTTP_HOST":"danddtravel.agentstudio.com"}]},
{"EntryDate":"2016-12-17 14:20:50 -05:00","Time":"14:20:50","Level":"WARN","Message":[{"Rule":"pageview","REMOTE_HOST":"82.80.249.158","URL":"/promotions/18-day-bridgetown-to-bridgetown.html","HTTP_REFERER":"http://www.echevarriatravel.com/news/british-airways-settle-sexiest-accents-debate-once-and-for-all.html","HTTPS":"off","HTTP_USER_AGENT":"Mozilla/5.0 (Macintosh; Intel Mac OS X 10_8_5) AppleWebKit/537.71 (KHTML, like Gecko) Version/6.1 Safari/537.71","QUERY_STRING":"","HTTP_CONNECTION":"","REQUEST_METHOD":"GET","HTTP_HOST":"www.echevarriatravel.com"}]},
{"EntryDate":"2016-12-17 15:27:12 -05:00","Time":"15:27:12","Level":"WARN","Message":[{"Rule":"pageview","REMOTE_HOST":"82.80.249.192","URL":"/tours/paradise-made-simple-and-sweet-promotion.html","HTTP_REFERER":"http://lanetravelandcruises.com/tours/paradise-made-simple-and-sweet-promotion.html","HTTPS":"off","HTTP_USER_AGENT":"Mozilla/5.0 (X11; Ubuntu; Linux x86_64; rv:25.0) Gecko/20100101 Firefox/25.0","QUERY_STRING":"ForceDesktopMode=true","HTTP_CONNECTION":"","REQUEST_METHOD":"GET","HTTP_HOST":"lanetravelandcruises.com"}]},
{"EntryDate":"2016-12-17 15:30:11 -05:00","Time":"15:30:11","Level":"WARN","Message":[{"Rule":"pageview","REMOTE_HOST":"82.80.249.192","URL":"/request-quote.html","HTTP_REFERER":"http://www.lanetravelandcruises.com/promotions/mystery-deal.html","HTTPS":"off","HTTP_USER_AGENT":"Mozilla/5.0 (Windows NT 6.1; WOW64; rv:33.0) Gecko/20100101 Firefox/33.0","QUERY_STRING":"DealURL=mystery-deal&DealType=Promotion","HTTP_CONNECTION":"","REQUEST_METHOD":"GET","HTTP_HOST":"lanetravelandcruises.com"}]},
{"EntryDate":"2016-12-17 15:32:42 -05:00","Time":"15:32:42","Level":"WARN","Message":[{"Rule":"pageview","REMOTE_HOST":"82.80.249.192","URL":"/destinations/north-america/united-states/hawaii.html","HTTP_REFERER":"http://www.lanetravelandcruises.com/cruises/22-nights-historic-harbors-idyllic-isles.html","HTTPS":"off","HTTP_USER_AGENT":"Mozilla/5.0 (X11; Linux x86_64) AppleWebKit/537.36 (KHTML, like Gecko) Chrome/31.0.1650.63 Safari/537.36","QUERY_STRING":"","HTTP_CONNECTION":"","REQUEST_METHOD":"GET","HTTP_HOST":"lanetravelandcruises.com"}]},
{"EntryDate":"2016-12-17 15:42:40 -05:00","Time":"15:42:40","Level":"WARN","Message":[{"Rule":"pageview","REMOTE_HOST":"82.80.249.192","URL":"/attractions/golden-gate-bridge.html","HTTP_REFERER":"http://www.lanetravelandcruises.com/destinations/north-america/united-states/california/san-francisco.html","HTTPS":"off","HTTP_USER_AGENT":"Mozilla/5.0 (Windows NT 5.1; rv:25.0) Gecko/20100101 Firefox/25.0","QUERY_STRING":"destinationURL=north-america/united-states/california/san-francisco&destination=San%20Francisco","HTTP_CONNECTION":"","REQUEST_METHOD":"GET","HTTP_HOST":"www.lanetravelandcruises.com"}]},
{"EntryDate":"2016-12-17 15:46:25 -05:00","Time":"15:46:25","Level":"WARN","Message":[{"Rule":"pageview","REMOTE_HOST":"82.80.249.192","URL":"/destinations/north-america/united-states/virginia.html","HTTP_REFERER":"http://www.lanetravelandcruises.com/cruises/11-night-caribbean-cruise-21.html","HTTPS":"off","HTTP_USER_AGENT":"Mozilla/5.0 (Windows NT 6.1; rv:24.0) Gecko/20100101 Firefox/24.0","QUERY_STRING":"","HTTP_CONNECTION":"","REQUEST_METHOD":"GET","HTTP_HOST":"www.lanetravelandcruises.com"}]},
{"EntryDate":"2016-12-17 16:05:17 -05:00","Time":"16:05:17","Level":"WARN","Message":[{"Rule":"bots_hotels_forms","REMOTE_HOST":"157.55.39.125","URL":"/request-quote.html","HTTP_REFERER":"","HTTPS":"off","HTTP_USER_AGENT":"Mozilla/5.0 (compatible; bingbot/2.0; +http://www.bing.com/bingbot.htm)","QUERY_STRING":"DealURL=enjoy-a-free-three-night-stay-in-one-of-our-luxurious-oceanfront-lanai-suites&DealType=promotion","HTTP_CONNECTION":"Keep-Alive","REQUEST_METHOD":"GET","HTTP_HOST":"itsabreezetravel1.agentstudio.com"}]},
{"EntryDate":"2016-12-17 16:05:41 -05:00","Time":"16:05:41","Level":"WARN","Message":[{"Rule":"bots_hotels_forms","REMOTE_HOST":"157.55.39.207","URL":"/request-quote.html","HTTP_REFERER":"","HTTPS":"off","HTTP_USER_AGENT":"Mozilla/5.0 (compatible; bingbot/2.0; +http://www.bing.com/bingbot.htm)","QUERY_STRING":"DealURL=great-volcanoes-of-americas-west-2&DealType=Tour","HTTP_CONNECTION":"Keep-Alive","REQUEST_METHOD":"GET","HTTP_HOST":"itsabreezetravel1.agentstudio.com"}]},
{"EntryDate":"2016-12-17 16:06:22 -05:00","Time":"16:06:22","Level":"WARN","Message":[{"Rule":"bots_hotels_forms","REMOTE_HOST":"207.46.13.6","URL":"/request-quote.html","HTTP_REFERER":"","HTTPS":"off","HTTP_USER_AGENT":"Mozilla/5.0 (compatible; bingbot/2.0; +http://www.bing.com/bingbot.htm)","QUERY_STRING":"DealURL=the-heart-of-myanmar-burma&DealType=Tour","HTTP_CONNECTION":"Keep-Alive","REQUEST_METHOD":"GET","HTTP_HOST":"itsabreezetravel1.agentstudio.com"}]},
{"EntryDate":"2016-12-17 16:07:25 -05:00","Time":"16:07:25","Level":"WARN","Message":[{"Rule":"bots_hotels_forms","REMOTE_HOST":"184.154.36.179","URL":"/common/sign-in.html","HTTP_REFERER":"","HTTPS":"off","HTTP_USER_AGENT":"SiteLockSpider [en] (WinNT; I ;Nav)","QUERY_STRING":"","HTTP_CONNECTION":"TE, close","REQUEST_METHOD":"GET","HTTP_HOST":"commonwealthtravel.net"}]},
{"EntryDate":"2016-12-17 16:13:08 -05:00","Time":"16:13:08","Level":"WARN","Message":[{"Rule":"bots_hotels_forms","REMOTE_HOST":"40.77.167.11","URL":"/request-quote.html","HTTP_REFERER":"","HTTPS":"off","HTTP_USER_AGENT":"Mozilla/5.0 (compatible; bingbot/2.0; +http://www.bing.com/bingbot.htm)","QUERY_STRING":"DealURL=ultimate-spain-portugal&DealType=Tour&Dates=5/28/17-6/18/17&Starting=4499.00","HTTP_CONNECTION":"Keep-Alive","REQUEST_METHOD":"GET","HTTP_HOST":"romanticinterludestravel.com"}]},
{"EntryDate":"2016-12-17 16:30:16 -05:00","Time":"16:30:16","Level":"WARN","Message":[{"Rule":"pageview","REMOTE_HOST":"82.80.249.156","URL":"/request-quote.html","HTTP_REFERER":"http://www.funshinetravelinc.com/promotions/8-day-western-caribbean.html","HTTPS":"off","HTTP_USER_AGENT":"Mozilla/5.0 (Windows NT 6.1; Trident/7.0; rv:11.0) like Gecko","QUERY_STRING":"DealURL=8-day-western-caribbean&DealType=Promotion","HTTP_CONNECTION":"","REQUEST_METHOD":"GET","HTTP_HOST":"www.funshinetravelinc.com"}]},
{"EntryDate":"2016-12-17 16:46:05 -05:00","Time":"16:46:05","Level":"WARN","Message":[{"Rule":"bots_hotels_forms","REMOTE_HOST":"184.154.248.106","URL":"/send-to-a-friend.html","HTTP_REFERER":"","HTTPS":"off","HTTP_USER_AGENT":"SiteLockSpider [en] (WinNT; I ;Nav)","QUERY_STRING":"seourl=28-day-round-australia-2&DealType=Promotion","HTTP_CONNECTION":"TE, close","REQUEST_METHOD":"GET","HTTP_HOST":"pandora.travel"}]},
{"EntryDate":"2016-12-17 17:01:59 -05:00","Time":"17:01:59","Level":"WARN","Message":[{"Rule":"bots_hotels_forms","REMOTE_HOST":"178.255.215.69","URL":"/request-quote.html","HTTP_REFERER":"","HTTPS":"off","HTTP_USER_AGENT":"Mozilla/5.0 (compatible; Exabot/3.0; +http://www.exabot.com/go/robot)","QUERY_STRING":"DealURL=azul-hotels-by-karisma-open-all-winter-starting-from-226-pppn&DealType=promotion","HTTP_CONNECTION":"Close","REQUEST_METHOD":"GET","HTTP_HOST":"cruisingfortravel.com"}]},
{"EntryDate":"2016-12-17 17:08:05 -05:00","Time":"17:08:05","Level":"WARN","Message":[{"Rule":"bots_hotels_forms","REMOTE_HOST":"184.154.139.16","URL":"/send-to-a-friend.html","HTTP_REFERER":"","HTTPS":"off","HTTP_USER_AGENT":"SiteLockSpider [en] (WinNT; I ;Nav)","QUERY_STRING":"seourl=12-night-japan-korea-china-cruise-2&DealType=Cruise","HTTP_CONNECTION":"TE, close","REQUEST_METHOD":"GET","HTTP_HOST":"pinnacletrips.com"}]},
{"EntryDate":"2016-12-17 17:58:06 -05:00","Time":"17:58:06","Level":"WARN","Message":[{"Rule":"pageview","REMOTE_HOST":"82.80.249.156","URL":"/destinations.html","HTTP_REFERER":"http://averybigadventure.com/destinations.html?ForceDesktopMode=true","HTTPS":"off","HTTP_USER_AGENT":"Mozilla/5.0 (Macintosh; Intel Mac OS X 10_9_0) AppleWebKit/537.36 (KHTML, like Gecko) Chrome/31.0.1650.63 Safari/537.36","QUERY_STRING":"ForceDesktopMode=false","HTTP_CONNECTION":"","REQUEST_METHOD":"GET","HTTP_HOST":"averybigadventure.com"}]},
{"EntryDate":"2016-12-17 18:01:41 -05:00","Time":"18:01:41","Level":"WARN","Message":[{"Rule":"pageview","REMOTE_HOST":"82.80.249.156","URL":"/send-to-a-friend.html","HTTP_REFERER":"http://www.averybigadventure.com/promotions/bride-groom-stay-free-20percent-discount-off.html","HTTPS":"off","HTTP_USER_AGENT":"Mozilla/5.0 (Macintosh; Intel Mac OS X 10_8_5) AppleWebKit/536.30.1 (KHTML, like Gecko) Version/6.0.5 Safari/536.30.1","QUERY_STRING":"seourl=bride-groom-stay-free-20percent-discount-off&DealType=Promotion","HTTP_CONNECTION":"","REQUEST_METHOD":"GET","HTTP_HOST":"www.averybigadventure.com"}]},
{"EntryDate":"2016-12-17 18:04:08 -05:00","Time":"18:04:08","Level":"WARN","Message":[{"Rule":"pageview","REMOTE_HOST":"82.80.249.156","URL":"/tours/the-old-south-florida.html","HTTP_REFERER":"http://www.averybigadventure.com/cruises/14-nights-creole-caribbean-celebrations.html","HTTPS":"off","HTTP_USER_AGENT":"Mozilla/5.0 (Windows NT 6.1; WOW64; Trident/7.0; rv:11.0) like Gecko","QUERY_STRING":"","HTTP_CONNECTION":"","REQUEST_METHOD":"GET","HTTP_HOST":"www.averybigadventure.com"}]},
{"EntryDate":"2016-12-17 18:07:46 -05:00","Time":"18:07:46","Level":"WARN","Message":[{"Rule":"pageview","REMOTE_HOST":"82.80.249.156","URL":"/request-quote.html","HTTP_REFERER":"http://averybigadventure.com/destinations/europe/italy/florence.html","HTTPS":"off","HTTP_USER_AGENT":"Mozilla/5.0 (Windows NT 6.1; WOW64; rv:26.0) Gecko/20100101 Firefox/26.0","QUERY_STRING":"DealURL=europe/italy/florence&DealType=Destination","HTTP_CONNECTION":"","REQUEST_METHOD":"GET","HTTP_HOST":"averybigadventure.com"}]},
{"EntryDate":"2016-12-17 18:10:28 -05:00","Time":"18:10:28","Level":"WARN","Message":[{"Rule":"pageview","REMOTE_HOST":"82.80.249.156","URL":"/tours/iceland-land-of-fire-and-ice-2.html","HTTP_REFERER":"http://www.averybigadventure.com/news/happy-birthday-iceland-70-years-and-a-tourism-renaissance.html","HTTPS":"off","HTTP_USER_AGENT":"Mozilla/5.0 (Windows NT 6.1; WOW64; Trident/7.0; rv:11.0) like Gecko","QUERY_STRING":"","HTTP_CONNECTION":"","REQUEST_METHOD":"GET","HTTP_HOST":"www.averybigadventure.com"}]},
{"EntryDate":"2016-12-17 18:13:07 -05:00","Time":"18:13:07","Level":"WARN","Message":[{"Rule":"pageview","REMOTE_HOST":"82.80.249.156","URL":"/destinations/north-america/united-states/hawaii/lanai.html","HTTP_REFERER":"http://www.averybigadventure.com/tours/3rd-night-free-2955.html","HTTPS":"off","HTTP_USER_AGENT":"Mozilla/5.0 (Windows NT 6.0; WOW64) AppleWebKit/534.30 (KHTML, like Gecko) Chrome/12.0.742.91 Safari/534.30","QUERY_STRING":"","HTTP_CONNECTION":"","REQUEST_METHOD":"GET","HTTP_HOST":"www.averybigadventure.com"}]},
{"EntryDate":"2016-12-17 18:20:51 -05:00","Time":"18:20:51","Level":"WARN","Message":[{"Rule":"bots_hotels_forms","REMOTE_HOST":"107.6.137.74","URL":"/request-quote.html","HTTP_REFERER":"","HTTPS":"off","HTTP_USER_AGENT":"SiteLockSpider [en] (WinNT; I ;Nav)","QUERY_STRING":"DealURL=10-day-montreal-to-new-york&DealType=Promotion","HTTP_CONNECTION":"TE, close","REQUEST_METHOD":"GET","HTTP_HOST":"boutiqueta.com"}]},
{"EntryDate":"2016-12-17 18:49:15 -05:00","Time":"18:49:15","Level":"WARN","Message":[{"Rule":"bots_hotels_forms","REMOTE_HOST":"184.154.139.16","URL":"/common/sign-in.html","HTTP_REFERER":"","HTTPS":"off","HTTP_USER_AGENT":"SiteLockSpider [en] (WinNT; I ;Nav)","QUERY_STRING":"","HTTP_CONNECTION":"TE, close","REQUEST_METHOD":"GET","HTTP_HOST":"offonvacation.net"}]},
{"EntryDate":"2016-12-17 19:18:01 -05:00","Time":"19:18:01","Level":"WARN","Message":[{"Rule":"bots_hotels_forms","REMOTE_HOST":"40.77.167.11","URL":"/request-quote.html","HTTP_REFERER":"","HTTPS":"off","HTTP_USER_AGENT":"Mozilla/5.0 (compatible; bingbot/2.0; +http://www.bing.com/bingbot.htm)","QUERY_STRING":"DealURL=morocco-on-a-shoestring-2&DealType=Tour&Dates=12/16/17-12/30/17&Starting=1449.00","HTTP_CONNECTION":"Keep-Alive","REQUEST_METHOD":"GET","HTTP_HOST":"romanticinterludestravel.com"}]},
{"EntryDate":"2016-12-17 20:16:19 -05:00","Time":"20:16:19","Level":"WARN","Message":[{"Rule":"bots_hotels_forms","REMOTE_HOST":"184.154.139.16","URL":"/request-quote.html","HTTP_REFERER":"","HTTPS":"off","HTTP_USER_AGENT":"SiteLockSpider [en] (WinNT; I ;Nav)","QUERY_STRING":"DealURL=south-america&DealType=Destination","HTTP_CONNECTION":"TE, close","REQUEST_METHOD":"GET","HTTP_HOST":"travelusso.com"}]},
{"EntryDate":"2016-12-17 20:30:49 -05:00","Time":"20:30:49","Level":"WARN","Message":[{"Rule":"bots_hotels_forms","REMOTE_HOST":"178.255.215.66","URL":"/request-quote.html","HTTP_REFERER":"","HTTPS":"off","HTTP_USER_AGENT":"Mozilla/5.0 (compatible; Exabot/3.0; +http://www.exabot.com/go/robot)","QUERY_STRING":"DealURL=winter-in-yellowstone&DealType=tour","HTTP_CONNECTION":"Close","REQUEST_METHOD":"GET","HTTP_HOST":"cavaliertravelgroupcom.agentstudio.com"}]},
{"EntryDate":"2016-12-17 20:31:51 -05:00","Time":"20:31:51","Level":"WARN","Message":[{"Rule":"bots_hotels_forms","REMOTE_HOST":"184.154.36.180","URL":"/common/sign-in.html","HTTP_REFERER":"","HTTPS":"off","HTTP_USER_AGENT":"SiteLockSpider [en] (WinNT; I ;Nav)","QUERY_STRING":"","HTTP_CONNECTION":"TE, close","REQUEST_METHOD":"GET","HTTP_HOST":"prestigetourandtravel.com"}]},
{"EntryDate":"2016-12-17 20:35:45 -05:00","Time":"20:35:45","Level":"WARN","Message":[{"Rule":"bots_hotels_forms","REMOTE_HOST":"157.55.39.131","URL":"/request-quote.html","HTTP_REFERER":"","HTTPS":"off","HTTP_USER_AGENT":"Mozilla/5.0 (compatible; bingbot/2.0; +http://www.bing.com/bingbot.htm)","QUERY_STRING":"DealURL=7-night-pacific-northwest-cruise-7&DealType=Cruise&Dates=9/22/17-9/29/17&Starting=598.00","HTTP_CONNECTION":"Keep-Alive","REQUEST_METHOD":"GET","HTTP_HOST":"coastalcruiseagent.com"}]},
{"EntryDate":"2016-12-17 20:36:01 -05:00","Time":"20:36:01","Level":"WARN","Message":[{"Rule":"bots_hotels_forms","REMOTE_HOST":"157.55.39.102","URL":"/request-quote.html","HTTP_REFERER":"","HTTPS":"off","HTTP_USER_AGENT":"Mozilla/5.0 (compatible; bingbot/2.0; +http://www.bing.com/bingbot.htm)","QUERY_STRING":"DealURL=7-night-pacific-northwest-cruise-7&DealType=Cruise&Dates=9/29/17-10/6/17&Starting=598.00","HTTP_CONNECTION":"Keep-Alive","REQUEST_METHOD":"GET","HTTP_HOST":"coastalcruiseagent.com"}]},
{"EntryDate":"2016-12-17 20:56:06 -05:00","Time":"20:56:06","Level":"WARN","Message":[{"Rule":"homepage","REMOTE_HOST":"104.156.230.231","URL":"/","HTTP_REFERER":"","HTTPS":"off","HTTP_USER_AGENT":"Mozilla/5.0 (Windows NT 6.1; WOW64) AppleWebKit/537.36 (KHTML, like Gecko) Chrome/40.0.2214.115 Safari/537.36","QUERY_STRING":"","HTTP_CONNECTION":"","REQUEST_METHOD":"GET","HTTP_HOST":"www.zacharynussbaum.com"}]},
{"EntryDate":"2016-12-17 21:12:43 -05:00","Time":"21:12:43","Level":"WARN","Message":[{"Rule":"bots_hotels_forms","REMOTE_HOST":"184.154.139.51","URL":"/common/sign-in.html","HTTP_REFERER":"","HTTPS":"off","HTTP_USER_AGENT":"SiteLockSpider [en] (WinNT; I ;Nav)","QUERY_STRING":"","HTTP_CONNECTION":"TE, close","REQUEST_METHOD":"GET","HTTP_HOST":"easeuptravel.com"}]},
{"EntryDate":"2016-12-17 21:20:58 -05:00","Time":"21:20:58","Level":"WARN","Message":[{"Rule":"bots_hotels_forms","REMOTE_HOST":"184.154.139.18","URL":"/request-quote.html","HTTP_REFERER":"","HTTPS":"off","HTTP_USER_AGENT":"SiteLockSpider [en] (WinNT; I ;Nav)","QUERY_STRING":"DealURL=hike-san-pedro&DealType=Tour","HTTP_CONNECTION":"TE, close","REQUEST_METHOD":"GET","HTTP_HOST":"averybigadventure.com"}]},
{"EntryDate":"2016-12-17 21:23:06 -05:00","Time":"21:23:06","Level":"WARN","Message":[{"Rule":"bots_hotels_forms","REMOTE_HOST":"207.46.13.26","URL":"/send-to-a-friend.html","HTTP_REFERER":"","HTTPS":"off","HTTP_USER_AGENT":"Mozilla/5.0 (compatible; bingbot/2.0; +http://www.bing.com/bingbot.htm)","QUERY_STRING":"seourl=11-night-expedition-cruising-cruise","HTTP_CONNECTION":"Keep-Alive","REQUEST_METHOD":"GET","HTTP_HOST":"smarttravelagency.agentstudio.com"}]},
{"EntryDate":"2016-12-17 21:23:10 -05:00","Time":"21:23:10","Level":"WARN","Message":[{"Rule":"bots_hotels_forms","REMOTE_HOST":"157.55.39.207","URL":"/request-quote.html","HTTP_REFERER":"","HTTPS":"off","HTTP_USER_AGENT":"Mozilla/5.0 (compatible; bingbot/2.0; +http://www.bing.com/bingbot.htm)","QUERY_STRING":"DealURL=2016-early-booking-savings&DealType=Cruise","HTTP_CONNECTION":"Keep-Alive","REQUEST_METHOD":"GET","HTTP_HOST":"smarttravelagency.agentstudio.com"}]},
{"EntryDate":"2016-12-17 21:23:15 -05:00","Time":"21:23:15","Level":"WARN","Message":[{"Rule":"bots_hotels_forms","REMOTE_HOST":"207.46.13.6","URL":"/send-to-a-friend.html","HTTP_REFERER":"","HTTPS":"off","HTTP_USER_AGENT":"Mozilla/5.0 (compatible; bingbot/2.0; +http://www.bing.com/bingbot.htm)","QUERY_STRING":"seourl=eden-roc-miami-beach-2","HTTP_CONNECTION":"Keep-Alive","REQUEST_METHOD":"GET","HTTP_HOST":"smarttravelagency.agentstudio.com"}]},
{"EntryDate":"2016-12-17 21:48:29 -05:00","Time":"21:48:29","Level":"WARN","Message":[{"Rule":"bots_hotels_forms","REMOTE_HOST":"208.43.225.84","URL":"/request-quote.html","HTTP_REFERER":"","HTTPS":"off","HTTP_USER_AGENT":"Mozilla/5.0 (compatible; SiteExplorer/1.1b; +http://siteexplorer.info/Backlink-Checker-Spider/)","QUERY_STRING":"Starting=8829","HTTP_CONNECTION":"Keep-Alive","REQUEST_METHOD":"GET","HTTP_HOST":"esplorare.org"}]},
{"EntryDate":"2016-12-17 21:58:31 -05:00","Time":"21:58:31","Level":"WARN","Message":[{"Rule":"bots_hotels_forms","REMOTE_HOST":"207.46.13.58","URL":"/request-quote.html","HTTP_REFERER":"","HTTPS":"off","HTTP_USER_AGENT":"Mozilla/5.0 (compatible; bingbot/2.0; +http://www.bing.com/bingbot.htm)","QUERY_STRING":"DealURL=15-night-transpacific-cruise&DealType=Cruise&Dates=9/2/16-9/17/16&Starting=799.00","HTTP_CONNECTION":"Keep-Alive","REQUEST_METHOD":"GET","HTTP_HOST":"romanticinterludestravel.com"}]},
{"EntryDate":"2016-12-17 22:17:12 -05:00","Time":"22:17:12","Level":"WARN","Message":[{"Rule":"bots_hotels_forms","REMOTE_HOST":"184.154.139.46","URL":"/request-quote.html","HTTP_REFERER":"","HTTPS":"off","HTTP_USER_AGENT":"SiteLockSpider [en] (WinNT; I ;Nav)","QUERY_STRING":"DealURL=memphis-to-nashville&DealType=Cruise","HTTP_CONNECTION":"TE, close","REQUEST_METHOD":"GET","HTTP_HOST":"1-2travel-group.com"}]},
{"EntryDate":"2016-12-17 22:18:48 -05:00","Time":"22:18:48","Level":"WARN","Message":[{"Rule":"bots_hotels_forms","REMOTE_HOST":"107.6.137.74","URL":"/request-quote.html","HTTP_REFERER":"","HTTPS":"off","HTTP_USER_AGENT":"SiteLockSpider [en] (WinNT; I ;Nav)","QUERY_STRING":"DealURL=26-day-s-australia-new-zealand&DealType=Promotion","HTTP_CONNECTION":"TE, close","REQUEST_METHOD":"GET","HTTP_HOST":"irishcuetravel.com"}]},
{"EntryDate":"2016-12-17 22:29:49 -05:00","Time":"22:29:49","Level":"WARN","Message":[{"Rule":"bots_hotels_forms","REMOTE_HOST":"207.46.13.6","URL":"/common/sign-in.html","HTTP_REFERER":"","HTTPS":"off","HTTP_USER_AGENT":"Mozilla/5.0 (compatible; bingbot/2.0; +http://www.bing.com/bingbot.htm)","QUERY_STRING":"","HTTP_CONNECTION":"Keep-Alive","REQUEST_METHOD":"GET","HTTP_HOST":"tardistravel.agentstudio.com"}]},
{"EntryDate":"2016-12-17 22:39:07 -05:00","Time":"22:39:07","Level":"WARN","Message":[{"Rule":"bots_hotels_forms","REMOTE_HOST":"207.46.13.26","URL":"/request-quote.html","HTTP_REFERER":"","HTTPS":"off","HTTP_USER_AGENT":"Mozilla/5.0 (compatible; bingbot/2.0; +http://www.bing.com/bingbot.htm)","QUERY_STRING":"DealURL=beijing-to-hong-kongfujian-route&DealType=Tour&Dates=8/9/17-8/25/17&Starting=2149.00","HTTP_CONNECTION":"Keep-Alive","REQUEST_METHOD":"GET","HTTP_HOST":"ameribesttravel.agentstudio.com"}]},
{"EntryDate":"2016-12-17 22:39:26 -05:00","Time":"22:39:26","Level":"WARN","Message":[{"Rule":"bots_hotels_forms","REMOTE_HOST":"157.55.39.207","URL":"/request-quote.html","HTTP_REFERER":"","HTTPS":"off","HTTP_USER_AGENT":"Mozilla/5.0 (compatible; bingbot/2.0; +http://www.bing.com/bingbot.htm)","QUERY_STRING":"DealURL=4-day-bahamas-from-miami&DealType=cruise","HTTP_CONNECTION":"Keep-Alive","REQUEST_METHOD":"GET","HTTP_HOST":"ameribesttravel.agentstudio.com"}]},
{"EntryDate":"2016-12-17 22:59:38 -05:00","Time":"22:59:38","Level":"WARN","Message":[{"Rule":"homepage","REMOTE_HOST":"178.137.83.166","URL":"/","HTTP_REFERER":"","HTTPS":"off","HTTP_USER_AGENT":"Mozilla/5.0 (Windows NT 10.0; WOW64) AppleWebKit/537.36 (KHTML, like Gecko) Chrome/49.0.2623.75 Safari/537.36 OPR/36.0.2130.32","QUERY_STRING":"","HTTP_CONNECTION":"keep-alive","REQUEST_METHOD":"GET","HTTP_HOST":"tripgenies.com"}]},
{"EntryDate":"2016-12-17 23:19:46 -05:00","Time":"23:19:46","Level":"WARN","Message":[{"Rule":"homepage","REMOTE_HOST":"74.220.158.4","URL":"/","HTTP_REFERER":"","HTTPS":"on","HTTP_USER_AGENT":"Mozilla/4.0 (compatible; MSIE 8.0; Windows NT 5.1; Trident/4.0)","QUERY_STRING":"","HTTP_CONNECTION":"Keep-Alive","REQUEST_METHOD":"GET","HTTP_HOST":"16-179-64-69-available.ilandcloud.com"}]},
{"EntryDate":"2016-12-17 23:20:47 -05:00","Time":"23:20:47","Level":"WARN","Message":[{"Rule":"homepage","REMOTE_HOST":"74.220.158.4","URL":"/","HTTP_REFERER":"","HTTPS":"off","HTTP_USER_AGENT":"Mozilla/4.0 (compatible; MSIE 8.0; Windows NT 5.1; Trident/4.0)","QUERY_STRING":"","HTTP_CONNECTION":"Keep-Alive","REQUEST_METHOD":"GET","HTTP_HOST":"16-179-64-69-available.ilandcloud.com"}]},
{"EntryDate":"2016-12-17 23:23:19 -05:00","Time":"23:23:19","Level":"WARN","Message":[{"Rule":"homepage","REMOTE_HOST":"74.220.158.4","URL":"/","HTTP_REFERER":"","HTTPS":"on","HTTP_USER_AGENT":"Mozilla/4.0 (compatible; MSIE 8.0; Windows NT 5.1; Trident/4.0)","QUERY_STRING":"","HTTP_CONNECTION":"Keep-Alive","REQUEST_METHOD":"GET","HTTP_HOST":"16-179-64-69-available.ilandcloud.com"}]},
{"EntryDate":"2016-12-17 23:24:32 -05:00","Time":"23:24:32","Level":"WARN","Message":[{"Rule":"homepage","REMOTE_HOST":"74.220.158.4","URL":"/","HTTP_REFERER":"","HTTPS":"on","HTTP_USER_AGENT":"Mozilla/4.0 (compatible; MSIE 8.0; Windows NT 5.1; Trident/4.0)","QUERY_STRING":"","HTTP_CONNECTION":"Keep-Alive","REQUEST_METHOD":"GET","HTTP_HOST":"16-179-64-69-available.ilandcloud.com"}]},
{"EntryDate":"2016-12-17 23:47:19 -05:00","Time":"23:47:19","Level":"WARN","Message":[{"Rule":"bots_hotels_forms","REMOTE_HOST":"184.154.36.173","URL":"/send-to-a-friend.html","HTTP_REFERER":"","HTTPS":"off","HTTP_USER_AGENT":"SiteLockSpider [en] (WinNT; I ;Nav)","QUERY_STRING":"seourl=7-night-flavors-of-alaska&DealType=Promotion","HTTP_CONNECTION":"TE, close","REQUEST_METHOD":"GET","HTTP_HOST":"marinatours.com"}]},
{"EntryDate":"2016-12-17 23:47:37 -05:00","Time":"23:47:37","Level":"WARN","Message":[{"Rule":"bots_hotels_forms","REMOTE_HOST":"184.154.248.106","URL":"/send-to-a-friend.html","HTTP_REFERER":"","HTTPS":"off","HTTP_USER_AGENT":"SiteLockSpider [en] (WinNT; I ;Nav)","QUERY_STRING":"seourl=3-night-caribbean-cruise&DealType=Cruise","HTTP_CONNECTION":"TE, close","REQUEST_METHOD":"GET","HTTP_HOST":"airplustravel.net"}]},
{"EntryDate":"2016-12-17 23:51:58 -05:00","Time":"23:51:58","Level":"WARN","Message":[{"Rule":"bots_hotels_forms","REMOTE_HOST":"184.154.139.24","URL":"/request-quote.html","HTTP_REFERER":"","HTTPS":"off","HTTP_USER_AGENT":"SiteLockSpider [en] (WinNT; I ;Nav)","QUERY_STRING":"DealURL=new-year-new-resort&DealType=Tour","HTTP_CONNECTION":"TE, close","REQUEST_METHOD":"GET","HTTP_HOST":"grandvoyagetravel.com"}]},
