Team,GP,W,L,AGT,K,D,K:D,CKPM,GPR,GSPD,EGR,MLR,GD@15,FB%,FT%,F3T%,HLD%,FD%,DRG%,ELD%,FBN%,BN%,LNE%,JNG%,WPM
Afreeca Freecs,46,25,21,36.9,534,482,1.11,0.6,-0.17,0.014,48.7,5.6,-319,0.37,.5,.52,.13,0.52,0.55,0.71,0.48,0.47,0.50,0.52,4.07
BBQ Olivers,44,16,28,35.7,437,475,0.92,0.58,-0.48,-0.056,45,-8.6,-803,0.36,.34,.36,0,0.50,0.50,0.46,0.38,0.37,0.49,0.50,3.67
Jin Air Green Wings,44,14,30,41,497,590,0.84,0.6,-0.56,-0.032,44.3,-12.5,-366,0.52,.41,.36,.09,0.39,0.39,0.31,0.36,0.35,0.50,0.47,3.82
Kongdoo Monster,45,12,33,37.7,385,570,0.68,0.56,-1.02,-0.072,39.6,-12.9,-919,0.38,.44,.38,.02,0.42,0.29,0.35,0.49,0.43,0.49,0.46,3.9
KT Rolster,44,29,15,37.7,590,489,1.21,0.65,1.14,0.052,63.4,2.5,1368,0.66,.75,.75,.18,0.57,0.56,0.54,0.63,0.61,0.50,0.51,3.85
Longzhu Gaming,45,20,25,37.4,501,570,0.88,0.64,-0.04,-0.010,49.6,-5.2,9,0.51,.49,.51,.04,0.49,0.49,0.63,0.50,0.50,0.50,0.50,3.71
MVP,45,23,22,36.5,528,630,0.84,0.71,-0.56,-0.036,44.6,6.5,-527,0.56,.40,.33,.2,0.49,0.52,0.56,0.51,0.64,0.50,0.49,3.46
ROX Tigers,47,21,26,35.6,560,626,0.89,0.71,-0.22,-0.019,50.5,-5.8,-105,0.47,.51,.55,.15,0.55,0.48,0.54,0.37,0.41,0.50,0.48,3.97
Samsung Galaxy,42,30,12,36.2,508,380,1.34,0.58,1.04,0.065,58.2,13.2,936,0.69,.64,.64,.12,0.45,0.62,0.57,0.63,0.63,0.50,0.54,3.65
SK Telecom T1,42,32,10,36.3,640,376,1.7,0.67,1.09,0.095,57.1,19.1,861,0.50,.52,.64,.45,0.62,0.63,0.54,0.67,0.63,0.52,0.55,3.43
