{
    "type": "bpprov.runners.simple.Event",
    "in-path": [{
        "type": "bpprov.translators.aggregator.Call",
        "parameters": {
            "command": "show-tpes.json",
            "output": {
                "patches": [{
                    "from": "/data",
                    "to": "/data"
                }]
            }
        }
    }, {
        "type": "rpsdk.translators.resources.UpsertPolledResources",
        "parameters": {
            "resourceType": "tosca.resourceTypes.TPE"
        }
    }]
}
