{
    "endpoint": "cli",
    "type": "bpprov.runners.simple.Sequence",
    "tests": [
    ],
    "endpoint-parameters": {
        "template": "asr9k/create-bridge-interface.tmpl"
    },
    "out-path": [
     ],
    "in-path": []
}
