{
    "endpoint": "null",
    "type": "bpprov.runners.simple.Sequence",
    "tests": [],
    "endpoint-parameters": {},
    "out-path": [],
    "in-path": [
        {
            "type": "bpprov.translators.aggregator.Call",
            "parameters": {
                "command": "/commands/poll-FREs.json",
                "input": {
                    "templateType": "json-dict",
                    "data": {
                        "resyncId": "{{ data['resyncId'] }}",
                        "resync": "True"
                    }
                }
            }
        }
    ]
}