{
  "pollers": [
    {
      "type": "bpprov.pollers.simple.Execute",
      "interval":  2147483647,
      "name": "networkConstruct",
      "parameters": {
        "command": "async_polling/resync-domain.json",
        "immediate": true
      }
    }
  ],
  "scheduler": {
        "type": "rpsdk.pollers.DelayRecreatedSessions"
    }
}
