{
  "endpoint": "null",
  "type": "bpprov.runners.simple.Sequence",
  "tests": [],
  "out-path": [],
  "in-path": [
            {
            "type": "bpprov.translators.call.Function",
            "description": "",
            "parameters": {
                "function": "bpracisco.utils.print_data"
            }
        },
    {
      "type": "bpprov.translators.aggregator.Call",
      "parameters": {
        "command": "/commands/show-device-details.json",
        "output": {
          "patches": [
            {
              "from": "/data/details",
              "to": "/data/details"
            }
          ]
        }
      }
    },
    {
      "type": "bpprov.translators.aggregator.Call",
      "parameters": {
        "command": "/commands/show-device-name.json",
        "output": {
          "patches": [
            {
              "from": "/data/name",
              "to": "/data/name"
            }
          ]
        }
      }
    },
    {
      "type": "bpprov.translators.aggregator.Call",
      "parameters": {
        "command": "/commands/show-chassis-id.json",
        "output": {
          "patches": [
            {
              "from": "/data",
              "to": "/data/chassis"
            }
          ]
        }
      }
    },
    {
      "type": "bpracisco.translators.generic_translator.NCUpdater",
      "parameters": {
      }
    },
    {
      "type": "bpprov.translators.aggregator.Call",
      "parameters": {
        "command": "/commands/show-nc-out.json",
        "output": {
          "patches": [
            {
              "from": "/data",
              "to": "/data/output"
            }
          ]
        }
      }
    },
    {
        "type": "bpprov.translators.call.Function",
        "description": "",
        "parameters": {
            "function": "bpracisco.utils.print_data"
        }
    },
    {
        "type": "bpprov.translators.route.Branch",
        "parameters": {
            "choice": [
                {
                    "do": {
                        "type": "rpsdk.translators.resources.UpsertResyncResources",
                        "parameters": {
                            "resourceType": "bpracisco.resourceTypes.NetworkConstruct",
                            "resources": "/data/output",
                            "fullResync": false,
                            "sendResyncMarkers": true,
                            "resyncId": "/data/resyncId"
                        }
                    },
                    "when": "${.} contains 'resync'"
                }
            ],
            "otherwise": {
                "type": "rpsdk.translators.resources.UpsertPolledResources",
                "parameters": {
                    "resourceType": "bpracisco.resourceTypes.NetworkConstruct",
                    "resources": "/data/output",
                    "resync": false,
                    "sendResyncMarkers": true,
                    "resyncId": "/data/resyncId"
                }
            }
        }
    }
  ]
}
