{
    "endpoint": "cli",
    "type": "bpprov.runners.simple.Sequence",
    "tests": [
    ],
    "endpoint-parameters": {
        "template": "ios/show-bundle.tmpl",
        "fsm": "fsms/ios/get_lag_list.fsm"
    },
    "out-path": [
     ],
    "in-path": [
    ]
}

