{
  "endpoint": "null",
  "type": "bpprov.runners.simple.Sequence",
  "tests": [
  ],
  "endpoint-parameters": {
  },
  "out-path": [],
  "in-path": [
    {
      "type": "bpprov.translators.call.Function",
      "description": "Return Interface name",
      "parameters": {
        "function": "bpracisco.translators.utils.change_interface_name"
      }
    },
    {
      "type": "bpprov.translators.aggregator.Call",
      "parameters": {
        "command": "get-tpe-status.json",
        "output": {
          "patches": [
            {
              "from": "/data",
              "to": "/data/interface"
            }
          ]
        }
      }
    },
    {
      "type": "bpprov.translators.list.ToDict",
      "parameters": {
        "labels": [
          "intfType",
          "port",
          "status",
          "lineStatus",
          "hardwareType",
          "hardwareAddress",
          "IpInfo",
          "Desc",
          "Mtu",
          "Vlan",
          "BW",
          "BwUnits"
        ],
        "nested": true,
        "path": "interface"
      }
    },
    {
      "type": "bpprov.translators.route.Branch",
      "parameters": {
        "choice": [
          {
            "do": {
              "type": "bpprov.translators.aggregator.Call",
              "parameters": {
                "command": "lag_information.json",
                "output": {
                  "patches": [
                    {
                      "from": "/data",
                      "to": "/data"
                    }
                  ]
                }
              }
            },
            "when": "${new_value} == \"Bundle-Ether10\""
          }
        ]
      }
    },
    {
      "type": "bpprov.translators.template.Json",
      "parameters": {
        "template": "get-termpoints.tmpl",
        "as_object": true
      }
    },
    {
      "type": "bpracisco.translators.generic_translator.TPEUpdater_Create",
      "parameters": {
      }
    }
  ]
}
