{
  "endpoint": "cli",
  "type": "bpprov.runners.simple.Sequence",
  "tests": [],
  "endpoint-parameters": {
    "command": "show version",
    "fsm": {
      "file": "fsms/show-device-xr.fsm",
      "autodict": true
    }
  },
  "out-path": [],
  "in-path": [
{
        "type": "bpprov.translators.list.Flatten",
        "parameters": {}
    },
    {
      "type": "bpprov.translators.list.ToDict",
      "parameters": {
        "labels": [
          "details"
        ]
      }
    }
]
}
