{
    "Simple Test 1": {
        "out-params": [

        ],
        "out-expect": [
            "show interfaces | include \"Gig|Ether\" | exclude Description\n"
        ],
        "in-params": [
            [
                "GigabitEthernet0/0/0/18 is down, line protocol is down ",
                "  Hardware is GigabitEthernet, address is d867.d94f.d0b8 (bia d867.d94f.d0b8)",
                "GigabitEthernet0/0/0/19 is down, line protocol is down ",
                "  Hardware is GigabitEthernet, address is d867.d94f.d0b9 (bia d867.d94f.d0b9)",
                "TenGigE0/1/0/3 is up, line protocol is up ",
                "  Hardware is TenGigE, address is e0ac.f123.43ab (bia e0ac.f123.43ab)",
                "Bundle-Ether100 is down, line protocol is down ",
                "  Hardware is Aggregated Ethernet interface(s), address is 6c9c.ed74.2bc2"
            ]
        ],
        "in-expect": [{
            "serviceState": "IN_SERVICE",
            "containedCTPs": [

            ],
            "id": "TenGigE-0-1-0-3",
            "name": "TenGigE-0-1-0-3"
        }, {
            "serviceState": "OUT_OF_SERVICE",
            "containedCTPs": [

            ],
            "id": "GigabitEthernet-0-0-0-18",
            "name": "GigabitEthernet-0-0-0-18"
        }, {
            "serviceState": "OUT_OF_SERVICE",
            "containedCTPs": [

            ],
            "id": "GigabitEthernet-0-0-0-19",
            "name": "GigabitEthernet-0-0-0-19"
        }, {
            "serviceState": "OUT_OF_SERVICE",
            "containedCTPs": [

            ],
            "id": "Bundle-Ether-100",
            "name": "Bundle-Ether-100"
        }]
    },
    "Select Interface": {
        "out-params": {
            "name": "GigabitEthernet-0-0-0-20"
        },
        "out-expect": [
            "show interfaces GigabitEthernet0/0/0/20\n"
        ]
    }
}