{
    "endpoint": "null",
    "type": "bpprov.runners.simple.Sequence",
    "out-path": [],
    "in-path": [
    {
        "type": "bpprov.translators.template.Json",
        "parameters": {
            "template": "asr9k/return_createctp_resources.tmpl",
            "as_object": true
        }
    },
    {
        "type": "bpprov.translators.aggregator.SerialCommand",
        "parameters": {
            "command": "create_ctp_resources.json",
            "map": true
        }
    }
]
}

