{
    "cli": {
        "name": "cli",
        "type": "bpprov.components.cli.CliEndpoint",
        "parameters": {
            "debugLevel": 10,
            "hostname": "172.19.3.12",
            "hostport": 22,
            "username": "mdso",
            "password": "-44|okU(L|>T{!<6i_58~PZZ",
            "commandTimeout": 120,
            "heartbeatInterval": 30,
            "prompt": "^\\r?[A-Za-z0-9:/()-_]+[>#]|Uncommitted changes found\\, commit them before exiting\\(yes/no/cancel\\)\\? \\[cancel\\]:|Proceed with commmit \\(yes/no\\)\\? \\[yes\\]:",
            "postLoginCommands": [ {"prompt": "[A-Za-z0-9:/()-]+[>#]",
                                    "value": "terminal length 0"}
            ],
            "loginPromptPattern": "[Uu]sername:|[Pp]assword:",
            "postReconnectCommands": [ {"prompt": "[A-Za-z0-9:/()-]+[>#]",
                                    "value": "terminal length 0"}
            ],
            "reconnectPeriod": 30,
            "connectTimeout": 60,
            "promptStrip": true
        }
    },
    "null": {
        "name": "null",
        "type": "bpprov.components.null.NullEndpoint",
        "parameters": {
        }
    }
}