{
    "endpoint": "cli",
    "type": "bpprov.runners.simple.Sequence",
    "tests": [
        
    ],
    "endpoint-parameters": {
        "command": "show ethernet service instance interface {{ data.interface }} detail | include Encapsulation",
        "fsm": { "file":"fsms/ios/get-interface-used-vlan-ids.fsm" } 
    },
    "out-path": [],
    "in-path": [{
        "type": "bpprov.translators.list.Flatten",
        "parameters": {}
    },{
      "type": "bpprov.translators.call.Function",
      "description": "for each item",
      "parameters": {
        "function": "bpracisco.translators.utils.interface_vlans_to_Integers"
       }
    }]
}
