{
  "CiscoASR9010": {
    "dir": "asr9010",
    "displayName": "CiscoASR9010"
  },
  "CiscoASR9K": {
    "dir": "asr9k",
    "displayName": "ASR9K"
  },
  "CiscoASR9001": {
    "dir": "asr9001",
    "displayName": "CiscoASR9001"
  },
  "CiscoASR9901": {
    "dir": "asr9901",
    "displayName": "CiscoASR9901"
  },
  "CiscoASR9006": {
    "dir": "asr9001",
    "displayName": "CiscoASR9006"
  }
}
