{
    "type": "bpprov.runners.simple.Event",
    "in-path": [{
        "type": "bpprov.translators.aggregator.Call",
        "parameters": {
            "command": "show-lldp.json",
            "output": {
                "patches": [{
                    "from": "/data",
                    "to": "/data/output"
                }]
            }
        }
    },
    {
        "type": "bpprov.translators.route.Branch",
        "parameters": {
            "choice": [
                {
                    "do": {
                        "type": "rpsdk.translators.resources.UpsertResyncResources",
                        "parameters": {
                            "resourceType": "tosca.resourceTypes.LLDP",
                            "resources": "/data/output",
                            "fullResync": false,
                            "resyncId": "/data/resyncId"
                        }
                    },
                    "when": "${.} contains 'resync'"
                }
            ],
            "otherwise": {
                "type": "rpsdk.translators.resources.UpsertPolledResources",
                "parameters": {
                    "resourceType": "tosca.resourceTypes.LLDP",
                    "resources": "/data/output",
                    "resync": false
                }
            }
        }
    }]
}