{
  "type": "form",
  "version": "2.0",
  "cells": [
    {
      "children": [
        {
          "model": "label"
        }
      ],
      "label": "General"
    },
    {
      "label": "Equipment",
      "children": [
        {
          "model": "properties.sessionProfile",
          "label": "Session Profile",
          "renderer": {
            "name": "select",
            "options": {
              "modelType": "resource",
              "query": {
                "resourceTypeId": "bpracisco.resourceTypes.SessionProfile"
              }
            }
          }
        },
        {
          "model": "properties.ipAddress",
          "label": "Host Name / IP Address"
        }
      ]
    }
  ]
}