{
    "endpoint": "cli",
    "type": "bpprov.runners.simple.Sequence",
    "tests": [
    ],
    "endpoint-parameters": {
        "template": "asr9k/create-internet-service-basic.tmpl"
    },
    "out-path": [],
    "in-path": []
}