{
    "endpoint": "cli",
    "type": "bpprov.runners.simple.Sequence",
    "tests": [
    ],
    "endpoint-parameters": {
        "template": "ios/create-internet-service-with-bgp.tmpl"
    },
    "out-path": [],
    "in-path": []
}
