{
    "tests": [
        "errors/tests/ios.json"
    ],
    "patterns": [{
        "command": "^route-policy",
        "pattern": "^% WARNING: Policy object route-policy",
        "onError": [
            { "write": "abort" },
            { "write": "end" }
        ],
        "override-reason" : "Duplicate Object Instance"
    },
    {
        "command": "^configure",
        "pattern": "[A-z0-9-: ]*\\*[ ]*$",
        "onError": [
             { "write": "end" }
        ],
        "override-reason": "Another user acquired lock in exclusive mode, try after sometime"
    },
    {
        "command": "^commit",
        "pattern": "^% Failed to commit",
        "onError": [
            { "write": "show configuration failed", "action": "store-reason" },
            { "write": "end", "prompt": "Uncommitted changes found" },
            { "write": "no" }
        ],
        "ignore-reason": "!!% Object is in use: Policy-map"
    },
    {
        "command": "^commit",
        "pattern": "^Do you wish to proceed with this commit anyway",
        "onError": [
            { "write": "yes" }
        ],
        "ignore-reason" : "Do you wish to proceed with this commit anyway"
    },
    {
        "command": ".*edit.*",
        "pattern": ".*",
        "onError": [
            { "write": "yes" }
        ],
        "ignore-reason": ".*\\[OK\\].*"
    },
    {
        "command": "^show interface.*",
        "pattern": "% Invalid input detected",
        "onError": [],
	"override-reason" : "Resource Removed",
	"error-dict": {"statusCode": 404}
    },
    {
        "command": ".+",
        "pattern": "^Invalid command",
        "onError": [ { "write": "end" } ]
    },
    {
        "command": ".+",
        "pattern": ".*Invalid input detected.*",
        "onError": [ { "write": "end" } ]
    },
    {
        "command": ".+",
        "pattern": ".*incorrect IP address assignment.*",
        "onError": [ { "write": "end" } ]
    },
    {
        "command": ".+",
        "pattern": ".*Inconsistent address and mask.*",
        "onError": [ { "write": "end" } ]
    },
    {
        "command": ".+",
        "pattern": ".*Incomplete command*",
        "onError": [ { "write": "end" } ]
    }]
}
