{
  "type": "form",
  "version": "2.0",
  "cells": [
    {
      "children": [
        {
          "model": "label"
        },
        {
          "model": "description"
        },
        {
          "model": "properties.typeGroup",
          "label": "Type Group"
        }
      ],
      "label": "General"
    },
    {
      "label": "Authentication",
      "children": [
        {
          "model": "properties.authentication.cli.username",
          "label": "CLI Username"
        },
        {
          "model": "properties.authentication.cli.password",
          "label": "CLI Password",
          "renderer": {
            "name": "password"
          }
        }
      ]
    },
    {
      "label": "Connection",
      "children": [
        {
          "model": "properties.connection.cli.hostport",
          "label": "CLI Host Port"
        }
      ]
    }
  ]
}
 
