{
    "endpoint": "cli",
    "type": "bpprov.runners.simple.Sequence",
    "tests": [
        "commands/tests/show-termpoints.json"
    ],
    "endpoint-parameters": {
        "command": "show interfaces",
        "fsm": "fsms/show-equipment.fsm"
    },
    "out-path": [
    ],
    "in-path": [{
      "type": "bpprov.translators.importer.Json",
      "parameters": {
        "file": "/commands/equipment-common.json"
      }
    }, 
    {
        "type": "bpprov.translators.list.GroupBy",
        "parameters": {
            "groups": ["slot", "port"]
        }
    },
    {
        "type": "bpprov.translators.template.Json",
        "parameters": {
            "template": "show-termpoints.tmpl",
            "as_object": true
        }
    },
    {
          "type": "bpracisco.translators.generic_translator.TPEUpdater",
          "parameters": {
          }
    }
    
    ]
}