{
  "endpoint": "null",
  "type": "bpprov.runners.simple.Sequence",
  "endpoint-parameters": {},
  "out-path": [],
  "in-path": [
    {
        "type": "bpracisco.translators.utils.SessionId",
        "parameters": {
        }
    },
    {
      "type": "bpprov.translators.template.Json",
      "parameters": {
        "template": "ios/create-bridge-interface-in.tmpl",
        "as_object": true
      }
    },
    {
      "type": "bpprov.translators.blueplanet.Envelope",
      "parameters": {
        "path": "msg"
      }
    },
    {
      "type": "bpprov.translators.aggregator.Command",
      "parameters": {
        "command": "kafka.json"
      }
    }
  ]
}
