{
    "endpoint": "null",
    "type": "bpprov.runners.simple.Sequence",
    "out-path": [],
    "in-path": [
    {
        "type": "bpprov.translators.aggregator.Command",
            "parameters": {
                "command": "create_tpe_put.json"
                }
    },
    {
        "type": "bpprov.translators.aggregator.Command",
            "parameters": {
                "command": "delete_tpe_put.json"
                }
    }
]
}
