{
    "endpoint": "cli",
    "type": "bpprov.runners.simple.Sequence",
    "tests": [
    ],
    "endpoint-parameters": {
        "template": "asr9k/show-ipv6.tmpl",
        "fsm": "fsms/asr9k/get_ipv6.fsm"
    },
    "out-path": [
     ],
    "in-path": [
    ]
}

