{
  "product": "urn:cyaninc:bp:product:bpracisco:fre",
  "resource": "bpracisco.resourceTypes.FRE",
  "type": "bpprov_full",
  "provider_resource_id_field": "data.id",
  "label_field": "name",
  "commands": {
    "post": {
      "command": "create-fre.json",
      "returns_resource": true
    },
    "delete": {
      "command": "delete-fre.json",
      "send_resource": true
    },
    "list": {
      "command": "show-fres.json"
    },
    "get": {
      "command": "get-fre.json"
    },
    "resync": {
      "product": {
        "command": "/commands/async_polling/resync-fres.json"
      }
    }
  }
}
