{
    "type": "bpprov.runners.simple.Event",
    "tests": [],
    "in-path": [
        {
            "type": "bpprov.translators.aggregator.Call",
            "parameters": {
                "command": "/commands/show-networkconstruct-async.json"
            }
        }
    ]
}
