{
  "endpoint": "null",
  "type": "bpprov.runners.simple.Sequence",
  "tests": [],
  "out-path": [],
  "in-path": [
    {
      "type": "bpprov.translators.aggregator.Call",
      "parameters": {
        "command": "/commands/show-lldp-details.json",
        "output": {
          "patches": [
            {
              "from": "/data",
              "to": "/data/lldp"
            }
          ]
        }
      }
    },
    {
      "type": "bpracisco.translators.generic_translator.NCUpdater",
      "parameters": {
      }
    },
    {
      "type": "bpprov.translators.template.Json",
      "parameters": {
        "template": "show-lldp.tmpl",
        "as_object": true
      }
    }
  ]
}