<?xml version="1.0" encoding="UTF-8" standalone="no"?>
<svg width="18px" height="17px" viewBox="0 0 18 17" version="1.1" xmlns="http://www.w3.org/2000/svg" xmlns:xlink="http://www.w3.org/1999/xlink" xmlns:sketch="http://www.bohemiancoding.com/sketch/ns">
    <!-- Generator: Sketch 3.4.2 (15857) - http://www.bohemiancoding.com/sketch -->
    <title>ICON - Download</title>
    <desc>Created with Sketch.</desc>
    <defs></defs>
    <g id="Website" stroke="none" stroke-width="1" fill="none" fill-rule="evenodd" sketch:type="MSPage">
        <g id="mb_versicherung_disc_desktop" sketch:type="MSArtboardGroup" transform="translate(-330.000000, -4866.000000)" fill="#FFFFFF">
            <path d="M334.977459,4872.6271 L337.350358,4872.6271 L337.350358,4870.94866 C337.350358,4867.73655 339.868012,4866 342.472573,4866 L342.472573,4866.20261 C340.736286,4866.81042 340.41798,4868.43101 340.41798,4870.6013 L340.41798,4872.6271 L342.935635,4872.6271 L338.970944,4877.89407 L334.977459,4872.6271 L334.977459,4872.6271 L334.977459,4872.6271 Z M348,4882.66893 L330,4882.66893 L330,4876.44704 L332.459805,4876.44704 L332.459805,4880.20912 L345.540195,4880.20912 L345.540195,4876.44704 L348,4876.44704 L348,4882.66893 L348,4882.66893 L348,4882.66893 Z" id="ICON---Download" sketch:type="MSShapeGroup"></path>
        </g>
    </g>
</svg>