id,year,month,day,hour,low,high,icn,wdir,wspd
0,2009,9,8,18,13,13,14,,0
1,2009,9,9,0,,,36,,0
2,2009,9,9,6,16,21,1,270,6
3,2009,9,9,12,21,22,1,240,6
4,2009,9,9,18,14,14,13,230,6
5,2009,9,10,0,11,15,14,250,4
6,2009,9,10,6,11,22,1,90,3
7,2009,9,10,12,23,24,1,90,6
8,2009,9,10,18,14,26,13,90,2
9,2009,9,11,0,13,14,14,90,2
10,2009,9,11,6,11,22,9,440,4
11,2009,9,11,12,21,23,6,440,10
12,2009,9,11,18,14,20,13,100,10
13,2009,9,12,0,14,15,34,120,10
14,2009,9,12,6,14,15,9,90,8
15,2009,9,12,12,14,17,6,90,4
16,2009,9,12,18,13,16,14,90,5
17,2009,9,13,0,12,13,14,90,4
18,2009,9,13,6,11,12,9,320,8
19,2009,9,13,12,13,18,6,350,9
20,2009,9,13,18,10,17,13,90,5
21,2009,9,14,0,8,9,14,90,4
22,2009,9,14,6,8,16,9,90,5
23,2009,9,14,12,17,19,6,90,10
24,2009,9,14,18,11,17,13,90,5
25,2009,9,15,0,8,10,13,90,3
26,2009,9,15,6,7,18,1,90,4
27,2009,9,15,12,18,20,6,90,5
28,2009,9,15,18,11,18,13,90,3
29,2009,9,16,0,10,13,13,90,3
30,2009,9,16,6,10,13,6,250,10
31,2009,9,16,12,13,20,6,260,17
32,2009,9,16,18,14,19,22,270,12
33,2009,9,17,0,12,15,14,280,7
34,2009,9,17,6,12,15,9,400,10
35,2009,9,17,12,15,16,6,430,17
36,2009,9,17,18,7,15,13,90,6
37,2009,9,18,0,5,8,14,90,3
38,2009,9,18,6,7,13,6,420,8
39,2009,9,18,12,13,15,6,420,14
40,2009,9,18,18,7,13,15,90,3
41,2009,9,19,0,5,7,14,90,2
42,2009,9,19,6,4,15,1,260,6
43,2009,9,19,12,15,17,6,370,12
44,2009,9,19,18,8,16,13,90,3
45,2009,9,20,0,5,8,14,90,3
46,2009,9,20,6,4,16,1,270,6
47,2009,9,20,12,17,19,1,320,10
48,2009,9,20,18,10,18,13,260,9
49,2009,9,21,0,7,9,13,260,10
50,2009,9,21,6,6,16,1,280,13
51,2009,9,21,12,17,20,6,320,15
52,2009,9,21,18,12,18,14,320,12
53,2009,9,22,0,6,11,13,350,10
54,2009,9,22,6,6,15,6,300,13
55,2009,9,22,12,15,17,6,350,18
56,2009,9,22,18,12,15,15,300,12
57,2009,9,23,0,11,13,14,290,17
58,2009,9,23,6,11,16,6,300,20
59,2009,9,23,12,16,18,33,340,28
60,2009,9,23,18,13,15,15,350,19
61,2009,9,24,0,12,13,15,330,16
62,2009,9,24,6,11,14,6,340,21
63,2009,9,24,12,13,15,6,350,20
64,2009,9,24,18,10,14,15,320,15
65,2009,9,25,0,9,11,15,340,17
66,2009,9,25,6,9,13,6,370,15
67,2009,9,25,12,13,16,6,390,16
68,2009,9,25,18,11,14,15,370,14
69,2009,9,26,0,12,12,17,360,13
70,2009,9,26,6,12,15,9,370,13
71,2009,9,26,12,15,16,7,370,18
72,2009,9,26,18,14,15,17,350,12
73,2009,9,27,0,13,13,14,330,12
74,2009,9,27,6,13,14,9,330,15
75,2009,9,27,12,14,15,7,340,18
76,2009,9,27,18,9,14,14,300,10
77,2009,9,28,0,7,9,14,300,9
78,2009,9,28,6,7,16,9,280,15
79,2009,9,28,12,16,18,6,330,26
80,2009,9,28,18,12,16,34,320,22
81,2009,9,29,0,10,12,17,330,22
82,2009,9,29,6,9,11,6,370,24
83,2009,9,29,12,10,11,6,400,24
84,2009,9,29,18,5,10,14,350,11
85,2009,9,30,0,1,5,13,370,11
86,2009,9,30,6,3,10,1,360,14
87,2009,9,30,12,10,12,6,360,21
88,2009,9,30,18,3,9,13,330,13
0,2009,10,1,0,4,5,13,290,20
1,2009,10,1,6,4,8,6,290,23
2,2009,10,1,12,7,9,18,300,24
3,2009,10,1,18,6,9,15,310,21
4,2009,10,2,0,5,6,15,390,30
5,2009,10,2,6,4,8,6,370,22
6,2009,10,2,12,7,9,6,370,22
7,2009,10,2,18,,,36,,0
8,2009,10,3,0,,,36,,0
9,2009,10,3,6,,,36,,0
10,2009,10,3,12,,,36,,0
11,2009,10,3,18,,,36,,0
12,2009,10,4,0,,,36,,0
13,2009,10,4,6,,,36,,0
14,2009,10,4,12,,,36,,0
15,2009,10,4,18,,,36,,0
16,2009,10,5,0,,,36,,0
17,2009,10,5,6,,,36,,0
18,2009,10,5,12,,,36,,0
19,2009,10,5,18,5,5,13,330,15
20,2009,10,6,0,2,6,15,330,14
21,2009,10,6,6,1,10,9,280,11
22,2009,10,6,12,10,12,6,370,15
23,2009,10,6,18,2,10,14,90,2
24,2009,10,7,0,1,4,14,260,8
25,2009,10,7,6,5,7,13,250,26
26,2009,10,7,12,7,10,18,280,22
27,2009,10,7,18,11,15,34,320,19
28,2009,10,8,0,9,15,14,350,12
29,2009,10,8,6,9,10,18,240,7
30,2009,10,8,12,7,9,19,120,16
31,2009,10,8,18,6,7,14,110,15
32,2009,10,9,0,6,7,14,320,14
33,2009,10,9,6,7,9,6,340,26
34,2009,10,9,12,8,10,33,370,28
35,2009,10,9,18,5,9,14,400,14
36,2009,10,10,0,1,4,13,90,6
37,2009,10,10,6,2,3,9,130,7
38,2009,10,10,12,4,6,7,170,8
39,2009,10,10,18,2,5,14,150,8
40,2009,10,11,0,1,4,14,180,8
41,2009,10,11,6,3,6,6,170,13
42,2009,10,11,12,5,7,18,170,17
43,2009,10,11,18,5,5,34,190,12
44,2009,10,12,0,5,6,34,200,9
45,2009,10,12,6,6,7,18,290,13
46,2009,10,12,12,8,9,9,330,11
47,2009,10,12,18,4,8,34,90,10
48,2009,10,13,0,2,4,34,90,17
49,2009,10,13,6,1,3,19,100,19
50,2009,10,13,12,3,4,7,440,23
51,2009,10,13,18,1,2,15,90,30
52,2009,10,14,0,0,1,19,90,35
53,2009,10,14,6,1,1,19,100,42
54,2009,10,14,12,1,2,18,120,31
55,2009,10,14,18,1,2,34,140,16
56,2009,10,15,0,1,2,14,180,8
57,2009,10,15,6,0,4,2,180,9
58,2009,10,15,12,5,7,6,190,10
59,2009,10,15,18,1,4,13,140,8
60,2009,10,16,0,0,1,14,90,4
61,2009,10,16,6,0,2,9,230,9
62,2009,10,16,12,2,2,6,240,17
63,2009,10,16,18,1,2,14,280,10
64,2009,10,17,0,0,1,14,300,11
65,2009,10,17,6,1,2,9,300,12
66,2009,10,17,12,2,4,6,310,13
67,2009,10,17,18,-3,1,14,270,6
68,2009,10,18,0,-4,-2,14,250,4
69,2009,10,18,6,-5,-1,10,260,7
70,2009,10,18,12,0,2,9,280,8
71,2009,10,18,18,1,2,14,270,5
72,2009,10,19,0,0,1,14,280,10
73,2009,10,19,6,0,3,9,280,18
74,2009,10,19,12,4,7,6,310,19
75,2009,10,19,18,-1,3,14,260,10
76,2009,10,20,0,-3,-1,14,240,7
77,2009,10,20,6,-3,6,10,220,7
78,2009,10,20,12,5,7,1,160,12
79,2009,10,20,18,4,5,34,140,12
80,2009,10,21,0,4,4,14,160,14
81,2009,10,21,6,4,5,18,180,11
82,2009,10,21,12,6,7,18,180,9
83,2009,10,21,18,5,7,14,270,11
84,2009,10,22,0,1,4,14,290,7
85,2009,10,22,6,1,6,6,190,8
86,2009,10,22,12,6,7,6,220,13
87,2009,10,22,18,5,6,34,170,9
88,2009,10,23,0,5,5,14,150,8
89,2009,10,23,6,5,7,9,150,10
90,2009,10,23,12,7,7,9,140,11
91,2009,10,23,18,7,7,14,130,11
92,2009,10,24,0,6,7,14,140,11
93,2009,10,24,6,6,7,6,160,11
94,2009,10,24,12,8,8,6,170,10
95,2009,10,24,18,5,7,17,190,9
96,2009,10,25,0,5,6,34,210,13
97,2009,10,25,6,5,7,18,230,17
98,2009,10,25,12,7,7,9,240,20
99,2009,10,25,18,6,7,14,250,17
100,2009,10,26,0,7,8,14,250,13
101,2009,10,26,6,8,10,9,270,12
102,2009,10,26,12,10,10,18,300,11
103,2009,10,26,18,9,10,34,280,8
104,2009,10,27,0,6,9,14,330,9
105,2009,10,27,6,6,9,9,290,10
106,2009,10,27,12,8,9,9,310,9
107,2009,10,27,18,7,8,14,350,8
108,2009,10,28,0,7,8,34,390,14
109,2009,10,28,6,6,7,6,400,18
110,2009,10,28,12,6,6,6,390,17
111,2009,10,28,18,4,6,15,400,14
112,2009,10,29,0,2,4,17,420,17
113,2009,10,29,6,2,3,6,430,19
114,2009,10,29,12,3,3,7,420,18
115,2009,10,29,18,2,4,14,100,19
116,2009,10,30,0,0,2,17,90,18
117,2009,10,30,6,-1,2,6,100,15
118,2009,10,30,12,1,3,2,410,12
119,2009,10,30,18,-1,1,15,400,7
120,2009,10,31,0,-1,0,17,400,7
121,2009,10,31,6,0,1,7,400,6
122,2009,10,31,12,1,1,18,90,4
123,2009,10,31,18,-4,0,14,90,2
0,2009,11,1,0,-5,-4,14,90,3
1,2009,11,1,6,,,36,,0
2,2009,11,1,12,,,36,,0
3,2009,11,1,18,,,36,,0
4,2009,11,2,0,-4,0,14,250,10
5,2009,11,2,6,-4,1,1,250,14
6,2009,11,2,12,-2,2,2,240,20
7,2009,11,2,18,-4,-2,13,240,20
8,2009,11,3,0,-5,-4,13,230,17
9,2009,11,3,6,-5,-1,1,230,22
10,2009,11,3,12,-2,0,6,220,24
11,2009,11,3,18,-2,-2,17,230,23
12,2009,11,4,0,-3,-2,29,220,21
13,2009,11,4,6,-4,-2,6,210,24
14,2009,11,4,12,-2,-1,6,210,28
15,2009,11,4,18,-2,-2,17,230,28
16,2009,11,5,0,-2,-2,30,230,28
17,2009,11,5,6,,,36,,0
18,2009,11,5,12,,,36,,0
19,2009,11,5,18,,,36,,0
20,2009,11,6,0,,,36,,0
21,2009,11,6,6,,,36,,0
22,2009,11,6,12,1,1,14,260,13
23,2009,11,6,18,0,1,14,260,18
24,2009,11,7,0,0,1,14,220,14
25,2009,11,7,6,1,3,9,180,15
26,2009,11,7,12,3,3,18,170,11
27,2009,11,7,18,2,3,14,90,4
28,2009,11,8,0,2,3,14,290,8
29,2009,11,8,6,2,3,9,90,4
30,2009,11,8,12,3,4,9,130,9
31,2009,11,8,18,3,4,14,130,12
32,2009,11,9,0,,,36,,0
33,2009,11,9,6,,,36,,0
34,2009,11,9,12,,,36,,0
35,2009,11,9,18,,,36,,0
36,2009,11,10,0,3,3,14,230,19
37,2009,11,10,6,2,3,18,250,15
38,2009,11,10,12,3,3,18,240,13
39,2009,11,10,18,2,3,34,240,9
40,2009,11,11,0,,,36,,0
41,2009,11,11,6,,,36,,0
42,2009,11,11,12,,,36,,0
43,2009,11,11,18,,,36,,0
44,2009,11,12,0,5,5,14,160,6
45,2009,11,12,6,5,7,9,180,5
46,2009,11,12,12,6,7,9,170,4
47,2009,11,12,18,6,6,14,90,4
48,2009,11,13,0,5,6,14,370,9
49,2009,11,13,6,2,4,9,350,11
50,2009,11,13,12,3,3,6,370,10
51,2009,11,13,18,2,3,17,380,7
52,2009,11,14,0,1,2,14,90,4
53,2009,11,14,6,1,2,9,290,6
54,2009,11,14,12,2,3,9,250,9
55,2009,11,14,18,2,3,14,230,10
56,2009,11,15,0,1,3,14,240,15
57,2009,11,15,6,0,4,9,230,12
58,2009,11,15,12,4,4,6,230,11
59,2009,11,15,18,4,4,17,230,10
60,2009,11,16,0,3,4,17,230,12
61,2009,11,16,6,3,5,7,230,15
62,2009,11,16,12,4,5,6,240,15
63,2009,11,16,18,4,4,14,250,17
64,2009,11,17,0,0,4,14,250,14
65,2009,11,17,6,1,3,9,250,16
66,2009,11,17,12,3,4,9,250,22
67,2009,11,17,18,4,5,14,260,18
68,2009,11,18,0,5,6,14,280,9
69,2009,11,18,6,6,8,18,360,11
70,2009,11,18,12,6,8,6,350,15
71,2009,11,18,18,6,6,14,280,19
72,2009,11,19,0,6,6,19,270,27
73,2009,11,19,6,6,7,19,370,27
74,2009,11,19,12,6,7,6,380,25
75,2009,11,19,18,5,6,17,350,14
76,2009,11,20,0,5,9,34,290,13
77,2009,11,20,6,8,9,9,350,16
78,2009,11,20,12,4,9,9,340,15
79,2009,11,20,18,2,4,14,260,11
80,2009,11,21,0,2,3,14,280,13
81,2009,11,21,6,2,8,9,320,16
82,2009,11,21,12,8,10,9,370,21
83,2009,11,21,18,7,8,14,370,19
84,2009,11,22,0,6,7,17,350,18
85,2009,11,22,6,6,6,17,360,13
86,2009,11,22,12,4,7,6,290,13
87,2009,11,22,18,4,5,14,260,21
88,2009,11,23,0,5,6,14,280,21
89,2009,11,23,6,6,7,18,290,13
90,2009,11,23,12,7,8,9,290,20
91,2009,11,23,18,6,7,14,290,21
92,2009,11,24,0,5,6,14,290,22
93,2009,11,24,6,5,7,14,280,25
94,2009,11,24,12,6,8,18,340,33
95,2009,11,24,18,6,7,15,350,24
96,2009,11,25,0,5,6,34,350,17
97,2009,11,25,6,6,7,6,350,14
98,2009,11,25,12,6,7,6,290,15
99,2009,11,25,18,6,8,34,290,17
100,2009,11,26,0,8,8,14,290,19
101,2009,11,26,6,6,8,9,280,24
102,2009,11,26,12,6,7,18,330,18
103,2009,11,26,18,5,7,14,320,18
104,2009,11,27,0,4,5,14,290,18
105,2009,11,27,6,3,5,9,290,21
106,2009,11,27,12,4,6,6,270,22
107,2009,11,27,18,4,5,14,280,22
108,2009,11,28,0,4,5,14,280,22
109,2009,11,28,6,4,5,6,310,21
110,2009,11,28,12,3,6,6,290,20
111,2009,11,28,18,0,3,14,260,15
112,2009,11,29,0,0,1,14,250,14
113,2009,11,29,6,1,4,9,280,21
114,2009,11,29,12,3,4,18,280,23
115,2009,11,29,18,4,4,14,290,13
116,2009,11,30,0,2,4,14,240,10
117,2009,11,30,6,1,4,9,240,15
118,2009,11,30,12,3,4,9,230,21
119,2009,11,30,18,3,4,13,250,24
0,2009,12,1,0,3,4,13,250,29
1,2009,12,1,6,3,5,1,250,28
2,2009,12,1,12,5,6,1,250,24
3,2009,12,1,18,6,7,14,250,23
4,2009,12,2,0,4,6,14,250,18
5,2009,12,2,6,5,8,9,250,20
6,2009,12,2,12,7,8,14,280,21
7,2009,12,2,18,5,7,17,310,21
8,2009,12,3,0,4,5,17,300,17
9,2009,12,3,6,4,4,6,300,13
10,2009,12,3,12,3,4,7,310,9
11,2009,12,3,18,1,3,17,250,8
12,2009,12,4,0,-1,2,14,180,8
13,2009,12,4,6,1,3,7,160,6
14,2009,12,4,12,3,4,9,160,10
15,2009,12,4,18,4,4,14,170,9
16,2009,12,5,0,3,4,14,170,8
17,2009,12,5,6,1,3,34,230,9
18,2009,12,5,12,0,1,18,220,12
19,2009,12,5,18,0,0,17,200,11
20,2009,12,6,0,0,0,29,230,13
21,2009,12,6,6,0,1,14,230,13
22,2009,12,6,12,1,1,18,230,16
23,2009,12,6,18,0,1,34,230,12
24,2009,12,7,0,0,1,19,210,11
25,2009,12,7,6,1,1,18,220,17
26,2009,12,7,12,1,2,18,220,17
27,2009,12,7,18,1,1,17,220,15
28,2009,12,8,0,1,2,34,220,13
29,2009,12,8,6,2,3,9,230,12
30,2009,12,8,12,3,4,9,260,11
31,2009,12,8,18,3,4,14,240,11
32,2009,12,9,0,4,4,14,260,8
33,2009,12,9,6,2,4,34,240,7
34,2009,12,9,12,3,4,9,400,7
35,2009,12,9,18,2,3,34,400,9
36,2009,12,10,0,1,2,14,410,8
37,2009,12,10,6,1,2,9,420,7
38,2009,12,10,12,1,2,9,90,6
39,2009,12,10,18,-1,1,29,200,12
40,2009,12,11,0,-2,-1,14,200,11
41,2009,12,11,6,-3,-2,7,220,10
42,2009,12,11,12,-3,-3,7,180,8
43,2009,12,11,18,-4,-3,17,180,9
44,2009,12,12,0,-5,-4,17,140,7
45,2009,12,12,6,-4,-4,6,150,8
46,2009,12,12,12,-5,-3,6,110,6
47,2009,12,12,18,-7,-5,14,90,5
48,2009,12,13,0,-6,-5,14,90,6
49,2009,12,13,6,-6,-5,14,360,7
50,2009,12,13,12,-5,-5,7,360,7
51,2009,12,13,18,-6,-5,17,280,7
52,2009,12,14,0,-6,-6,14,260,9
53,2009,12,14,6,-6,-5,29,90,5
54,2009,12,14,12,-5,-5,29,410,6
55,2009,12,14,18,-9,-5,29,140,11
56,2009,12,15,0,-16,-9,29,140,14
57,2009,12,15,6,-18,-14,14,190,8
58,2009,12,15,12,-15,-12,2,190,10
59,2009,12,15,18,-16,-14,13,230,12
60,2009,12,16,0,-15,-14,13,240,18
61,2009,12,16,6,-16,-14,6,240,20
62,2009,12,16,12,-14,-13,1,220,20
63,2009,12,16,18,-15,-14,13,230,21
64,2009,12,17,0,-16,-14,13,220,20
65,2009,12,17,6,-15,-14,1,190,22
66,2009,12,17,12,-14,-13,1,180,22
67,2009,12,17,18,-14,-13,14,170,20
68,2009,12,18,0,-14,-13,14,170,20
69,2009,12,18,6,-14,-12,1,160,21
70,2009,12,18,12,-13,-11,1,160,21
71,2009,12,18,18,-13,-12,29,170,18
72,2009,12,19,0,-13,-13,30,170,13
73,2009,12,19,6,-13,-12,30,170,11
74,2009,12,19,12,-12,-11,30,180,10
75,2009,12,19,18,-12,-11,30,170,9
76,2009,12,20,0,-16,-12,29,190,5
77,2009,12,20,6,-17,-15,29,90,3
78,2009,12,20,12,-14,-13,6,210,4
79,2009,12,20,18,-13,-13,29,270,5
80,2009,12,21,0,-16,-13,29,310,7
81,2009,12,21,6,-17,-15,10,300,13
82,2009,12,21,12,-17,-16,10,280,15
83,2009,12,21,18,-17,-13,29,280,13
84,2009,12,22,0,-13,-9,14,250,9
85,2009,12,22,6,-8,-7,10,250,14
86,2009,12,22,12,-8,-7,10,230,16
87,2009,12,22,18,-8,-3,14,230,27
88,2009,12,23,0,-3,0,29,260,27
89,2009,12,23,6,-1,0,10,250,23
90,2009,12,23,12,-1,1,19,250,25
91,2009,12,23,18,0,1,19,280,21
92,2009,12,24,0,0,1,14,360,14
93,2009,12,24,6,0,1,9,350,12
94,2009,12,24,12,0,1,9,200,8
95,2009,12,24,18,0,0,14,200,18
96,2009,12,25,0,0,1,14,200,24
97,2009,12,25,6,1,2,34,210,22
98,2009,12,25,12,2,2,19,230,23
99,2009,12,25,18,2,2,19,250,24
100,2009,12,26,0,2,3,34,270,17
101,2009,12,26,6,2,3,7,310,20
102,2009,12,26,12,1,3,6,310,23
103,2009,12,26,18,1,2,19,320,28
104,2009,12,27,0,1,2,17,360,29
105,2009,12,27,6,2,3,18,350,20
106,2009,12,27,12,2,3,18,330,18
107,2009,12,27,18,1,2,14,270,12
108,2009,12,28,0,0,1,14,260,14
109,2009,12,28,6,0,0,10,250,16
110,2009,12,28,12,0,0,10,220,11
111,2009,12,28,18,0,0,19,150,8
112,2009,12,29,0,-1,0,30,110,8
113,2009,12,29,6,-1,-1,29,440,13
114,2009,12,29,12,-1,0,29,400,17
115,2009,12,29,18,-4,-2,30,380,22
116,2009,12,30,0,-4,-3,17,380,20
117,2009,12,30,6,-4,-3,6,360,14
118,2009,12,30,12,-5,-3,6,350,16
119,2009,12,30,18,-7,-5,15,330,15
120,2009,12,31,0,-5,-4,29,340,12
121,2009,12,31,6,-5,-4,29,270,9
122,2009,12,31,12,-5,-3,29,320,7
123,2009,12,31,18,-7,-5,14,260,6
