id,year,month,day,hour,low,high,icn,wdir,wspd
0,2014,1,1,0,-3,-1,14,250,15
1,2014,1,1,6,-2,0,6,240,14
2,2014,1,1,12,-1,0,7,240,18
3,2014,1,1,18,-1,0,14,240,18
4,2014,1,2,0,-1,0,27,250,15
5,2014,1,2,6,0,0,27,250,17
6,2014,1,2,12,-1,0,27,240,16
7,2014,1,2,18,-1,-1,14,240,15
8,2014,1,3,0,-1,0,14,230,12
9,2014,1,3,6,0,0,10,250,17
10,2014,1,3,12,0,0,18,250,13
11,2014,1,3,18,0,1,14,260,14
12,2014,1,4,0,1,2,14,280,15
13,2014,1,4,6,2,3,9,270,20
14,2014,1,4,12,2,3,9,300,19
15,2014,1,4,18,3,3,14,290,14
16,2014,1,5,0,2,3,14,240,11
17,2014,1,5,6,2,4,9,230,17
18,2014,1,5,12,3,4,18,230,21
19,2014,1,5,18,3,3,34,260,21
20,2014,1,6,0,4,4,34,260,13
21,2014,1,6,6,3,5,19,370,17
22,2014,1,6,12,3,4,6,360,19
23,2014,1,6,18,-1,3,14,270,9
24,2014,1,7,0,0,2,14,260,14
25,2014,1,7,6,2,3,18,270,20
26,2014,1,7,12,3,4,18,300,21
27,2014,1,7,18,5,6,14,310,17
28,2014,1,8,0,5,6,14,290,18
29,2014,1,8,6,5,5,9,290,20
30,2014,1,8,12,4,5,9,290,17
31,2014,1,8,18,4,4,14,280,13
32,2014,1,9,0,4,6,34,350,17
33,2014,1,9,6,5,5,34,330,17
34,2014,1,9,12,4,5,6,330,16
35,2014,1,9,18,4,5,14,260,19
36,2014,1,10,0,5,6,19,300,25
37,2014,1,10,6,5,7,6,310,26
38,2014,1,10,12,3,5,18,340,32
39,2014,1,10,18,2,3,34,370,32
40,2014,1,11,0,1,2,17,370,29
41,2014,1,11,6,0,1,17,360,19
42,2014,1,11,12,1,4,18,330,17
43,2014,1,11,18,3,3,19,310,18
44,2014,1,12,0,2,3,19,300,17
45,2014,1,12,6,1,3,18,300,16
46,2014,1,12,12,-2,1,29,400,24
47,2014,1,12,18,-2,-1,17,410,11
48,2014,1,13,0,-2,-1,29,250,7
49,2014,1,13,6,-3,-2,29,400,19
50,2014,1,13,12,-4,-3,29,400,19
51,2014,1,13,18,-4,-4,29,410,12
52,2014,1,14,0,-5,-4,17,90,4
53,2014,1,14,6,-5,-3,6,270,7
54,2014,1,14,12,-4,-3,6,220,11
55,2014,1,14,18,-6,-4,13,170,7
56,2014,1,15,0,-5,-4,30,200,7
57,2014,1,15,6,-5,-4,30,160,10
58,2014,1,15,12,-4,-4,29,150,13
59,2014,1,15,18,-5,-4,14,110,17
60,2014,1,16,0,-5,-5,14,100,17
61,2014,1,16,6,-7,-6,29,440,14
62,2014,1,16,12,-9,-7,29,410,14
63,2014,1,16,18,-12,-10,29,90,8
64,2014,1,17,0,-12,-11,29,190,7
65,2014,1,17,6,-12,-11,29,190,10
66,2014,1,17,12,-11,-10,6,180,13
67,2014,1,17,18,-10,-10,30,170,14
68,2014,1,18,0,-10,-10,29,160,14
69,2014,1,18,6,-10,-10,30,150,14
70,2014,1,18,12,-13,-9,1,140,12
71,2014,1,18,18,-14,-12,13,90,6
72,2014,1,19,0,-15,-13,13,150,8
73,2014,1,19,6,-16,-13,13,90,5
74,2014,1,19,12,-13,-11,2,160,10
75,2014,1,19,18,-15,-13,13,190,11
76,2014,1,20,0,-18,-16,13,170,12
77,2014,1,20,6,-18,-15,14,180,12
78,2014,1,20,12,-15,-13,2,170,13
79,2014,1,20,18,-15,-13,13,190,16
80,2014,1,21,0,-17,-15,13,180,15
81,2014,1,21,6,-18,-14,2,170,9
82,2014,1,21,12,-13,-11,2,170,11
83,2014,1,21,18,-17,-13,13,160,8
84,2014,1,22,0,-18,-17,13,130,8
85,2014,1,22,6,-20,-15,29,110,10
86,2014,1,22,12,-14,-12,1,110,12
87,2014,1,22,18,-18,-14,14,110,10
88,2014,1,23,0,-20,-18,14,100,8
89,2014,1,23,6,-20,-16,10,90,9
90,2014,1,23,12,-15,-13,1,130,11
91,2014,1,23,18,-17,-14,13,130,7
92,2014,1,24,0,-19,-16,13,100,5
93,2014,1,24,6,-21,-15,14,100,7
94,2014,1,24,12,-15,-13,1,120,10
95,2014,1,24,18,-17,-15,13,140,7
96,2014,1,25,0,-20,-17,14,140,7
97,2014,1,25,6,-20,-15,1,120,6
98,2014,1,25,12,-15,-12,2,150,7
99,2014,1,25,18,-16,-14,13,90,3
100,2014,1,26,0,-18,-16,13,90,5
101,2014,1,26,6,-19,-13,1,90,6
102,2014,1,26,12,-14,-11,1,190,14
103,2014,1,26,18,-15,-14,13,200,15
104,2014,1,27,0,-16,-15,13,200,15
105,2014,1,27,6,-15,-11,1,190,17
106,2014,1,27,12,-11,-10,1,190,19
107,2014,1,27,18,-11,-11,13,200,20
108,2014,1,28,0,-13,-11,14,180,14
109,2014,1,28,6,-13,-12,2,190,17
110,2014,1,28,12,-12,-11,2,170,16
111,2014,1,28,18,-13,-11,13,180,20
112,2014,1,29,0,-15,-14,14,180,20
113,2014,1,29,6,-15,-15,2,190,21
114,2014,1,29,12,-14,-12,2,200,23
115,2014,1,29,18,-16,-13,14,210,23
116,2014,1,30,0,-19,-16,13,200,21
117,2014,1,30,6,-20,-17,1,210,24
118,2014,1,30,12,-16,-15,1,210,23
119,2014,1,30,18,-16,-16,13,230,28
120,2014,1,31,0,-17,-16,13,230,27
121,2014,1,31,6,-16,-13,6,230,34
122,2014,1,31,12,-12,-10,1,240,38
123,2014,1,31,18,-10,-10,14,240,41
0,2014,2,1,0,-10,-10,14,240,40
1,2014,2,1,6,-10,-9,3,250,38
2,2014,2,1,12,-8,-7,3,250,36
3,2014,2,1,18,-7,-7,14,250,38
4,2014,2,2,0,-9,-7,14,250,34
5,2014,2,2,6,-10,-8,1,240,31
6,2014,2,2,12,-7,-6,1,240,25
7,2014,2,2,18,-7,-6,13,250,23
8,2014,2,3,0,-8,-7,13,270,22
9,2014,2,3,6,-8,-5,1,270,19
10,2014,2,3,12,-5,-3,1,260,10
11,2014,2,3,18,-9,-5,14,250,11
12,2014,2,4,0,-11,-9,14,190,7
13,2014,2,4,6,-13,-3,14,230,8
14,2014,2,4,12,-3,0,1,220,13
15,2014,2,4,18,-7,-4,13,220,12
16,2014,2,5,0,-9,-7,13,250,13
17,2014,2,5,6,-9,-3,1,250,13
18,2014,2,5,12,-1,3,1,240,14
19,2014,2,5,18,-3,-1,13,260,18
20,2014,2,6,0,-6,-3,13,260,14
21,2014,2,6,6,-6,-3,1,270,20
22,2014,2,6,12,-3,-1,1,280,17
23,2014,2,6,18,-5,-3,15,280,14
24,2014,2,7,0,-2,-2,14,270,9
25,2014,2,7,6,-2,1,10,270,11
26,2014,2,7,12,2,4,9,240,13
27,2014,2,7,18,1,2,14,250,20
28,2014,2,8,0,2,2,34,250,20
29,2014,2,8,6,1,2,9,280,17
30,2014,2,8,12,2,3,9,280,11
31,2014,2,8,18,1,1,14,270,11
32,2014,2,9,0,0,1,14,230,10
33,2014,2,9,6,0,2,10,220,16
34,2014,2,9,12,2,3,9,250,17
35,2014,2,9,18,2,2,14,250,12
36,2014,2,10,0,1,2,14,260,8
37,2014,2,10,6,1,2,9,90,7
38,2014,2,10,12,1,2,18,240,9
39,2014,2,10,18,0,0,19,90,2
40,2014,2,11,0,0,0,14,340,6
41,2014,2,11,6,0,0,9,240,7
42,2014,2,11,12,1,1,9,240,14
43,2014,2,11,18,1,1,14,250,20
44,2014,2,12,0,0,1,14,290,15
45,2014,2,12,6,0,1,10,290,13
46,2014,2,12,12,1,4,9,270,10
47,2014,2,12,18,0,2,19,250,7
48,2014,2,13,0,0,0,19,440,6
49,2014,2,13,6,0,0,9,90,4
50,2014,2,13,12,0,1,9,90,3
51,2014,2,13,18,0,1,14,230,9
52,2014,2,14,0,-1,0,14,230,10
53,2014,2,14,6,0,0,17,220,9
54,2014,2,14,12,0,0,7,270,10
55,2014,2,14,18,0,0,14,280,8
56,2014,2,15,0,0,1,14,310,8
57,2014,2,15,6,0,1,18,330,10
58,2014,2,15,12,1,1,7,290,12
59,2014,2,15,18,1,1,13,250,21
60,2014,2,16,0,1,2,13,260,20
61,2014,2,16,6,0,2,33,270,22
62,2014,2,16,12,1,2,9,280,16
63,2014,2,16,18,2,3,14,310,15
64,2014,2,17,0,1,3,14,310,14
65,2014,2,17,6,1,3,9,300,16
66,2014,2,17,12,3,5,6,340,21
67,2014,2,17,18,1,3,14,330,19
68,2014,2,18,0,1,2,17,330,17
69,2014,2,18,6,1,2,7,350,21
70,2014,2,18,12,3,5,2,350,22
71,2014,2,18,18,-1,3,13,330,14
72,2014,2,19,0,-1,0,14,260,9
73,2014,2,19,6,0,1,9,270,9
74,2014,2,19,12,1,2,9,260,9
75,2014,2,19,18,0,1,19,280,6
76,2014,2,20,0,0,1,14,380,9
77,2014,2,20,6,0,1,18,330,11
78,2014,2,20,12,1,2,18,350,12
79,2014,2,20,18,2,3,34,320,12
80,2014,2,21,0,2,3,14,350,11
81,2014,2,21,6,2,4,9,270,10
82,2014,2,21,12,3,5,9,280,15
83,2014,2,21,18,3,4,14,250,17
84,2014,2,22,0,1,3,13,260,15
85,2014,2,22,6,1,4,6,250,13
86,2014,2,22,12,4,4,18,290,10
87,2014,2,22,18,2,4,14,280,5
88,2014,2,23,0,-1,2,14,90,4
89,2014,2,23,6,-2,2,10,90,3
90,2014,2,23,12,3,7,2,90,7
91,2014,2,23,18,-3,3,14,260,4
92,2014,2,24,0,-4,-1,14,260,8
93,2014,2,24,6,-3,-1,10,270,11
94,2014,2,24,12,-1,2,10,250,9
95,2014,2,24,18,0,3,14,220,11
96,2014,2,25,0,-1,0,14,230,13
97,2014,2,25,6,-2,3,1,230,15
98,2014,2,25,12,1,3,2,230,19
99,2014,2,25,18,0,1,17,250,21
100,2014,2,26,0,0,0,17,240,17
101,2014,2,26,6,0,1,6,230,17
102,2014,2,26,12,1,1,7,240,15
103,2014,2,26,18,0,1,17,230,11
104,2014,2,27,0,0,0,17,260,9
105,2014,2,27,6,0,2,7,250,10
106,2014,2,27,12,2,3,7,300,9
107,2014,2,27,18,0,1,17,230,3
108,2014,2,28,0,-2,1,14,210,6
109,2014,2,28,6,-1,2,6,210,11
110,2014,2,28,12,1,3,7,240,19
111,2014,2,28,18,1,1,17,230,14
0,2014,3,1,0,0,1,17,230,15
1,2014,3,1,6,1,1,7,240,19
2,2014,3,1,12,1,2,7,230,18
3,2014,3,1,18,1,1,14,250,14
4,2014,3,2,0,1,1,14,240,9
5,2014,3,2,6,1,2,9,250,14
6,2014,3,2,12,2,2,9,240,17
7,2014,3,2,18,1,2,14,250,13
8,2014,3,3,0,1,1,14,250,11
9,2014,3,3,6,1,4,9,230,9
10,2014,3,3,12,4,5,6,200,13
11,2014,3,3,18,1,4,17,200,12
12,2014,3,4,0,1,2,17,190,9
13,2014,3,4,6,0,3,7,170,12
14,2014,3,4,12,4,5,7,170,11
15,2014,3,4,18,2,4,17,150,8
16,2014,3,5,0,1,2,17,150,7
17,2014,3,5,6,1,4,6,170,9
18,2014,3,5,12,4,5,6,190,9
19,2014,3,5,18,3,3,34,200,5
20,2014,3,6,0,3,3,14,230,6
21,2014,3,6,6,2,4,6,290,7
22,2014,3,6,12,4,6,6,240,5
23,2014,3,6,18,3,4,14,90,6
24,2014,3,7,0,0,2,14,90,4
25,2014,3,7,6,0,5,9,90,7
26,2014,3,7,12,5,5,7,250,11
27,2014,3,7,18,4,4,17,250,13
28,2014,3,8,0,4,4,14,270,18
29,2014,3,8,6,4,7,9,320,19
30,2014,3,8,12,6,8,9,360,17
31,2014,3,8,18,-1,5,14,320,8
32,2014,3,9,0,-5,-1,14,360,6
33,2014,3,9,6,-4,6,10,280,7
34,2014,3,9,12,7,11,1,320,15
35,2014,3,9,18,1,6,14,270,10
36,2014,3,10,0,-2,1,13,270,11
37,2014,3,10,6,-1,12,1,280,16
38,2014,3,10,12,11,15,1,290,18
39,2014,3,10,18,3,9,13,270,10
40,2014,3,11,0,0,4,13,320,11
41,2014,3,11,6,0,7,6,430,14
42,2014,3,11,12,8,11,1,420,20
43,2014,3,11,18,3,7,13,430,14
44,2014,3,12,0,-1,2,13,420,13
45,2014,3,12,6,-1,7,1,430,15
46,2014,3,12,12,8,9,2,420,19
47,2014,3,12,18,4,7,13,370,15
48,2014,3,13,0,-2,3,13,350,12
49,2014,3,13,6,-3,8,1,370,17
50,2014,3,13,12,9,11,1,370,21
51,2014,3,13,18,5,9,13,370,18
52,2014,3,14,0,1,4,13,340,15
53,2014,3,14,6,1,9,1,360,19
54,2014,3,14,12,9,11,2,400,18
55,2014,3,14,18,1,8,13,330,12
56,2014,3,15,0,1,4,13,280,18
57,2014,3,15,6,3,5,18,300,28
58,2014,3,15,12,2,5,18,320,35
59,2014,3,15,18,0,2,29,380,37
60,2014,3,16,0,-1,0,15,350,21
61,2014,3,16,6,-1,1,29,290,20
62,2014,3,16,12,-2,0,29,400,27
63,2014,3,16,18,-3,-2,29,400,19
64,2014,3,17,0,-8,-2,13,380,13
65,2014,3,17,6,-6,-2,29,280,13
66,2014,3,17,12,-2,3,6,270,23
67,2014,3,17,18,0,2,14,370,27
68,2014,3,18,0,-2,0,17,400,19
69,2014,3,18,6,-2,3,6,320,12
70,2014,3,18,12,4,6,6,350,17
71,2014,3,18,18,3,5,19,270,13
72,2014,3,19,0,5,5,14,340,18
73,2014,3,19,6,4,5,18,370,17
74,2014,3,19,12,5,6,6,400,14
75,2014,3,19,18,3,5,34,320,18
76,2014,3,20,0,5,6,34,370,30
77,2014,3,20,6,3,6,6,390,27
78,2014,3,20,12,5,9,6,350,13
79,2014,3,20,18,6,8,17,290,17
80,2014,3,21,0,4,6,14,270,19
81,2014,3,21,6,5,16,1,290,31
82,2014,3,21,12,17,18,1,300,29
83,2014,3,21,18,12,16,13,280,19
84,2014,3,22,0,9,12,13,300,17
85,2014,3,22,6,8,10,6,360,19
86,2014,3,22,12,10,11,6,350,11
87,2014,3,22,18,8,10,13,220,9
88,2014,3,23,0,9,10,13,230,14
89,2014,3,23,6,8,15,1,250,17
90,2014,3,23,12,11,16,1,430,17
91,2014,3,23,18,8,10,17,100,10
92,2014,3,24,0,7,8,34,110,13
93,2014,3,24,6,7,10,18,190,11
94,2014,3,24,12,11,14,6,300,10
95,2014,3,24,18,8,11,14,100,8
96,2014,3,25,0,7,9,14,160,12
97,2014,3,25,6,7,13,9,230,17
98,2014,3,25,12,9,12,7,270,19
99,2014,3,25,18,7,9,17,90,7
100,2014,3,26,0,5,7,17,420,11
101,2014,3,26,6,6,11,9,140,13
102,2014,3,26,12,12,15,1,150,17
103,2014,3,26,18,10,13,13,160,15
104,2014,3,27,0,8,10,13,180,8
105,2014,3,27,6,8,16,1,210,9
106,2014,3,27,12,15,18,1,160,8
107,2014,3,27,18,8,15,13,90,4
108,2014,3,28,0,5,7,14,100,8
109,2014,3,28,6,4,12,1,140,16
110,2014,3,28,12,11,14,1,130,20
111,2014,3,28,18,3,10,13,120,15
112,2014,3,29,0,-1,3,13,120,8
113,2014,3,29,6,-1,6,1,90,6
114,2014,3,29,12,7,10,1,90,8
115,2014,3,29,18,0,8,13,90,4
116,2014,3,30,0,-3,-1,14,90,2
117,2014,3,30,6,-3,10,1,390,8
118,2014,3,30,12,10,12,2,410,17
119,2014,3,30,18,4,11,13,400,7
120,2014,3,31,0,0,7,14,90,5
121,2014,3,31,6,2,6,1,420,11
122,2014,3,31,12,4,6,6,430,21
123,2014,3,31,18,0,3,17,100,17
0,2014,4,1,0,-5,-1,13,90,9
1,2014,4,1,6,-6,2,1,100,11
2,2014,4,1,12,2,5,2,440,10
3,2014,4,1,18,-3,4,13,90,5
4,2014,4,2,0,-5,-2,13,270,6
5,2014,4,2,6,-5,2,1,380,9
6,2014,4,2,12,2,6,6,390,12
7,2014,4,2,18,-3,5,13,90,6
8,2014,4,3,0,-4,-3,14,260,5
9,2014,4,3,6,-4,7,1,280,11
10,2014,4,3,12,7,9,1,290,11
11,2014,4,3,18,4,7,17,440,7
12,2014,4,4,0,0,4,13,400,9
13,2014,4,4,6,0,4,6,440,18
14,2014,4,4,12,4,8,1,90,21
15,2014,4,4,18,-2,7,1,90,10
16,2014,4,5,0,-3,-1,13,90,3
17,2014,4,5,6,-3,6,1,270,10
18,2014,4,5,12,7,10,2,260,9
19,2014,4,5,18,0,9,13,260,8
20,2014,4,6,0,-2,1,13,250,10
21,2014,4,6,6,-1,8,1,280,16
22,2014,4,6,12,10,12,1,290,19
23,2014,4,6,18,7,12,1,290,10
24,2014,4,7,0,0,7,13,90,6
25,2014,4,7,6,0,9,9,320,8
26,2014,4,7,12,10,13,6,360,15
27,2014,4,7,18,10,11,19,320,17
28,2014,4,8,0,10,11,34,370,19
29,2014,4,8,6,10,12,9,370,15
30,2014,4,8,12,13,14,6,350,12
31,2014,4,8,18,11,14,6,210,9
32,2014,4,9,0,7,11,34,230,12
33,2014,4,9,6,7,8,6,370,22
34,2014,4,9,12,9,10,6,370,20
35,2014,4,9,18,7,10,6,410,7
36,2014,4,10,0,4,7,14,150,8
37,2014,4,10,6,3,4,9,190,13
38,2014,4,10,12,4,6,7,210,16
39,2014,4,10,18,2,6,13,200,10
40,2014,4,11,0,1,3,13,220,9
41,2014,4,11,6,0,7,1,250,15
42,2014,4,11,12,8,10,2,270,15
43,2014,4,11,18,6,10,1,250,12
44,2014,4,12,0,5,6,13,260,14
45,2014,4,12,6,5,8,6,270,15
46,2014,4,12,12,8,10,6,270,17
47,2014,4,12,18,2,9,6,260,15
48,2014,4,13,0,3,4,14,260,10
49,2014,4,13,6,4,8,7,280,15
50,2014,4,13,12,8,9,6,270,24
51,2014,4,13,18,5,9,34,280,20
52,2014,4,14,0,3,5,14,310,13
53,2014,4,14,6,3,8,6,320,16
54,2014,4,14,12,9,10,6,310,18
55,2014,4,14,18,5,9,6,90,6
56,2014,4,15,0,3,5,17,100,6
57,2014,4,15,6,3,9,6,90,13
58,2014,4,15,12,9,12,6,420,18
59,2014,4,15,18,5,11,6,420,16
60,2014,4,16,0,2,5,13,430,13
61,2014,4,16,6,2,7,9,90,16
62,2014,4,16,12,7,10,33,440,20
63,2014,4,16,18,3,8,15,440,11
64,2014,4,17,0,-1,3,13,90,4
65,2014,4,17,6,-1,10,1,90,4
66,2014,4,17,12,9,13,1,90,9
67,2014,4,17,18,5,12,13,250,10
68,2014,4,18,0,3,5,13,230,7
69,2014,4,18,6,3,13,1,250,13
70,2014,4,18,12,14,17,2,230,16
71,2014,4,18,18,10,16,1,190,11
72,2014,4,19,0,8,10,13,160,10
73,2014,4,19,6,8,18,2,180,12
74,2014,4,19,12,18,21,2,140,14
75,2014,4,19,18,12,20,13,140,12
76,2014,4,20,0,9,11,13,150,8
77,2014,4,20,6,8,20,1,90,11
78,2014,4,20,12,20,22,2,160,18
79,2014,4,20,18,13,20,13,150,11
80,2014,4,21,0,9,13,13,160,7
81,2014,4,21,6,10,20,1,150,11
82,2014,4,21,12,21,22,2,180,15
83,2014,4,21,18,15,21,13,140,10
84,2014,4,22,0,10,15,13,190,9
85,2014,4,22,6,9,20,1,90,5
86,2014,4,22,12,17,22,6,90,8
87,2014,4,22,18,11,19,13,90,3
88,2014,4,23,0,6,11,13,90,3
89,2014,4,23,6,7,18,1,100,9
90,2014,4,23,12,18,22,2,150,14
91,2014,4,23,18,11,20,1,140,16
92,2014,4,24,0,5,10,13,140,15
93,2014,4,24,6,4,12,2,160,16
94,2014,4,24,12,12,14,2,160,16
95,2014,4,24,18,6,14,13,160,9
96,2014,4,25,0,2,6,13,90,4
97,2014,4,25,6,3,15,1,90,8
98,2014,4,25,12,15,18,2,210,10
99,2014,4,25,18,9,18,13,170,5
100,2014,4,26,0,3,9,13,90,4
101,2014,4,26,6,3,18,1,90,6
102,2014,4,26,12,18,20,1,220,8
103,2014,4,26,18,10,19,13,210,8
104,2014,4,27,0,7,10,13,220,5
105,2014,4,27,6,9,18,1,240,7
106,2014,4,27,12,15,18,6,240,15
107,2014,4,27,18,9,14,34,260,8
108,2014,4,28,0,8,9,34,150,11
109,2014,4,28,6,9,15,6,150,10
110,2014,4,28,12,14,18,6,140,11
111,2014,4,28,18,8,17,1,180,5
112,2014,4,29,0,5,8,14,90,2
113,2014,4,29,6,7,19,1,90,4
114,2014,4,29,12,19,22,1,90,7
115,2014,4,29,18,11,20,1,90,5
116,2014,4,30,0,6,13,13,90,4
117,2014,4,30,6,7,18,2,90,7
118,2014,4,30,12,18,19,2,360,12
119,2014,4,30,18,12,19,13,380,10
0,2014,5,1,0,3,10,13,90,4
1,2014,5,1,6,3,16,2,280,8
2,2014,5,1,12,17,19,1,350,24
3,2014,5,1,18,5,17,6,410,24
4,2014,5,2,0,4,5,17,420,20
5,2014,5,2,6,4,6,6,430,20
6,2014,5,2,12,7,11,6,90,14
7,2014,5,2,18,4,10,13,90,10
8,2014,5,3,0,-1,5,13,100,4
9,2014,5,3,6,1,9,1,90,11
10,2014,5,3,12,9,10,1,90,8
11,2014,5,3,18,2,10,13,90,3
12,2014,5,4,0,-3,1,13,90,2
13,2014,5,4,6,-2,11,1,280,7
14,2014,5,4,12,9,13,1,330,18
15,2014,5,4,18,3,7,6,390,16
16,2014,5,5,0,0,3,13,400,11
17,2014,5,5,6,0,6,6,400,17
18,2014,5,5,12,5,8,33,410,21
19,2014,5,5,18,2,8,33,370,17
20,2014,5,6,0,0,2,13,380,15
21,2014,5,6,6,0,8,2,390,20
22,2014,5,6,12,8,10,2,400,17
23,2014,5,6,18,2,11,1,90,4
24,2014,5,7,0,2,5,13,90,4
25,2014,5,7,6,5,11,1,230,15
26,2014,5,7,12,10,17,18,200,18
27,2014,5,7,18,13,15,6,280,15
28,2014,5,8,0,11,13,17,290,13
29,2014,5,8,6,12,12,18,280,9
30,2014,5,8,12,12,12,18,270,6
31,2014,5,8,18,10,12,9,270,9
32,2014,5,9,0,10,10,14,260,14
33,2014,5,9,6,10,17,9,260,19
34,2014,5,9,12,17,19,6,280,25
35,2014,5,9,18,13,18,33,260,12
36,2014,5,10,0,10,13,13,250,10
37,2014,5,10,6,11,18,1,280,9
38,2014,5,10,12,10,17,22,90,14
39,2014,5,10,18,9,11,6,360,9
40,2014,5,11,0,6,8,14,330,11
41,2014,5,11,6,7,14,6,280,17
42,2014,5,11,12,13,15,6,280,23
43,2014,5,11,18,11,15,6,280,12
44,2014,5,12,0,11,12,34,200,6
45,2014,5,12,6,10,11,18,100,15
46,2014,5,12,12,9,10,18,440,17
47,2014,5,12,18,9,10,18,380,11
48,2014,5,13,0,8,9,14,360,13
49,2014,5,13,6,8,13,6,350,15
50,2014,5,13,12,12,14,22,350,14
51,2014,5,13,18,7,13,6,300,12
52,2014,5,14,0,6,9,15,340,9
53,2014,5,14,6,7,13,6,270,10
54,2014,5,14,12,13,16,6,350,11
55,2014,5,14,18,9,17,1,100,10
56,2014,5,15,0,5,9,13,90,6
57,2014,5,15,6,8,17,1,120,13
58,2014,5,15,12,17,19,2,140,22
59,2014,5,15,18,12,17,1,110,20
60,2014,5,16,0,9,11,13,100,18
61,2014,5,16,6,10,14,1,140,21
62,2014,5,16,12,11,12,19,120,22
63,2014,5,16,18,11,12,18,130,16
64,2014,5,17,0,9,10,14,120,15
65,2014,5,17,6,9,18,1,140,21
66,2014,5,17,12,19,23,6,150,19
67,2014,5,17,18,16,22,22,120,10
68,2014,5,18,0,15,17,14,170,7
69,2014,5,18,6,16,22,6,190,13
70,2014,5,18,12,21,25,6,230,14
71,2014,5,18,18,16,24,6,210,8
72,2014,5,19,0,15,17,14,130,8
73,2014,5,19,6,15,21,6,260,8
74,2014,5,19,12,21,23,6,90,6
75,2014,5,19,18,18,24,6,90,5
76,2014,5,20,0,15,17,14,90,4
77,2014,5,20,6,16,21,6,220,13
78,2014,5,20,12,17,23,6,220,12
79,2014,5,20,18,16,21,6,230,10
80,2014,5,21,0,15,16,14,270,13
81,2014,5,21,6,15,17,6,300,15
82,2014,5,21,12,18,22,6,290,13
83,2014,5,21,18,15,23,1,250,9
84,2014,5,22,0,12,15,13,250,7
85,2014,5,22,6,13,24,1,270,10
86,2014,5,22,12,24,26,2,230,12
87,2014,5,22,18,18,26,1,90,5
88,2014,5,23,0,16,18,13,90,2
89,2014,5,23,6,17,26,1,230,12
90,2014,5,23,12,26,27,1,230,18
91,2014,5,23,18,19,26,1,210,11
92,2014,5,24,0,18,21,13,230,13
93,2014,5,24,6,19,27,1,220,11
94,2014,5,24,12,26,27,6,250,16
95,2014,5,24,18,18,27,2,200,11
96,2014,5,25,0,17,19,13,210,9
97,2014,5,25,6,18,26,2,250,11
98,2014,5,25,12,25,28,6,240,17
99,2014,5,25,18,15,24,6,360,9
100,2014,5,26,0,13,16,15,90,5
101,2014,5,26,6,16,24,1,420,7
102,2014,5,26,12,24,26,2,90,13
103,2014,5,26,18,19,25,6,100,8
104,2014,5,27,0,16,19,13,110,10
105,2014,5,27,6,16,24,1,120,10
106,2014,5,27,12,22,25,6,440,15
107,2014,5,27,18,14,24,1,440,20
108,2014,5,28,0,10,13,13,100,18
109,2014,5,28,6,10,13,7,100,20
110,2014,5,28,12,14,16,6,440,18
111,2014,5,28,18,9,14,6,100,21
112,2014,5,29,0,8,9,17,440,15
113,2014,5,29,6,8,10,7,440,15
114,2014,5,29,12,11,13,7,440,17
115,2014,5,29,18,10,12,7,400,12
116,2014,5,30,0,9,10,15,410,10
117,2014,5,30,6,9,11,6,390,7
118,2014,5,30,12,12,14,7,90,5
119,2014,5,30,18,10,14,1,290,6
120,2014,5,31,0,7,10,13,260,3
121,2014,5,31,6,7,16,1,90,4
122,2014,5,31,12,17,20,1,440,8
123,2014,5,31,18,15,20,1,90,15
0,2014,6,1,0,13,15,13,440,16
1,2014,6,1,6,11,13,18,90,25
2,2014,6,1,12,11,11,18,90,30
3,2014,6,1,18,11,12,19,90,24
4,2014,6,2,0,12,12,14,100,16
5,2014,6,2,6,12,16,9,110,11
6,2014,6,2,12,16,19,6,440,11
7,2014,6,2,18,17,19,6,90,13
8,2014,6,3,0,17,17,14,250,9
9,2014,6,3,6,17,19,6,240,19
10,2014,6,3,12,19,21,6,240,21
11,2014,6,3,18,13,20,6,260,10
12,2014,6,4,0,11,13,14,230,5
13,2014,6,4,6,15,20,1,160,8
14,2014,6,4,12,21,24,2,170,13
15,2014,6,4,18,16,23,6,300,9
16,2014,6,5,0,12,16,17,90,4
17,2014,6,5,6,12,19,6,260,8
18,2014,6,5,12,19,22,6,300,8
19,2014,6,5,18,14,21,6,290,6
20,2014,6,6,0,11,13,14,90,3
21,2014,6,6,6,12,23,1,90,5
22,2014,6,6,12,19,24,6,240,9
23,2014,6,6,18,16,18,6,90,7
24,2014,6,7,0,15,15,14,410,10
25,2014,6,7,6,15,19,6,410,11
26,2014,6,7,12,20,22,2,420,9
27,2014,6,7,18,12,22,2,90,6
28,2014,6,8,0,9,12,13,90,3
29,2014,6,8,6,10,19,6,270,12
30,2014,6,8,12,19,24,6,360,18
31,2014,6,8,18,16,23,2,380,11
32,2014,6,9,0,10,16,13,90,7
33,2014,6,9,6,12,21,1,350,11
34,2014,6,9,12,19,22,2,370,15
35,2014,6,9,18,17,22,1,330,8
36,2014,6,10,0,14,19,13,410,14
37,2014,6,10,6,14,21,2,400,13
38,2014,6,10,12,22,24,6,420,27
39,2014,6,10,18,17,24,1,430,23
40,2014,6,11,0,13,16,13,430,13
41,2014,6,11,6,13,21,9,430,13
42,2014,6,11,12,21,22,6,430,17
43,2014,6,11,18,15,21,6,420,13
44,2014,6,12,0,13,16,13,90,4
45,2014,6,12,6,14,18,6,380,8
46,2014,6,12,12,17,18,6,370,17
47,2014,6,12,18,14,18,6,380,16
48,2014,6,13,0,12,14,17,360,12
49,2014,6,13,6,13,15,6,340,16
50,2014,6,13,12,12,16,6,370,21
51,2014,6,13,18,11,15,33,410,11
52,2014,6,14,0,11,12,14,390,9
53,2014,6,14,6,11,13,6,400,13
54,2014,6,14,12,12,14,6,370,15
55,2014,6,14,18,10,14,6,340,8
56,2014,6,15,0,12,12,14,400,10
57,2014,6,15,6,12,14,7,440,15
58,2014,6,15,12,13,15,6,430,17
59,2014,6,15,18,10,14,6,410,11
60,2014,6,16,0,5,10,14,90,5
61,2014,6,16,6,8,16,6,410,9
62,2014,6,16,12,15,19,6,390,8
63,2014,6,16,18,14,18,2,370,13
64,2014,6,17,0,7,13,15,400,16
65,2014,6,17,6,7,12,6,410,20
66,2014,6,17,12,13,15,6,350,18
67,2014,6,17,18,9,13,33,360,14
68,2014,6,18,0,7,8,13,370,8
69,2014,6,18,6,7,11,18,350,12
70,2014,6,18,12,12,18,6,360,18
71,2014,6,18,18,13,17,6,390,16
72,2014,6,19,0,7,12,13,90,6
73,2014,6,19,6,8,16,1,280,12
74,2014,6,19,12,18,22,1,320,20
75,2014,6,19,18,15,21,6,300,14
76,2014,6,20,0,12,16,15,370,11
77,2014,6,20,6,12,17,6,310,16
78,2014,6,20,12,12,17,33,380,17
79,2014,6,20,18,12,13,6,390,13
80,2014,6,21,0,7,11,13,400,11
81,2014,6,21,6,7,13,6,90,7
82,2014,6,21,12,14,16,2,350,9
83,2014,6,21,18,10,14,6,260,7
84,2014,6,22,0,10,11,14,280,10
85,2014,6,22,6,10,12,18,340,16
86,2014,6,22,12,10,12,6,370,25
87,2014,6,22,18,9,13,1,390,11
88,2014,6,23,0,5,9,13,330,9
89,2014,6,23,6,6,12,18,340,11
90,2014,6,23,12,10,14,6,360,20
91,2014,6,23,18,10,11,6,290,14
92,2014,6,24,0,7,9,13,300,10
93,2014,6,24,6,8,12,6,330,16
94,2014,6,24,12,10,14,33,370,15
95,2014,6,24,18,8,13,33,380,13
96,2014,6,25,0,7,8,15,370,7
97,2014,6,25,6,8,14,9,390,11
98,2014,6,25,12,15,18,6,90,11
99,2014,6,25,18,10,18,1,90,7
100,2014,6,26,0,7,10,13,90,2
101,2014,6,26,6,12,17,1,90,5
102,2014,6,26,12,13,17,18,300,11
103,2014,6,26,18,10,13,6,90,6
104,2014,6,27,0,7,10,14,90,5
105,2014,6,27,6,8,13,9,380,11
106,2014,6,27,12,12,16,33,380,15
107,2014,6,27,18,11,15,6,390,9
108,2014,6,28,0,6,10,13,90,4
109,2014,6,28,6,6,17,1,90,4
110,2014,6,28,12,17,20,2,90,6
111,2014,6,28,18,15,20,1,220,12
112,2014,6,29,0,13,16,34,230,19
113,2014,6,29,6,13,20,6,250,21
114,2014,6,29,12,17,21,6,260,19
115,2014,6,29,18,19,21,6,260,10
116,2014,6,30,0,16,18,17,260,11
117,2014,6,30,6,17,19,6,240,14
118,2014,6,30,12,18,20,6,280,13
119,2014,6,30,18,17,19,18,90,5
0,2014,7,1,0,15,17,14,90,5
1,2014,7,1,6,14,17,7,400,14
2,2014,7,1,12,14,15,19,390,15
3,2014,7,1,18,12,16,6,90,7
4,2014,7,2,0,12,13,14,380,12
5,2014,7,2,6,12,18,6,350,13
6,2014,7,2,12,13,19,6,370,16
7,2014,7,2,18,10,15,6,260,7
8,2014,7,3,0,8,10,13,260,7
9,2014,7,3,6,9,17,6,270,11
10,2014,7,3,12,18,20,33,350,16
11,2014,7,3,18,14,19,6,340,12
12,2014,7,4,0,11,13,13,340,8
13,2014,7,4,6,10,20,1,280,12
14,2014,7,4,12,17,22,6,370,18
15,2014,7,4,18,14,19,1,220,6
16,2014,7,5,0,11,13,14,240,6
17,2014,7,5,6,13,24,1,270,9
18,2014,7,5,12,25,25,1,250,13
19,2014,7,5,18,,,36,,0
20,2014,7,6,0,15,18,13,220,10
21,2014,7,6,6,17,25,1,240,14
22,2014,7,6,12,26,27,1,250,17
23,2014,7,6,18,20,27,1,190,9
24,2014,7,7,0,17,20,13,200,5
25,2014,7,7,6,17,27,2,230,10
26,2014,7,7,12,27,28,2,230,14
27,2014,7,7,18,19,28,6,100,6
28,2014,7,8,0,17,19,13,90,2
29,2014,7,8,6,18,27,2,210,10
30,2014,7,8,12,27,30,6,200,12
31,2014,7,8,18,17,27,6,150,8
32,2014,7,9,0,16,19,13,90,3
33,2014,7,9,6,18,25,1,90,7
34,2014,7,9,12,25,27,6,170,16
35,2014,7,9,18,16,26,6,170,9
36,2014,7,10,0,14,17,13,90,3
37,2014,7,10,6,16,26,1,140,11
38,2014,7,10,12,20,27,6,120,20
39,2014,7,10,18,16,21,6,140,16
40,2014,7,11,0,14,15,15,140,16
41,2014,7,11,6,12,14,6,140,18
42,2014,7,11,12,12,18,6,140,18
43,2014,7,11,18,13,18,18,150,17
44,2014,7,12,0,13,13,14,160,15
45,2014,7,12,6,13,16,9,160,17
46,2014,7,12,12,16,22,9,150,17
47,2014,7,12,18,18,23,6,150,14
48,2014,7,13,0,15,18,15,200,16
49,2014,7,13,6,16,20,7,210,20
50,2014,7,13,12,19,22,33,250,14
51,2014,7,13,18,14,20,33,360,9
52,2014,7,14,0,11,14,14,90,3
53,2014,7,14,6,12,22,1,220,11
54,2014,7,14,12,23,26,2,270,11
55,2014,7,14,18,16,26,1,210,8
56,2014,7,15,0,15,18,13,230,7
57,2014,7,15,6,16,27,1,280,9
58,2014,7,15,12,22,28,22,280,11
59,2014,7,15,18,18,22,14,90,3
60,2014,7,16,0,16,18,14,90,3
61,2014,7,16,6,17,24,1,420,9
62,2014,7,16,12,24,26,2,420,13
63,2014,7,16,18,17,26,1,430,7
64,2014,7,17,0,13,16,13,90,2
65,2014,7,17,6,15,24,2,90,6
66,2014,7,17,12,24,26,2,440,10
67,2014,7,17,18,20,25,1,410,8
68,2014,7,18,0,14,18,13,,1
69,2014,7,18,6,15,22,1,90,11
70,2014,7,18,12,22,24,1,360,16
71,2014,7,18,18,15,23,1,420,9
72,2014,7,19,0,10,14,27,,1
73,2014,7,19,6,10,24,1,90,7
74,2014,7,19,12,22,26,6,100,15
75,2014,7,19,18,18,25,6,160,8
76,2014,7,20,0,15,18,13,90,4
77,2014,7,20,6,16,24,1,440,8
78,2014,7,20,12,23,26,6,410,13
79,2014,7,20,18,15,23,6,90,7
80,2014,7,21,0,13,15,14,90,2
81,2014,7,21,6,13,21,6,100,10
82,2014,7,21,12,21,23,6,160,15
83,2014,7,21,18,16,24,6,150,11
84,2014,7,22,0,13,15,13,100,5
85,2014,7,22,6,15,24,1,110,12
86,2014,7,22,12,19,26,2,90,10
87,2014,7,22,18,22,25,33,130,8
88,2014,7,23,0,14,16,13,130,8
89,2014,7,23,6,14,24,6,120,10
90,2014,7,23,12,25,25,2,150,16
91,2014,7,23,18,17,25,1,140,10
92,2014,7,24,0,12,17,13,90,6
93,2014,7,24,6,14,25,1,160,9
94,2014,7,24,12,25,27,2,150,15
95,2014,7,24,18,19,27,1,150,9
96,2014,7,25,0,16,19,13,90,5
97,2014,7,25,6,16,26,1,90,6
98,2014,7,25,12,26,28,2,180,12
99,2014,7,25,18,19,27,2,160,7
100,2014,7,26,0,17,19,13,90,3
101,2014,7,26,6,18,27,2,90,8
102,2014,7,26,12,27,29,2,220,11
103,2014,7,26,18,21,28,1,190,10
104,2014,7,27,0,17,20,13,210,8
105,2014,7,27,6,19,28,1,230,12
106,2014,7,27,12,28,30,1,220,17
107,2014,7,27,18,21,29,1,220,10
108,2014,7,28,0,18,20,13,210,6
109,2014,7,28,6,20,29,1,250,12
110,2014,7,28,12,28,30,2,240,17
111,2014,7,28,18,21,29,6,220,7
112,2014,7,29,0,19,21,13,230,9
113,2014,7,29,6,19,29,1,270,12
114,2014,7,29,12,28,31,33,260,17
115,2014,7,29,18,20,29,6,240,11
116,2014,7,30,0,17,20,13,250,9
117,2014,7,30,6,17,28,1,270,12
118,2014,7,30,12,29,31,2,260,19
119,2014,7,30,18,23,30,1,230,14
120,2014,7,31,0,20,23,13,250,10
121,2014,7,31,6,19,24,6,250,16
122,2014,7,31,12,25,30,6,270,17
123,2014,7,31,18,20,23,22,90,8
0,2014,8,1,0,19,20,14,90,6
1,2014,8,1,6,20,22,6,100,6
2,2014,8,1,12,22,25,6,90,6
3,2014,8,1,18,20,23,6,100,9
4,2014,8,2,0,20,20,14,100,7
5,2014,8,2,6,20,28,1,150,8
6,2014,8,2,12,29,32,1,170,7
7,2014,8,2,18,24,30,6,180,7
8,2014,8,3,0,18,23,13,90,3
9,2014,8,3,6,18,32,1,90,7
10,2014,8,3,12,33,34,2,220,17
11,2014,8,3,18,23,33,1,170,8
12,2014,8,4,0,19,24,13,90,3
13,2014,8,4,6,19,30,2,90,8
14,2014,8,4,12,30,33,2,180,14
15,2014,8,4,18,24,31,6,190,11
16,2014,8,5,0,19,23,15,190,13
17,2014,8,5,6,20,28,2,160,10
18,2014,8,5,12,26,31,6,180,14
19,2014,8,5,18,18,25,6,280,10
20,2014,8,6,0,16,18,15,90,5
21,2014,8,6,6,17,28,1,180,8
22,2014,8,6,12,27,29,6,210,13
23,2014,8,6,18,19,25,13,90,6
24,2014,8,7,0,16,19,13,90,3
25,2014,8,7,6,16,28,1,90,6
26,2014,8,7,12,24,29,6,230,11
27,2014,8,7,18,20,24,6,430,9
28,2014,8,8,0,18,20,13,120,5
29,2014,8,8,6,18,27,1,120,6
30,2014,8,8,12,21,29,22,90,8
31,2014,8,8,18,19,20,6,440,7
32,2014,8,9,0,18,20,17,90,6
33,2014,8,9,6,18,21,9,90,8
34,2014,8,9,12,21,24,6,340,10
35,2014,8,9,18,16,22,6,90,8
36,2014,8,10,0,14,16,30,90,3
37,2014,8,10,6,14,25,6,90,5
38,2014,8,10,12,25,28,6,440,7
39,2014,8,10,18,18,28,1,90,4
40,2014,8,11,0,16,19,13,90,4
41,2014,8,11,6,16,28,1,270,13
42,2014,8,11,12,29,31,1,280,20
43,2014,8,11,18,19,29,6,250,15
44,2014,8,12,0,18,19,22,280,10
45,2014,8,12,6,18,20,6,400,12
46,2014,8,12,12,18,21,6,390,9
47,2014,8,12,18,14,19,6,250,8
48,2014,8,13,0,12,15,14,260,8
49,2014,8,13,6,11,21,1,310,12
50,2014,8,13,12,21,23,2,340,15
51,2014,8,13,18,18,22,13,230,12
52,2014,8,14,0,15,18,34,210,12
53,2014,8,14,6,15,19,6,280,19
54,2014,8,14,12,19,23,6,300,29
55,2014,8,14,18,17,21,6,340,21
56,2014,8,15,0,15,16,15,350,13
57,2014,8,15,6,14,19,6,370,12
58,2014,8,15,12,21,23,33,350,19
59,2014,8,15,18,13,20,13,350,8
60,2014,8,16,0,11,12,14,260,5
61,2014,8,16,6,12,19,6,260,7
62,2014,8,16,12,18,20,6,330,16
63,2014,8,16,18,14,19,15,340,11
64,2014,8,17,0,13,14,15,350,13
65,2014,8,17,6,13,18,6,340,18
66,2014,8,17,12,18,21,6,360,21
67,2014,8,17,18,13,20,6,310,10
68,2014,8,18,0,8,12,13,260,8
69,2014,8,18,6,9,19,1,260,19
70,2014,8,18,12,20,22,6,280,25
71,2014,8,18,18,18,19,17,260,18
72,2014,8,19,0,14,16,34,300,17
73,2014,8,19,6,13,18,2,300,22
74,2014,8,19,12,19,21,6,300,23
75,2014,8,19,18,11,20,6,330,11
76,2014,8,20,0,9,12,13,250,8
77,2014,8,20,6,10,20,6,250,15
78,2014,8,20,12,19,22,6,290,24
79,2014,8,20,18,11,19,13,340,15
80,2014,8,21,0,6,11,13,270,7
81,2014,8,21,6,6,18,1,280,11
82,2014,8,21,12,12,18,6,320,14
83,2014,8,21,18,10,12,18,90,6
84,2014,8,22,0,6,10,14,320,8
85,2014,8,22,6,7,16,2,280,12
86,2014,8,22,12,17,19,6,370,15
87,2014,8,22,18,11,19,13,280,9
88,2014,8,23,0,8,10,13,250,9
89,2014,8,23,6,10,20,1,250,17
90,2014,8,23,12,15,21,1,260,23
91,2014,8,23,18,12,15,22,250,12
92,2014,8,24,0,11,12,14,250,7
93,2014,8,24,6,11,17,9,90,4
94,2014,8,24,12,14,17,18,240,10
95,2014,8,24,18,12,14,33,130,13
96,2014,8,25,0,12,12,34,400,19
97,2014,8,25,6,11,13,33,380,20
98,2014,8,25,12,13,15,33,360,28
99,2014,8,25,18,9,16,6,350,21
100,2014,8,26,0,6,9,15,290,14
101,2014,8,26,6,7,10,18,280,16
102,2014,8,26,12,10,15,6,290,21
103,2014,8,26,18,8,14,6,270,11
104,2014,8,27,0,8,9,14,280,10
105,2014,8,27,6,8,14,9,300,19
106,2014,8,27,12,14,16,6,320,21
107,2014,8,27,18,13,15,33,380,16
108,2014,8,28,0,11,12,14,370,15
109,2014,8,28,6,12,14,6,380,18
110,2014,8,28,12,13,17,33,370,21
111,2014,8,28,18,12,15,18,360,12
112,2014,8,29,0,10,12,13,370,13
113,2014,8,29,6,10,15,6,360,15
114,2014,8,29,12,15,17,33,350,20
115,2014,8,29,18,12,16,33,350,7
116,2014,8,30,0,5,9,14,90,2
117,2014,8,30,6,6,19,1,90,3
118,2014,8,30,12,19,21,1,90,5
119,2014,8,30,18,15,19,6,230,6
120,2014,8,31,0,13,15,34,140,8
121,2014,8,31,6,12,14,6,130,13
122,2014,8,31,12,14,15,6,140,17
123,2014,8,31,18,9,14,6,140,10
0,2014,9,1,0,9,10,14,120,10
1,2014,9,1,6,9,13,9,130,12
2,2014,9,1,12,14,16,6,120,14
3,2014,9,1,18,9,14,1,120,7
4,2014,9,2,0,8,11,14,90,8
5,2014,9,2,6,10,14,9,100,11
6,2014,9,2,12,14,16,6,130,12
7,2014,9,2,18,13,15,6,130,8
8,2014,9,3,0,12,13,14,120,7
9,2014,9,3,6,10,16,9,140,9
10,2014,9,3,12,16,19,6,140,14
11,2014,9,3,18,10,17,6,160,8
12,2014,9,4,0,7,10,14,440,3
13,2014,9,4,6,7,17,2,90,7
14,2014,9,4,12,16,18,6,160,10
15,2014,9,4,18,10,18,13,90,4
16,2014,9,5,0,9,10,13,90,2
17,2014,9,5,6,9,18,1,90,7
18,2014,9,5,12,18,20,6,180,11
19,2014,9,5,18,9,19,13,190,7
20,2014,9,6,0,10,12,13,170,5
21,2014,9,6,6,12,20,1,90,6
22,2014,9,6,12,20,22,2,220,13
23,2014,9,6,18,13,21,13,180,6
24,2014,9,7,0,11,12,13,90,2
25,2014,9,7,6,11,21,1,90,4
26,2014,9,7,12,20,22,1,200,11
27,2014,9,7,18,14,20,13,90,4
28,2014,9,8,0,12,14,14,90,2
29,2014,9,8,6,12,21,1,90,4
30,2014,9,8,12,21,23,1,270,10
31,2014,9,8,18,14,20,13,210,8
32,2014,9,9,0,12,16,13,230,10
33,2014,9,9,6,12,18,1,230,8
34,2014,9,9,12,16,22,1,270,12
35,2014,9,9,18,15,16,34,90,7
36,2014,9,10,0,14,15,14,280,7
37,2014,9,10,6,15,16,9,270,7
38,2014,9,10,12,16,18,9,280,7
39,2014,9,10,18,14,17,14,200,7
40,2014,9,11,0,14,15,14,90,3
41,2014,9,11,6,14,18,9,170,7
42,2014,9,11,12,19,20,6,160,8
43,2014,9,11,18,16,19,1,90,5
44,2014,9,12,0,13,16,14,90,6
45,2014,9,12,6,13,22,1,210,5
46,2014,9,12,12,22,24,1,240,13
47,2014,9,12,18,14,22,13,190,8
48,2014,9,13,0,12,14,13,90,2
49,2014,9,13,6,11,23,1,210,5
50,2014,9,13,12,23,24,1,190,6
51,2014,9,13,18,15,22,13,160,8
52,2014,9,14,0,13,14,13,90,7
53,2014,9,14,6,13,18,9,170,10
54,2014,9,14,12,19,21,2,150,15
55,2014,9,14,18,9,19,13,150,8
56,2014,9,15,0,5,9,13,140,5
57,2014,9,15,6,5,13,1,150,8
58,2014,9,15,12,14,15,2,160,12
59,2014,9,15,18,7,12,14,180,6
60,2014,9,16,0,5,7,14,90,3
61,2014,9,16,6,5,16,9,90,6
62,2014,9,16,12,16,18,2,190,9
63,2014,9,16,18,10,17,13,90,3
64,2014,9,17,0,8,10,13,90,2
65,2014,9,17,6,9,18,1,90,5
66,2014,9,17,12,17,19,6,190,11
67,2014,9,17,18,11,18,13,90,4
68,2014,9,18,0,9,11,13,90,3
69,2014,9,18,6,8,18,1,220,10
70,2014,9,18,12,18,20,1,230,16
71,2014,9,18,18,11,18,13,230,11
72,2014,9,19,0,7,11,13,230,12
73,2014,9,19,6,7,16,1,230,14
74,2014,9,19,12,16,18,1,230,20
75,2014,9,19,18,11,16,13,230,14
76,2014,9,20,0,10,12,13,230,13
77,2014,9,20,6,9,12,18,220,9
78,2014,9,20,12,13,15,6,240,11
79,2014,9,20,18,11,12,13,210,12
80,2014,9,21,0,11,12,14,230,13
81,2014,9,21,6,10,13,7,240,11
82,2014,9,21,12,13,14,7,260,13
83,2014,9,21,18,10,14,14,250,10
84,2014,9,22,0,8,11,14,250,7
85,2014,9,22,6,11,13,19,220,16
86,2014,9,22,12,13,14,9,270,13
87,2014,9,22,18,12,13,34,380,13
88,2014,9,23,0,10,12,14,350,13
89,2014,9,23,6,10,10,9,370,15
90,2014,9,23,12,7,11,6,430,21
91,2014,9,23,18,5,7,15,420,21
92,2014,9,24,0,1,4,13,410,9
93,2014,9,24,6,0,8,13,90,8
94,2014,9,24,12,8,11,6,380,11
95,2014,9,24,18,3,10,13,260,6
96,2014,9,25,0,2,3,13,250,9
97,2014,9,25,6,2,10,1,260,16
98,2014,9,25,12,10,13,1,260,26
99,2014,9,25,18,9,12,34,270,15
100,2014,9,26,0,8,9,34,250,7
101,2014,9,26,6,8,10,9,360,6
102,2014,9,26,12,11,14,6,320,8
103,2014,9,26,18,6,12,13,290,8
104,2014,9,27,0,6,8,13,280,16
105,2014,9,27,6,8,14,9,370,19
106,2014,9,27,12,13,16,6,370,24
107,2014,9,27,18,10,14,13,370,15
108,2014,9,28,0,9,10,14,370,13
109,2014,9,28,6,10,12,7,350,14
110,2014,9,28,12,12,15,6,340,19
111,2014,9,28,18,11,15,14,330,15
112,2014,9,29,0,11,12,14,320,13
113,2014,9,29,6,12,15,6,320,15
114,2014,9,29,12,15,17,6,360,17
115,2014,9,29,18,12,16,6,330,12
116,2014,9,30,0,12,12,14,390,10
117,2014,9,30,6,12,15,6,430,7
118,2014,9,30,12,13,16,6,420,15
119,2014,9,30,18,6,12,13,430,10
0,2014,10,1,0,2,6,13,100,6
1,2014,10,1,6,2,9,2,90,7
2,2014,10,1,12,10,13,2,160,8
3,2014,10,1,18,4,10,13,90,2
4,2014,10,2,0,2,4,13,,1
5,2014,10,2,6,2,10,1,280,9
6,2014,10,2,12,11,13,2,260,10
7,2014,10,2,18,4,11,14,240,5
8,2014,10,3,0,2,4,14,240,5
9,2014,10,3,6,1,12,1,280,6
10,2014,10,3,12,12,15,1,90,5
11,2014,10,3,18,3,13,13,260,3
12,2014,10,4,0,1,3,14,240,3
13,2014,10,4,6,1,13,1,90,3
14,2014,10,4,12,13,16,6,100,8
15,2014,10,4,18,6,11,13,90,4
16,2014,10,5,0,8,10,17,90,3
17,2014,10,5,6,6,13,6,90,5
18,2014,10,5,12,11,13,6,170,11
19,2014,10,5,18,6,10,13,160,9
20,2014,10,6,0,6,6,13,170,7
21,2014,10,6,6,4,8,13,180,12
22,2014,10,6,12,7,9,6,190,19
23,2014,10,6,18,5,7,15,210,22
24,2014,10,7,0,5,7,19,210,24
25,2014,10,7,6,6,10,1,230,27
26,2014,10,7,12,11,13,1,220,30
27,2014,10,7,18,8,10,13,230,26
28,2014,10,8,0,6,8,13,240,29
29,2014,10,8,6,6,10,1,250,29
30,2014,10,8,12,10,13,1,250,26
31,2014,10,8,18,10,12,34,260,24
32,2014,10,9,0,9,10,14,250,19
33,2014,10,9,6,8,13,1,250,23
34,2014,10,9,12,14,17,1,260,24
35,2014,10,9,18,14,15,13,260,19
36,2014,10,10,0,13,15,13,270,17
37,2014,10,10,6,12,17,1,280,19
38,2014,10,10,12,17,20,1,300,20
39,2014,10,10,18,15,19,15,320,10
40,2014,10,11,0,12,15,14,90,5
41,2014,10,11,6,11,17,9,90,5
42,2014,10,11,12,17,19,1,90,6
43,2014,10,11,18,14,16,17,90,5
44,2014,10,12,0,12,14,13,90,6
45,2014,10,12,6,11,16,9,190,9
46,2014,10,12,12,17,19,1,280,15
47,2014,10,12,18,13,17,14,360,15
48,2014,10,13,0,10,13,15,350,11
49,2014,10,13,6,9,13,9,360,8
50,2014,10,13,12,13,14,6,90,5
51,2014,10,13,18,9,13,13,180,7
52,2014,10,14,0,10,11,13,230,14
53,2014,10,14,6,10,15,6,230,13
54,2014,10,14,12,15,16,6,250,16
55,2014,10,14,18,14,15,14,270,7
56,2014,10,15,0,12,13,14,90,5
57,2014,10,15,6,11,13,18,380,16
58,2014,10,15,12,10,11,9,380,12
59,2014,10,15,18,10,10,34,380,8
60,2014,10,16,0,9,10,14,350,5
61,2014,10,16,6,8,10,18,90,3
62,2014,10,16,12,10,11,6,90,6
63,2014,10,16,18,7,9,34,150,7
64,2014,10,17,0,5,7,14,130,9
65,2014,10,17,6,4,5,34,140,10
66,2014,10,17,12,3,5,7,130,11
67,2014,10,17,18,1,2,17,140,12
68,2014,10,18,0,-1,1,17,90,7
69,2014,10,18,6,-2,2,1,100,9
70,2014,10,18,12,3,5,2,440,9
71,2014,10,18,18,-3,3,13,90,3
72,2014,10,19,0,-4,-2,14,260,6
73,2014,10,19,6,-3,2,9,270,17
74,2014,10,19,12,3,8,9,270,27
75,2014,10,19,18,8,10,14,270,21
76,2014,10,20,0,10,13,34,300,20
77,2014,10,20,6,13,14,6,360,19
78,2014,10,20,12,12,14,18,350,22
79,2014,10,20,18,11,12,17,350,21
80,2014,10,21,0,11,11,17,370,21
81,2014,10,21,6,10,11,9,390,13
82,2014,10,21,12,10,12,6,440,14
83,2014,10,21,18,6,9,15,90,6
84,2014,10,22,0,2,6,14,170,13
85,2014,10,22,6,1,2,17,160,15
86,2014,10,22,12,0,2,7,170,17
87,2014,10,22,18,-2,0,17,170,15
88,2014,10,23,0,-5,-2,14,170,13
89,2014,10,23,6,-5,-2,2,180,14
90,2014,10,23,12,-2,0,2,170,16
91,2014,10,23,18,-5,-2,13,190,10
92,2014,10,24,0,-8,-5,13,170,8
93,2014,10,24,6,-9,-3,13,210,12
94,2014,10,24,12,-2,1,1,200,15
95,2014,10,24,18,-4,-2,13,210,15
96,2014,10,25,0,-6,-4,13,250,22
97,2014,10,25,6,-7,-1,13,250,18
98,2014,10,25,12,0,3,1,250,24
99,2014,10,25,18,-2,0,13,250,21
100,2014,10,26,0,-4,-2,13,270,21
101,2014,10,26,6,-4,2,1,270,19
102,2014,10,26,12,3,5,1,260,16
103,2014,10,26,18,1,3,14,270,14
104,2014,10,27,0,-1,2,14,260,18
105,2014,10,27,6,-1,7,1,250,18
106,2014,10,27,12,6,10,1,270,22
107,2014,10,27,18,3,6,13,280,17
108,2014,10,28,0,0,2,13,260,10
109,2014,10,28,6,0,9,1,280,14
110,2014,10,28,12,6,12,1,270,20
111,2014,10,28,18,1,5,13,260,16
112,2014,10,29,0,0,1,13,260,17
113,2014,10,29,6,0,9,1,260,22
114,2014,10,29,12,7,12,1,260,24
115,2014,10,29,18,1,5,13,270,18
116,2014,10,30,0,-1,2,13,260,12
117,2014,10,30,6,-3,5,10,270,11
118,2014,10,30,12,3,8,3,290,9
119,2014,10,30,18,3,5,14,430,8
120,2014,10,31,0,4,5,14,90,6
121,2014,10,31,6,4,5,9,360,7
122,2014,10,31,12,5,7,6,370,10
123,2014,10,31,18,4,6,14,400,9
0,2014,11,1,0,1,3,14,90,2
1,2014,11,1,6,1,5,9,290,6
2,2014,11,1,12,5,6,6,90,4
3,2014,11,1,18,2,5,14,90,4
4,2014,11,2,0,2,3,14,250,8
5,2014,11,2,6,1,3,9,260,18
6,2014,11,2,12,1,4,1,250,20
7,2014,11,2,18,0,1,14,260,21
8,2014,11,3,0,0,1,14,260,21
9,2014,11,3,6,1,5,9,270,29
10,2014,11,3,12,6,8,9,260,22
11,2014,11,3,18,5,6,14,260,20
12,2014,11,4,0,3,4,14,250,13
13,2014,11,4,6,2,7,9,250,19
14,2014,11,4,12,6,10,1,260,23
15,2014,11,4,18,6,7,14,270,18
16,2014,11,5,0,4,6,14,260,18
17,2014,11,5,6,4,12,9,250,17
18,2014,11,5,12,11,14,1,240,18
19,2014,11,5,18,7,10,13,250,14
20,2014,11,6,0,6,7,13,250,14
21,2014,11,6,6,5,12,1,250,17
22,2014,11,6,12,10,12,1,260,17
23,2014,11,6,18,10,12,15,270,14
24,2014,11,7,0,9,11,30,270,9
25,2014,11,7,6,9,12,1,250,12
26,2014,11,7,12,11,13,6,270,17
27,2014,11,7,18,7,11,19,370,19
28,2014,11,8,0,7,7,17,360,11
29,2014,11,8,6,7,7,9,330,11
30,2014,11,8,12,6,8,9,260,8
31,2014,11,8,18,5,6,34,90,3
32,2014,11,9,0,6,6,14,90,4
33,2014,11,9,6,6,7,9,140,7
34,2014,11,9,12,7,8,6,160,9
35,2014,11,9,18,6,7,14,180,10
36,2014,11,10,0,6,7,14,210,8
37,2014,11,10,6,7,7,9,240,15
38,2014,11,10,12,8,8,9,250,18
39,2014,11,10,18,8,9,34,260,23
40,2014,11,11,0,5,8,14,260,19
41,2014,11,11,6,4,9,9,250,17
42,2014,11,11,12,7,10,9,250,15
43,2014,11,11,18,5,7,14,250,16
44,2014,11,12,0,4,5,14,230,12
45,2014,11,12,6,4,5,9,230,13
46,2014,11,12,12,3,4,9,210,15
47,2014,11,12,18,3,3,14,230,17
48,2014,11,13,0,3,3,14,230,16
49,2014,11,13,6,3,5,9,190,13
50,2014,11,13,12,5,6,9,190,12
51,2014,11,13,18,5,5,14,190,12
52,2014,11,14,0,4,5,14,180,9
53,2014,11,14,6,4,4,9,190,9
54,2014,11,14,12,4,4,7,220,16
55,2014,11,14,18,4,5,34,220,17
56,2014,11,15,0,3,4,17,220,17
57,2014,11,15,6,3,4,7,230,19
58,2014,11,15,12,4,4,7,210,21
59,2014,11,15,18,3,4,17,220,22
60,2014,11,16,0,4,4,17,220,23
61,2014,11,16,6,4,5,7,210,24
62,2014,11,16,12,4,5,7,210,24
63,2014,11,16,18,4,5,17,220,25
64,2014,11,17,0,4,5,17,220,24
65,2014,11,17,6,4,5,7,220,21
66,2014,11,17,12,3,4,7,200,20
67,2014,11,17,18,2,3,17,200,19
68,2014,11,18,0,-1,2,17,190,17
69,2014,11,18,6,-2,0,1,190,17
70,2014,11,18,12,-1,0,17,180,19
71,2014,11,18,18,-2,-1,17,210,19
72,2014,11,19,0,-3,-2,17,210,21
73,2014,11,19,6,-2,0,6,200,18
74,2014,11,19,12,0,0,6,200,18
75,2014,11,19,18,0,1,17,180,14
76,2014,11,20,0,-2,1,17,170,16
77,2014,11,20,6,-2,-1,1,180,11
78,2014,11,20,12,-1,0,27,170,9
79,2014,11,20,18,-1,0,30,190,8
80,2014,11,21,0,0,0,34,220,6
81,2014,11,21,6,0,0,18,230,10
82,2014,11,21,12,0,0,18,240,8
83,2014,11,21,18,-1,0,30,260,11
84,2014,11,22,0,-1,-1,14,260,8
85,2014,11,22,6,-1,0,29,270,8
86,2014,11,22,12,0,0,10,270,8
87,2014,11,22,18,0,0,14,260,6
88,2014,11,23,0,0,0,14,90,3
89,2014,11,23,6,0,0,10,90,3
90,2014,11,23,12,0,0,10,150,6
91,2014,11,23,18,0,0,14,190,7
92,2014,11,24,0,-4,0,14,90,3
93,2014,11,24,6,-5,-1,10,240,10
94,2014,11,24,12,-4,-1,10,240,21
95,2014,11,24,18,-4,-3,14,250,22
96,2014,11,25,0,-3,-2,14,250,24
97,2014,11,25,6,-2,-1,10,240,20
98,2014,11,25,12,-2,-1,10,250,17
99,2014,11,25,18,-3,-2,14,250,18
100,2014,11,26,0,-3,-3,14,240,14
101,2014,11,26,6,-3,-3,29,250,13
102,2014,11,26,12,-4,-3,10,250,13
103,2014,11,26,18,-5,-4,14,260,13
104,2014,11,27,0,-5,-4,14,240,9
105,2014,11,27,6,-6,-6,29,240,10
106,2014,11,27,12,-7,-6,29,220,11
107,2014,11,27,18,-6,-6,29,200,13
108,2014,11,28,0,-7,-6,29,200,12
109,2014,11,28,6,-7,-7,29,170,12
110,2014,11,28,12,-7,-6,1,180,10
111,2014,11,28,18,-8,-8,14,150,12
112,2014,11,29,0,-11,-8,14,90,7
113,2014,11,29,6,-11,-8,29,140,8
114,2014,11,29,12,-10,-6,1,110,8
115,2014,11,29,18,-11,-9,14,90,6
116,2014,11,30,0,-9,-9,14,120,8
117,2014,11,30,6,-9,-7,10,140,9
118,2014,11,30,12,-7,-7,10,140,9
119,2014,11,30,18,-7,-6,14,150,6
0,2014,12,1,0,-6,-6,14,90,5
1,2014,12,1,6,-7,-6,29,180,6
2,2014,12,1,12,-7,-6,29,190,6
3,2014,12,1,18,-8,-7,14,200,7
4,2014,12,2,0,-9,-8,14,190,7
5,2014,12,2,6,-11,-7,1,200,6
6,2014,12,2,12,-8,-5,1,230,13
7,2014,12,2,18,-10,-8,13,260,13
8,2014,12,3,0,-11,-9,13,250,14
9,2014,12,3,6,-11,-5,13,250,11
10,2014,12,3,12,-7,-4,1,240,14
11,2014,12,3,18,-8,-5,14,270,12
12,2014,12,4,0,-5,-4,14,280,9
13,2014,12,4,6,-4,-3,10,290,7
14,2014,12,4,12,-3,-2,10,300,6
15,2014,12,4,18,-2,-2,14,250,5
16,2014,12,5,0,-2,-2,14,220,6
17,2014,12,5,6,-2,-1,10,230,10
18,2014,12,5,12,-4,-1,10,250,21
19,2014,12,5,18,-4,-2,27,250,23
20,2014,12,6,0,-5,-4,14,250,22
21,2014,12,6,6,-5,-4,10,270,19
22,2014,12,6,12,-3,-2,27,280,17
23,2014,12,6,18,-2,-2,14,270,15
24,2014,12,7,0,-2,-1,14,260,15
25,2014,12,7,6,-1,0,27,270,13
26,2014,12,7,12,0,0,10,270,10
27,2014,12,7,18,0,0,14,260,15
28,2014,12,8,0,-1,0,14,260,13
29,2014,12,8,6,-1,-1,10,260,19
30,2014,12,8,12,-1,-1,10,270,19
31,2014,12,8,18,-1,-1,14,280,16
32,2014,12,9,0,-1,0,14,280,9
33,2014,12,9,6,0,0,10,330,7
34,2014,12,9,12,-1,1,9,260,7
35,2014,12,9,18,-1,0,14,270,7
36,2014,12,10,0,-3,-1,14,280,7
37,2014,12,10,6,-3,-2,10,260,9
38,2014,12,10,12,-4,-3,10,260,11
39,2014,12,10,18,-6,-4,14,260,17
40,2014,12,11,0,-6,-4,14,270,18
41,2014,12,11,6,-4,-2,14,260,17
42,2014,12,11,12,-2,-2,10,270,14
43,2014,12,11,18,-2,-1,14,270,17
44,2014,12,12,0,-1,-1,14,260,17
45,2014,12,12,6,-1,0,10,280,16
46,2014,12,12,12,0,1,9,290,16
47,2014,12,12,18,1,2,19,270,27
48,2014,12,13,0,2,2,34,280,32
49,2014,12,13,6,2,4,6,300,26
50,2014,12,13,12,3,4,6,330,25
51,2014,12,13,18,1,3,17,310,20
52,2014,12,14,0,1,1,17,300,18
53,2014,12,14,6,-1,1,6,300,14
54,2014,12,14,12,1,2,6,320,13
55,2014,12,14,18,0,1,17,290,9
56,2014,12,15,0,-1,0,17,240,9
57,2014,12,15,6,0,1,9,230,11
58,2014,12,15,12,1,2,9,280,15
59,2014,12,15,18,2,4,34,280,15
60,2014,12,16,0,4,4,14,300,16
61,2014,12,16,6,3,4,9,280,8
62,2014,12,16,12,4,4,18,280,14
63,2014,12,16,18,3,4,34,260,15
64,2014,12,17,0,3,4,34,270,12
65,2014,12,17,6,3,4,19,280,11
66,2014,12,17,12,1,3,6,310,17
67,2014,12,17,18,1,2,34,320,21
68,2014,12,18,0,0,1,17,290,19
69,2014,12,18,6,0,0,10,270,17
70,2014,12,18,12,1,1,9,270,15
71,2014,12,18,18,1,1,14,300,17
72,2014,12,19,0,2,4,34,280,24
73,2014,12,19,6,5,9,18,320,24
74,2014,12,19,12,8,10,6,330,19
75,2014,12,19,18,7,10,34,350,18
76,2014,12,20,0,4,7,14,350,23
77,2014,12,20,6,3,4,6,330,25
78,2014,12,20,12,2,4,6,310,26
79,2014,12,20,18,2,3,17,300,27
80,2014,12,21,0,1,2,29,320,18
81,2014,12,21,6,1,1,9,360,16
82,2014,12,21,12,0,2,6,360,16
83,2014,12,21,18,0,1,15,350,14
84,2014,12,22,0,0,0,29,310,15
85,2014,12,22,6,0,1,18,300,19
86,2014,12,22,12,1,3,18,300,19
87,2014,12,22,18,4,6,14,360,21
88,2014,12,23,0,5,6,15,360,24
89,2014,12,23,6,4,4,33,370,21
90,2014,12,23,12,4,5,33,360,19
91,2014,12,23,18,4,5,17,360,21
92,2014,12,24,0,3,4,17,360,21
93,2014,12,24,6,3,4,6,350,13
94,2014,12,24,12,0,4,7,270,16
95,2014,12,24,18,0,7,19,340,24
96,2014,12,25,0,2,5,17,360,30
97,2014,12,25,6,-1,2,6,390,21
98,2014,12,25,12,-4,0,33,420,17
99,2014,12,25,18,-7,-4,14,90,16
100,2014,12,26,0,-9,-6,14,90,11
101,2014,12,26,6,-11,-6,1,90,4
102,2014,12,26,12,-8,-5,1,340,6
103,2014,12,26,18,-11,-8,14,260,6
104,2014,12,27,0,-12,-10,14,270,8
105,2014,12,27,6,-13,-8,1,270,6
106,2014,12,27,12,-10,-7,6,260,7
107,2014,12,27,18,-10,-9,14,210,5
108,2014,12,28,0,-9,-8,14,230,4
109,2014,12,28,6,-9,-8,10,90,4
110,2014,12,28,12,-10,-9,10,90,6
111,2014,12,28,18,-10,-10,29,400,5
112,2014,12,29,0,-10,-10,29,100,8
113,2014,12,29,6,-12,-9,10,100,12
114,2014,12,29,12,-9,-8,29,90,16
115,2014,12,29,18,-10,-9,29,100,19
116,2014,12,30,0,-10,-10,29,100,15
117,2014,12,30,6,-11,-9,29,90,7
118,2014,12,30,12,-11,-10,6,360,10
119,2014,12,30,18,-12,-10,13,280,19
120,2014,12,31,0,-10,-9,17,290,24
121,2014,12,31,6,-9,-5,30,300,24
122,2014,12,31,12,-5,-2,27,320,20
123,2014,12,31,18,-2,0,27,330,12
